[
    {
      "id": 1,
      "icon": "newspaper",
      "textBold": "Paginas simples personalizables",
      "text": "Ofrecemos tres opciones personalizables que se ajustarán a su pagina deseada."
    },
    {
      "id": 2,
      "icon": "gear",
      "textBold": "Produccion de Software",
      "text": "Generamos la solucion que esta buscando desde el desarrollo de software para su empresa."
    },
    {
      "id": 3,
      "icon": "gears",
      "textBold": "Nuestros productos de Software",
      "text": "Estamos en desarrollo de productos informaticos con el fin de provocar un impacto positivo a nivel global."
    },
    {
      "id": 4,
      "icon": "bug",
      "textBold": "Servicio de Testing",
      "text": "Si ya esta desarrollando un software tenemos equipos especializados en el aseguramiento de calidad que acompañara las etapas de desarrollo de su producto para mejorar el impacto de su producto."
    }
]