<?xml version="1.0" standalone="no"?>
<!DOCTYPE svg PUBLIC "-//W3C//DTD SVG 1.1//EN" "http://www.w3.org/Graphics/SVG/1.1/DTD/svg11.dtd" >
<svg xmlns="http://www.w3.org/2000/svg" xmlns:xlink="http://www.w3.org/1999/xlink" version="1.1">
<metadata></metadata>
<defs>
<font id="ge_ss_twomedium" horiz-adv-x="907" >
<font-face units-per-em="2048" ascent="1638" descent="-410" />
<missing-glyph horiz-adv-x="491" />
<glyph horiz-adv-x="0" />
<glyph horiz-adv-x="682" />
<glyph unicode=" "  horiz-adv-x="491" />
<glyph unicode="&#x09;" horiz-adv-x="491" />
<glyph unicode="&#xa0;" horiz-adv-x="491" />
<glyph unicode="!" horiz-adv-x="471" d="M74 0h248v260h-248v-260zM74 823q0 -1 22 -164l47 -327h107l47 327l14 82q11 57 11 82v510h-248v-510z" />
<glyph unicode="&#x22;" horiz-adv-x="514" d="M43 1405l55 -557h62l51 557h-168zM299 1405l55 -557h62l51 557h-168z" />
<glyph unicode="$" horiz-adv-x="1177" d="M66 72q197 -126 491 -156v-231h90v231q463 46 463 412q0 180 -154 272q-83 50 -309 102v320q75 -9 152 -39q53 -20 125 -55l127 151q-196 117 -404 138v221h-92v-219q-211 -21 -315 -93q-134 -96 -134 -301q0 -264 451 -352v-354q-179 15 -356 110zM348 868q0 82 68 117 q50 24 141 35v-303q-98 22 -135 41q-74 38 -74 110zM647 119v336q223 -30 223 -152q0 -90 -71 -137q-41 -25 -152 -47z" />
<glyph unicode="'" horiz-adv-x="258" d="M43 1405l55 -557h62l51 557h-168z" />
<glyph unicode="(" horiz-adv-x="634" d="M72 596q0 -515 434 -872q31 -23 45 -33l84 110q-155 125 -244 344q-88 216 -88 471q0 379 184 633q49 69 144 166l-86 96q-160 -121 -273 -274q-200 -280 -200 -641z" />
<glyph unicode=")" horiz-adv-x="753" d="M127 -213l88 -96q171 131 270 272q203 286 203 641q0 369 -219 656q-90 116 -215 217q-41 31 -43 34l-84 -112q156 -126 242 -344q88 -216 88 -469q0 -378 -187 -635q-47 -65 -143 -164z" />
<glyph unicode="*" horiz-adv-x="700" d="M66 274l227 15l-129 -197l92 -59l94 221l101 -211l96 49l-135 199l223 -12v100l-227 -23l129 195l-88 59l-99 -225l-94 225l-96 -61l131 -195l-225 25v-105z" />
<glyph unicode="+" horiz-adv-x="1302" d="M143 492h392v-408h229v408h395v194h-395v410h-229v-410h-392v-194z" />
<glyph unicode="-" d="M143 471h621v205h-621v-205z" />
<glyph unicode="." horiz-adv-x="423" d="M51 0h250v258h-250v-258z" />
<glyph unicode="/" horiz-adv-x="858" d="M0 0h225l633 1333h-225z" />
<glyph unicode="0" horiz-adv-x="573" d="M143 354l287 -143v317l-287 142v-316z" />
<glyph unicode="1" horiz-adv-x="514" d="M143 0h228v1294l-228 -166v-1128z" />
<glyph unicode="2" horiz-adv-x="1077" d="M143 0h228v688q0 165 84 293q95 141 258 141h221v201q-102 -2 -221 -2q-151 0 -261.5 -53.5t-177.5 -155t-99 -237.5t-32 -310v-565z" />
<glyph unicode="3" horiz-adv-x="1163" d="M143 0h228v739h284q186 0 301 86q131 98 131 281v207h-221v-154q0 -52 -2 -80.5t-12.5 -63.5t-30.5 -52.5t-57.5 -30t-93.5 -12.5q19 7 33 23.5t20.5 33.5t9.5 45.5t3.5 42.5t0.5 41v207h-180v-154q0 -47 -3.5 -77t-14.5 -58t-31 -43t-54 -24t-83 -9v365h-228v-1313z" />
<glyph unicode="4" horiz-adv-x="1015" d="M100 375q0 -165 126 -270t319 -105h370v190h-370q-95 0 -154 56.5t-59 148.5q0 103 58 161t155 58h119v154h-111q-79 0 -135 51t-56 125q0 89 48.5 141t142.5 52h317v184h-356q-169 0 -276 -88t-107 -232q0 -245 250 -319q-281 -53 -281 -307z" />
<glyph unicode="5" horiz-adv-x="1138" d="M92 578q0 -232 126.5 -365t346.5 -133q217 0 343 137t126 363q0 211 -200 426q-162 174 -277 215q-104 -39 -268 -224q-197 -226 -197 -419zM315 571q0 103 82 243.5t162 182.5q55 -30 112 -103.5t93.5 -163t36.5 -159.5q0 -131 -66 -207.5t-176 -76.5q-113 0 -178.5 76 t-65.5 208z" />
<glyph unicode="6" horiz-adv-x="1077" d="M143 1122v201q102 -2 222 -2q151 0 261.5 -53.5t177 -155t98.5 -237.5t32 -310v-565h-227v688q0 165 -84 293q-95 141 -258 141h-222z" />
<glyph unicode="7" horiz-adv-x="1124" d="M102 1321l314 -1321h299l307 1321h-250l-201 -1067l-235 1067h-234z" />
<glyph unicode="8" horiz-adv-x="1124" d="M102 0h234l235 1069l201 -1069h250l-307 1321h-299z" />
<glyph unicode="9" horiz-adv-x="1142" d="M82 864q0 -214 106 -344q121 -145 344 -145q150 0 242 108v-483h225v858q0 197 -133 330t-334 133q-199 0 -325 -129q-125 -125 -125 -328zM330 850q0 110 51 178q60 84 162 84q103 0 168 -86q55 -76 55 -184q0 -105 -51 -176q-60 -84 -162 -84t-168 84q-55 76 -55 184z " />
<glyph unicode=":" horiz-adv-x="444" d="M51 0h250v258h-250v-258zM51 449h250v260h-250v-260z" />
<glyph unicode="&#x3c;" horiz-adv-x="1110" d="M254 477l479 -477h244l-479 477l479 479h-244z" />
<glyph unicode="=" horiz-adv-x="1220" d="M113 279h993v198h-993v-198zM113 668h993v196h-993v-196z" />
<glyph unicode="&#x3e;" horiz-adv-x="1110" d="M154 -20h223l479 477l-479 479h-223l479 -479z" />
<glyph unicode="[" horiz-adv-x="520" d="M66 -272h387v137h-183v1468h183v137h-387v-1742z" />
<glyph unicode="\" horiz-adv-x="980" d="M57 1333l633 -1333h223l-632 1333h-224z" />
<glyph unicode="]" horiz-adv-x="520" d="M66 -133v-139h387v1742h-387v-135h184v-1468h-184z" />
<glyph unicode="_" horiz-adv-x="782" d="M33 -33v-172h715v172h-715z" />
<glyph unicode="{" horiz-adv-x="768" d="M74 592q172 -112 172 -205v-414q0 -137 88 -198q80 -68 291 -68l59 4q2 10 2 35t-2 33q-172 2 -239.5 42.5t-55.5 151.5v414q0 111 -147 205q72 56 109.5 109t37.5 94v413q0 123 62 160q55 43 231 43v19q0 39 -4 59q-232 0 -332 -65.5t-100 -215.5v-413q0 -61 -43 -115 q-41 -54 -125 -88h-4z" />
<glyph unicode="|" horiz-adv-x="270" d="M70 -289h129v1774h-129v-1774z" />
<glyph unicode="}" horiz-adv-x="768" d="M72 -254q0 25 2 33q172 2 239.5 42.5t55.5 151.5v414q0 111 147 205q-72 56 -109.5 109t-37.5 94v413q0 123 -62 160q-55 43 -231 43v19q0 39 4 59q232 0 332 -65.5t100 -215.5v-413q0 -61 43 -115q41 -54 125 -88h4q-172 -112 -172 -205v-414q0 -137 -88 -198 q-80 -68 -291 -68l-59 4q-2 10 -2 35z" />
<glyph unicode="&#xab;" horiz-adv-x="743" d="M59 383q0 -222 201 -387l82 72q-75 85 -98 137q-33 65 -33 168q0 191 131 307l-78 78q-205 -150 -205 -375zM358 383q0 -223 203 -387l80 72q-74 87 -96 137q-33 65 -33 168q0 190 129 307l-76 78q-207 -151 -207 -375z" />
<glyph unicode="&#xad;" d="M143 471h621v205h-621v-205z" />
<glyph unicode="&#xbb;" horiz-adv-x="833" d="M184 68l82 -72q203 164 203 387q0 224 -207 375l-78 -78q131 -116 131 -307q0 -105 -32 -168q-22 -50 -99 -137zM485 68l82 -72q199 163 199 387q0 225 -203 375l-78 -78q129 -117 129 -307q0 -101 -30 -168q-24 -49 -99 -137z" />
<glyph unicode="&#xd7;" horiz-adv-x="1093" d="M143 289l133 -139l271 290l272 -290l131 139l-272 291l272 290l-131 140l-272 -291l-271 291l-133 -140l273 -290z" />
<glyph unicode="&#xf7;" horiz-adv-x="1355" d="M143 485h1069v211h-1069v-211zM563 117h228v254h-228v-254zM563 811h230v254h-230v-254z" />
<glyph unicode="&#x2000;" horiz-adv-x="755" />
<glyph unicode="&#x2001;" horiz-adv-x="1511" />
<glyph unicode="&#x2002;" horiz-adv-x="755" />
<glyph unicode="&#x2003;" horiz-adv-x="1511" />
<glyph unicode="&#x2004;" horiz-adv-x="503" />
<glyph unicode="&#x2005;" horiz-adv-x="377" />
<glyph unicode="&#x2006;" horiz-adv-x="251" />
<glyph unicode="&#x2007;" horiz-adv-x="251" />
<glyph unicode="&#x2008;" horiz-adv-x="188" />
<glyph unicode="&#x2009;" horiz-adv-x="302" />
<glyph unicode="&#x200a;" horiz-adv-x="83" />
<glyph unicode="&#x2010;" d="M143 471h621v205h-621v-205z" />
<glyph unicode="&#x2011;" d="M143 471h621v205h-621v-205z" />
<glyph unicode="&#x2012;" d="M143 471h621v205h-621v-205z" />
<glyph unicode="&#x2013;" horiz-adv-x="1310" d="M143 471h1024v205h-1024v-205z" />
<glyph unicode="&#x2014;" horiz-adv-x="2334" d="M143 471h2048v205h-2048v-205z" />
<glyph unicode="&#x201c;" horiz-adv-x="546" d="M70 938h163v147q-60 -3 -63 52q-3 99 96 188h-51q-145 -133 -145 -221v-166zM289 938h164v147q-61 -3 -64 52q-3 99 96 188h-53q-143 -131 -143 -221v-166z" />
<glyph unicode="&#x201d;" horiz-adv-x="546" d="M70 938h51q145 133 145 219v168h-162v-149q61 3 64 -52q3 -98 -98 -186zM289 938h51q145 133 145 219v168h-161v-149q61 3 61 -52q3 -97 -96 -186z" />
<glyph unicode="&#x202f;" horiz-adv-x="302" />
<glyph unicode="&#x205f;" horiz-adv-x="377" />
<glyph unicode="&#x25fc;" horiz-adv-x="1024" d="M0 0z" />
</font>
</defs></svg> 