{
  "type": "service_account",
  "project_id": "les-fauconniers",
  "private_key_id": "3df880f12caef1ae42fcb57e20dc32725992e359",
  "private_key": "-----BEGIN PRIVATE KEY-----\nMIIEvwIBADANBgkqhkiG9w0BAQEFAASCBKkwggSlAgEAAoIBAQDiG7YeswoqhsPc\n8plSSoynbjVV5gViIhpja+BbNEAW3iVztrgqRDV3aRvqXJq/SyivcrkEni/3fzNX\nUhQx7/WFjYfOgjG5KDhFAIpqoSC6HSZGGz2n3Hpq09PQgnW2d08WdoWqGPuLbJM6\nfFZt+avT1pGySBd3zXWJ3qikcdrk/aVnZLgzRZXuF42zEcOu2ZMp7CJRQx9HDUWc\nZtloCZWaam9GSSNITJnJbx4M5ujdJKJ6uE3NqSGyXmWPpvXTzDzjoTNh/80yLw+b\nUgByx7QBx59d9anlvu1+GwxzYQNyYhtdI5E4PnAGGevF3u7paVeTJkSWBeKkWTPa\nA1NUyjhNAgMBAAECggEAHJo0I+wIHtsPZHV35GCz1uuVFE8AYqqSZf3xJ/hocbwb\nnBNYIVihiX/NXTc7ssks1gzlehUSAkqf/FgmCoR4At36zlUf5HPsXPuK3EmSXJjF\nYlxIegyPm9CSBzAJo1GyZSgMaTkMe6r6G42RArZxAF+F7LnmkMF32z9EXBEJsf+7\nNiCfU9SiXZqUfYuGm9jkfG7IfBLgx+POykqC7Qr0PecPKcjzaTrgchaRKzidd4K/\nu9Z9xEoXfLNw41XSShIp7BHD3dqpu8q2573z7/KftOHwXhncFeuziFG/L7gURnOd\nulQkXJc6ugFDECwlxj0WaGdr2cbD7pvBI+0ve6GPbQKBgQD3itMd9kpV2pd8Q6iO\n1KeLOjGwD7V6Xp1NPedxA6RKhN0Ur8W8P9wyHGQ0a7sJDBFH5Xy0qe/UdZKEuWTE\n7gW1ncadndTog/RuU+dCIHRlRz5qmx5fD1BpOTA95P4OVbTR0pGoFNG9g1tN/S1s\nDZHGx0uHrjc3KixG1tRdNFe/EwKBgQDp1WjuPzS4kf528Se3iE78S5DAX/qUpunx\ncvi/IBrFzZgRJB9WSnCe8NUqEi0EIyApRWcb7jwiUlTxmd4Xf1r3MWaarXRzRxFi\nci3Ozc4LAUK2DTjoDRWcgkQNmPBn1TxbIki/HAv5MlMqGLdBoTI3uaFwRwfLmc48\nqPwxhg83HwKBgQDwbhAb2+nbdZMJCRYglH+fBQjZvog/sMIMEgJHjIf4MRAiVY8z\nBruymEzjdXeWk/f84vK67wuYShHjg8ZSV/WHrxUIZhIzPGce+bN2UNt8uzPui3d2\nUQODEB7BHzd7aNdVrLX4kTAeaAU4vJ1vg8aBUXUU9at/kyCqNWLSnFJVrQKBgQCd\npLG8RUJu2IY8e/JxymSttOgeudY+15TKod9PQv6psiS+EaNK0p7AmM6tMVnF+0RY\nbqDH9MH3xZfc1gYjw0l5c4Wf7Cag/R2cSCvXy2oIg04NXDasQv356NymaiBRcDHj\nouZ2aRstYp8st0L87QblCLHs9wYrXkLrJGX5oU6qswKBgQDbwHB+TObsuqoSVHt5\nqitz4tbVEwQXObE7WpNz3RmfIrqZ4BcJujKwBkt4zGnoQYMYbXyuWzIF5ZGKd6ru\n4bgllzQfmtbIMQaN5p9n7cFS1KiwHvovnfAXt0PznB8NCXApL6VVLhqhRjqUv+Bz\nEcTbyQowegmgZ3GV2pfEpoZuxg==\n-----END PRIVATE KEY-----\n",
  "client_email": "firebase-adminsdk-euuo3@les-fauconniers.iam.gserviceaccount.com",
  "client_id": "108660211091206860897",
  "auth_uri": "https://accounts.google.com/o/oauth2/auth",
  "token_uri": "https://oauth2.googleapis.com/token",
  "auth_provider_x509_cert_url": "https://www.googleapis.com/oauth2/v1/certs",
  "client_x509_cert_url": "https://www.googleapis.com/robot/v1/metadata/x509/firebase-adminsdk-euuo3%40les-fauconniers.iam.gserviceaccount.com"
}
