{
  "$schema": "https://docs.renovatebot.com/renovate-schema.json",
  "extends": ["github>renovatebot/.github"],
  "platformAutomerge": true,
  "prCreation": "immediate",
  "packageRules": [
    {
      "description": "Trigger breaking release for major updates",
      "matchPackageNames": [
        "renovate/renovate",
        "ghcr.io/renovatebot/renovate"
      ],
      "matchUpdateTypes": ["major"],
      "semanticCommitType": "feat",
      "commitBody": "BREAKING CHANGE: Major update",
      "automergeType": "pr"
    },
    {
      "description": "Trigger feature release for minor updates",
      "matchPackageNames": [
        "renovate/renovate",
        "ghcr.io/renovatebot/renovate"
      ],
      "matchUpdateTypes": ["minor"],
      "semanticCommitType": "feat",
      "automergeType": "pr"
    },
    {
      "description": "Trigger fix release for patch updates",
      "matchPackageNames": [
        "renovate/renovate",
        "ghcr.io/renovatebot/renovate"
      ],
      "matchUpdateTypes": ["patch", "digest"],
      "semanticCommitType": "fix",
      "automergeType": "pr"
    },
    {
      "description": "Allow updates after 3 days (exclude renovate)",
      "excludePackageNames": [
        "renovate/renovate",
        "ghcr.io/renovatebot/renovate"
      ],
      "separateMinorPatch": true,
      "minimumReleaseAge": "3 days"
    },
    {
      "description": "Schedule digest updates daily",
      "matchUpdateTypes": ["digest"],
      "extends": ["schedule:daily"]
    },
    {
      "matchPackageNames": ["ghcr.io/containerbase/node"],
      "versioning": "node"
    },
    {
      "description": "Full image is sometimes behind, so we need to force a new MR",
      "matchPackageNames": [
        "renovate/renovate",
        "ghcr.io/renovatebot/renovate"
      ],
      "matchUpdateTypes": ["major", "minor", "patch"],
      "recreateWhen": "always"
    }
  ],
  "customManagers": [
    {
      "customType": "regex",
      "description": "Update docker references in gitlab variables",
      "fileMatch": ["\\.gitlab-ci\\.yml$"],
      "matchStrings": [
        "CI_RENOVATE_IMAGE[A-Z_]*\\s*:\\s*(?<depName>[^:]+?):(?<currentValue>[a-z0-9.-]+)(?:@(?<currentDigest>sha256:[a-f0-9]+))?"
      ],
      "datasourceTemplate": "docker",
      "versioningTemplate": "docker"
    }
  ],
  "gitlabci": {
    "fileMatch": ["\\.gitlab-ci\\.yml$"],
    "pinDigests": true
  }
}
