<svg width="24" height="24" viewBox="0 0 24 24" fill="none" xmlns="http://www.w3.org/2000/svg">
<path d="M5 11.9994C5 12.7905 5.2346 13.5639 5.67412 14.2217C6.11365 14.8795 6.73836 15.3922 7.46927 15.6949C8.20017 15.9977 9.00444 16.0769 9.78036 15.9225C10.5563 15.7682 11.1569 15.4994 11.8284 14.8278L20.5 6.15625" stroke="#926247" stroke-width="2" stroke-linejoin="round"/>
</svg>
