fr\levitt\tp4\tp4web\cache\CustomCache.class
fr\levitt\tp4\tp4web\configuration\CustomObjectMapper.class
fr\levitt\tp4\tp4web\core\Departure.class
fr\levitt\tp4\tp4web\dao\GareRepository.class
fr\levitt\tp4\tp4web\core\Gares.class
fr\levitt\tp4\tp4web\core\Train.class
fr\levitt\tp4\tp4web\cache\NoOPCache.class
fr\levitt\tp4\tp4web\Tp4WebApplication.class
fr\levitt\tp4\tp4web\controller\HelloController.class
fr\levitt\tp4\tp4web\service\GareService.class
fr\levitt\tp4\tp4web\service\GareServiceMock.class
fr\levitt\tp4\tp4web\cache\FileCache.class
fr\levitt\tp4\tp4web\core\Gare.class
fr\levitt\tp4\tp4web\service\GareServiceImpl.class
fr\levitt\tp4\tp4web\core\DisplayInformation.class
fr\levitt\tp4\tp4web\cache\MemoryCache.class
fr\levitt\tp4\tp4web\core\TableauAffichage.class
