[
  {
    "rank": 1,
    "username": "tiangolo",
    "name": "Sebastián Ramírez",
    "url": "https://github.com/tiangolo",
    "avatar": "https://avatars.githubusercontent.com/u/1326112?s=96&v=4",
    "since": "daily",
    "popularRepository": {
      "repositoryName": "fastapi",
      "description": "FastAPI framework, high performance, easy to learn, fast to code, ready for production",
      "url": "https://github.com/tiangolo/fastapi"
    }
  },
  {
    "rank": 2,
    "username": "appleboy",
    "name": "Bo-Yi Wu",
    "url": "https://github.com/appleboy",
    "avatar": "https://avatars.githubusercontent.com/u/21979?s=96&v=4",
    "since": "daily",
    "popularRepository": {
      "repositoryName": "ssh-action",
      "description": "GitHub Actions for executing remote ssh commands.",
      "url": "https://github.com/appleboy/ssh-action"
    }
  },
  {
    "rank": 3,
    "username": "guybedford",
    "name": "Guy Bedford",
    "url": "https://github.com/guybedford",
    "avatar": "https://avatars.githubusercontent.com/u/598730?s=96&v=4",
    "since": "daily",
    "popularRepository": {
      "repositoryName": "es-module-shims",
      "description": "Shims for new ES modules features on basic modules support in browsers",
      "url": "https://github.com/guybedford/es-module-shims"
    }
  },
  {
    "rank": 4,
    "username": "antfu",
    "name": "Anthony Fu",
    "url": "https://github.com/antfu",
    "avatar": "https://avatars.githubusercontent.com/u/11247099?s=96&v=4",
    "since": "daily",
    "popularRepository": {
      "repositoryName": "vitesse",
      "description": "🏕Opinionated Vite Starter Template",
      "url": "https://github.com/antfu/vitesse"
    }
  },
  {
    "rank": 5,
    "username": "kyazdani42",
    "name": "Kiyan",
    "url": "https://github.com/kyazdani42",
    "avatar": "https://avatars.githubusercontent.com/u/23156099?s=96&v=4",
    "since": "daily",
    "popularRepository": {
      "repositoryName": "nvim-tree.lua",
      "description": "A file explorer tree for neovim written in lua",
      "url": "https://github.com/kyazdani42/nvim-tree.lua"
    }
  },
  {
    "rank": 6,
    "username": "davidpdrsn",
    "name": "David Pedersen",
    "url": "https://github.com/davidpdrsn",
    "avatar": "https://avatars.githubusercontent.com/u/718941?s=96&v=4",
    "since": "daily",
    "popularRepository": {
      "repositoryName": "juniper-from-schema",
      "description": "Schema first GraphQL in Rust with Juniper",
      "url": "https://github.com/davidpdrsn/juniper-from-schema"
    }
  },
  {
    "rank": 7,
    "username": "hanxiao",
    "name": "Han Xiao",
    "url": "https://github.com/hanxiao",
    "avatar": "https://avatars.githubusercontent.com/u/2041322?s=96&v=4",
    "since": "daily",
    "popularRepository": {
      "repositoryName": "bert-as-service",
      "description": "Mapping a variable-length sentence to a fixed-length vector using BERT model",
      "url": "https://github.com/hanxiao/bert-as-service"
    }
  },
  {
    "rank": 8,
    "username": "jkterry1",
    "name": "J K Terry",
    "url": "https://github.com/jkterry1",
    "avatar": "https://avatars.githubusercontent.com/u/19422700?s=96&v=4",
    "since": "daily",
    "popularRepository": {
      "repositoryName": "maddpg-rllib",
      "description": "MADDPG in Ray/RLlib",
      "url": "https://github.com/jkterry1/maddpg-rllib"
    }
  },
  {
    "rank": 9,
    "username": "imaNNeoFighT",
    "name": "Iman khoshabi",
    "url": "https://github.com/imaNNeoFighT",
    "avatar": "https://avatars.githubusercontent.com/u/7009300?s=96&v=4",
    "since": "daily",
    "popularRepository": {
      "repositoryName": "fl_chart",
      "description": "A powerful Flutter chart library, currently supporting Line Chart, Bar Chart, Pie Chart, Scatter Chart and Radar Chart.",
      "url": "https://github.com/imaNNeoFighT/fl_chart"
    }
  },
  {
    "rank": 10,
    "username": "extrawurst",
    "name": "Stephan Dilly",
    "url": "https://github.com/extrawurst",
    "avatar": "https://avatars.githubusercontent.com/u/776816?s=96&v=4",
    "since": "daily",
    "popularRepository": {
      "repositoryName": "gitui",
      "description": "Blazing💥fast terminal-ui for git written in rust🦀",
      "url": "https://github.com/extrawurst/gitui"
    }
  },
  {
    "rank": 11,
    "username": "lemire",
    "name": "Daniel Lemire",
    "url": "https://github.com/lemire",
    "avatar": "https://avatars.githubusercontent.com/u/391987?s=96&v=4",
    "since": "daily",
    "popularRepository": {
      "repositoryName": "fastrange",
      "description": "A fast alternative to the modulo reduction",
      "url": "https://github.com/lemire/fastrange"
    }
  },
  {
    "rank": 12,
    "username": "arvidn",
    "name": "Arvid Norberg",
    "url": "https://github.com/arvidn",
    "avatar": "https://avatars.githubusercontent.com/u/661450?s=96&v=4",
    "since": "daily",
    "popularRepository": {
      "repositoryName": "libtorrent",
      "description": "an efficient feature complete C++ bittorrent implementation",
      "url": "https://github.com/arvidn/libtorrent"
    }
  },
  {
    "rank": 13,
    "username": "iddan",
    "name": "Iddan Aaronsohn",
    "url": "https://github.com/iddan",
    "avatar": "https://avatars.githubusercontent.com/u/12671072?s=96&v=4",
    "since": "daily",
    "popularRepository": {
      "repositoryName": "plot-react",
      "description": "React wrapper for @observablehq/plot",
      "url": "https://github.com/iddan/plot-react"
    }
  },
  {
    "rank": 14,
    "username": "apsdehal",
    "name": "Amanpreet Singh",
    "url": "https://github.com/apsdehal",
    "avatar": "https://avatars.githubusercontent.com/u/3616806?s=96&v=4",
    "since": "daily",
    "popularRepository": {
      "repositoryName": "awesome-ctf",
      "description": "A curated list of CTF frameworks, libraries, resources and softwares",
      "url": "https://github.com/apsdehal/awesome-ctf"
    }
  },
  {
    "rank": 15,
    "username": "sindresorhus",
    "name": "Sindre Sorhus",
    "url": "https://github.com/sindresorhus",
    "avatar": "https://avatars.githubusercontent.com/u/170270?s=96&v=4",
    "since": "daily",
    "popularRepository": {
      "repositoryName": "awesome",
      "description": "😎Awesome lists about all kinds of interesting topics",
      "url": "https://github.com/sindresorhus/awesome"
    }
  },
  {
    "rank": 16,
    "username": "ariya",
    "name": "Ariya Hidayat",
    "url": "https://github.com/ariya",
    "avatar": "https://avatars.githubusercontent.com/u/7288?s=96&v=4",
    "since": "daily",
    "popularRepository": {
      "repositoryName": "phantomjs",
      "description": "Scriptable Headless Browser",
      "url": "https://github.com/ariya/phantomjs"
    }
  },
  {
    "rank": 17,
    "username": "seanmonstar",
    "name": "Sean McArthur",
    "url": "https://github.com/seanmonstar",
    "avatar": "https://avatars.githubusercontent.com/u/51479?s=96&v=4",
    "since": "daily",
    "popularRepository": {
      "repositoryName": "warp",
      "description": "A super-easy, composable, web server framework for warp speeds.",
      "url": "https://github.com/seanmonstar/warp"
    }
  },
  {
    "rank": 18,
    "username": "crazy-max",
    "name": "CrazyMax",
    "url": "https://github.com/crazy-max",
    "avatar": "https://avatars.githubusercontent.com/u/1951866?s=96&v=4",
    "since": "daily",
    "popularRepository": {
      "repositoryName": "WindowsSpyBlocker",
      "description": "Block spying and tracking on Windows",
      "url": "https://github.com/crazy-max/WindowsSpyBlocker"
    }
  },
  {
    "rank": 19,
    "username": "jorgecarleitao",
    "name": "Jorge Leitao",
    "url": "https://github.com/jorgecarleitao",
    "avatar": "https://avatars.githubusercontent.com/u/2772607?s=96&v=4",
    "since": "daily",
    "popularRepository": {
      "repositoryName": "arrow2",
      "description": "Unofficial transmute-free Rust library to work with the Arrow format",
      "url": "https://github.com/jorgecarleitao/arrow2"
    }
  },
  {
    "rank": 20,
    "username": "dtolnay",
    "name": "David Tolnay",
    "url": "https://github.com/dtolnay",
    "avatar": "https://avatars.githubusercontent.com/u/1940490?s=96&v=4",
    "since": "daily",
    "popularRepository": {
      "repositoryName": "inherent",
      "description": "Make trait methods callable without the trait in scope",
      "url": "https://github.com/dtolnay/inherent"
    }
  },
  {
    "rank": 21,
    "username": "rougier",
    "name": "Nicolas P. Rougier",
    "url": "https://github.com/rougier",
    "avatar": "https://avatars.githubusercontent.com/u/327203?s=96&v=4",
    "since": "daily",
    "popularRepository": {
      "repositoryName": "numpy-100",
      "description": "100 numpy exercises (with solutions)",
      "url": "https://github.com/rougier/numpy-100"
    }
  },
  {
    "rank": 22,
    "username": "carlmontanari",
    "name": "Carl Montanari",
    "url": "https://github.com/carlmontanari",
    "avatar": "https://avatars.githubusercontent.com/u/8515611?s=96&v=4",
    "since": "daily",
    "popularRepository": {
      "repositoryName": "scrapli",
      "description": "Fast, flexible, sync/async, Python 3.6+ screen scraping client specifically for network devices",
      "url": "https://github.com/carlmontanari/scrapli"
    }
  },
  {
    "rank": 23,
    "username": "colinhacks",
    "name": "Colin McDonnell",
    "url": "https://github.com/colinhacks",
    "avatar": "https://avatars.githubusercontent.com/u/3084745?s=96&v=4",
    "since": "daily",
    "popularRepository": {
      "repositoryName": "zod",
      "description": "TypeScript-first schema validation with static type inference",
      "url": "https://github.com/colinhacks/zod"
    }
  },
  {
    "rank": 24,
    "username": "JakeWharton",
    "name": "Jake Wharton",
    "url": "https://github.com/JakeWharton",
    "avatar": "https://avatars.githubusercontent.com/u/66577?s=96&v=4",
    "since": "daily",
    "popularRepository": {
      "repositoryName": "timber",
      "description": "A logger with a small, extensible API which provides utility on top of Android's normal Log class.",
      "url": "https://github.com/JakeWharton/timber"
    }
  },
  {
    "rank": 25,
    "username": "sdispater",
    "name": "Sébastien Eustace",
    "url": "https://github.com/sdispater",
    "avatar": "https://avatars.githubusercontent.com/u/555648?s=96&v=4",
    "since": "daily",
    "popularRepository": {
      "repositoryName": "pendulum",
      "description": "Python datetimes made easy",
      "url": "https://github.com/sdispater/pendulum"
    }
  }
]
