{
    "/frontend/js/app.js": "/frontend/js/app.js?id=35f5ac67b984d64b6656",
    "/admin/js/app.js": "/admin/js/app.js?id=e4f97d81139e66298a70",
    "/frontend/css/app.css": "/frontend/css/app.css?id=dd830286d902035353b5",
    "/frontend/js/plugin.js": "/frontend/js/plugin.js?id=55f0460a01c4f5c6a989"
}
