id,name,model_id:id,group_id:id,perm_read,perm_write,perm_create,perm_unlink
access_crm_stage_allocated_hours,real_estate_crm.crm_stage_allocated_hours,model_crm_stage_allocated_hours,base.group_user,1,1,1,1
access_disqualification_wizard,real_estate_crm.disqualification_wizard,model_disqualification_wizard,base.group_user,1,1,1,1
access_send_message_wizard,real_estate_crm.send_message_wizard,model_send_message_wizard,base.group_user,1,1,1,1
access_crm_stage_next_stage_automation,real_estate_crm.crm_stage_next_stage_automation,model_crm_stage_next_stage_automation,base.group_user,1,1,1,1
access_crm_stage_approval_condition,real_estate_crm.crm_stage_approval_condition,model_crm_stage_approval_condition,base.group_user,1,1,1,1
access_view_logs,real_estate_crm.view_logs,model_view_logs,base.group_user,1,1,1,1
access_crm_stage_populate_field,real_estate_crm.crm_stage_populate_field,model_crm_stage_populate_field,base.group_user,1,1,1,1
access_crm_team_rotations,real_estate_crm.crm_team_rotations,model_crm_team_rotations,base.group_user,1,1,1,1
access_create_approval_request_wizard,access_create_approval_request_wizard,model_create_approval_request_wizard,base.group_user,1,1,1,1
access_create_task_wizard,access_create_task_wizard,model_create_task_wizard,base.group_user,1,1,1,1