id,name,model_id:id,group_id:id,perm_read,perm_write,perm_create,perm_unlink
access_achievement_incentives,commission_system.access_achievement_incentives,model_achievement_incentives,base.group_user,1,1,1,1
access_duration_period,commission_system.access_duration_period,model_duration_period,base.group_user,1,1,1,1
access_sales_commission_history,commission_system.access_sales_commission_history,model_sales_commission_history,base.group_user,1,1,1,1
access_sales_commission_history_details,commission_system.access_sales_commission_history_details,model_sales_commission_history_details,base.group_user,1,1,1,1
access_variables_duration,commission_system.access_variables_duration,model_variables_duration,base.group_user,1,1,1,1
access_variables,commission_system.access_variables,model_variables,base.group_user,1,1,1,1
access_variables_target,commission_system.access_variables_target,model_variables_target,base.group_user,1,1,1,1
