[2021-11-12 10:16:20] local.ERROR: could not find driver (SQL: select * from `users` where `email` = sfs1232@gmail.com and `users`.`deleted_at` is null limit 1) {"exception":"[object] (Illuminate\\Database\\QueryException(code: 0): could not find driver (SQL: select * from `users` where `email` = sfs1232@gmail.com and `users`.`deleted_at` is null limit 1) at /mnt/c/Users/Art/Documents/gitLab/blog/vendor/laravel/framework/src/Illuminate/Database/Connection.php:703)
[stacktrace]
#0 /mnt/c/Users/Art/Documents/gitLab/blog/vendor/laravel/framework/src/Illuminate/Database/Connection.php(663): Illuminate\\Database\\Connection->runQueryCallback()
#1 /mnt/c/Users/Art/Documents/gitLab/blog/vendor/laravel/framework/src/Illuminate/Database/Connection.php(367): Illuminate\\Database\\Connection->run()
#2 /mnt/c/Users/Art/Documents/gitLab/blog/vendor/laravel/framework/src/Illuminate/Database/Query/Builder.php(2351): Illuminate\\Database\\Connection->select()
#3 /mnt/c/Users/Art/Documents/gitLab/blog/vendor/laravel/framework/src/Illuminate/Database/Query/Builder.php(2339): Illuminate\\Database\\Query\\Builder->runSelect()
#4 /mnt/c/Users/Art/Documents/gitLab/blog/vendor/laravel/framework/src/Illuminate/Database/Query/Builder.php(2873): Illuminate\\Database\\Query\\Builder->Illuminate\\Database\\Query\\{closure}()
#5 /mnt/c/Users/Art/Documents/gitLab/blog/vendor/laravel/framework/src/Illuminate/Database/Query/Builder.php(2340): Illuminate\\Database\\Query\\Builder->onceWithColumns()
#6 /mnt/c/Users/Art/Documents/gitLab/blog/vendor/laravel/framework/src/Illuminate/Database/Eloquent/Builder.php(615): Illuminate\\Database\\Query\\Builder->get()
#7 /mnt/c/Users/Art/Documents/gitLab/blog/vendor/laravel/framework/src/Illuminate/Database/Eloquent/Builder.php(599): Illuminate\\Database\\Eloquent\\Builder->getModels()
#8 /mnt/c/Users/Art/Documents/gitLab/blog/vendor/laravel/framework/src/Illuminate/Database/Concerns/BuildsQueries.php(259): Illuminate\\Database\\Eloquent\\Builder->get()
#9 /mnt/c/Users/Art/Documents/gitLab/blog/vendor/laravel/framework/src/Illuminate/Auth/EloquentUserProvider.php(134): Illuminate\\Database\\Eloquent\\Builder->first()
#10 /mnt/c/Users/Art/Documents/gitLab/blog/vendor/laravel/framework/src/Illuminate/Auth/SessionGuard.php(366): Illuminate\\Auth\\EloquentUserProvider->retrieveByCredentials()
#11 /mnt/c/Users/Art/Documents/gitLab/blog/vendor/laravel/framework/src/Illuminate/Auth/AuthManager.php(336): Illuminate\\Auth\\SessionGuard->attempt()
#12 /mnt/c/Users/Art/Documents/gitLab/blog/vendor/laravel/framework/src/Illuminate/Support/Facades/Facade.php(261): Illuminate\\Auth\\AuthManager->__call()
#13 /mnt/c/Users/Art/Documents/gitLab/blog/app/Http/Controllers/API/v1/SessionsController.php(65): Illuminate\\Support\\Facades\\Facade::__callStatic()
#14 /mnt/c/Users/Art/Documents/gitLab/blog/vendor/laravel/framework/src/Illuminate/Routing/ControllerDispatcher.php(48): App\\Http\\Controllers\\API\\v1\\SessionsController->login()
#15 /mnt/c/Users/Art/Documents/gitLab/blog/vendor/laravel/framework/src/Illuminate/Routing/Route.php(262): Illuminate\\Routing\\ControllerDispatcher->dispatch()
#16 /mnt/c/Users/Art/Documents/gitLab/blog/vendor/laravel/framework/src/Illuminate/Routing/Route.php(205): Illuminate\\Routing\\Route->runController()
#17 /mnt/c/Users/Art/Documents/gitLab/blog/vendor/laravel/framework/src/Illuminate/Routing/Router.php(695): Illuminate\\Routing\\Route->run()
#18 /mnt/c/Users/Art/Documents/gitLab/blog/vendor/laravel/framework/src/Illuminate/Pipeline/Pipeline.php(128): Illuminate\\Routing\\Router->Illuminate\\Routing\\{closure}()
#19 /mnt/c/Users/Art/Documents/gitLab/blog/vendor/laravel/framework/src/Illuminate/Routing/Middleware/SubstituteBindings.php(50): Illuminate\\Pipeline\\Pipeline->Illuminate\\Pipeline\\{closure}()
#20 /mnt/c/Users/Art/Documents/gitLab/blog/vendor/laravel/framework/src/Illuminate/Pipeline/Pipeline.php(167): Illuminate\\Routing\\Middleware\\SubstituteBindings->handle()
#21 /mnt/c/Users/Art/Documents/gitLab/blog/vendor/laravel/framework/src/Illuminate/Routing/Middleware/ThrottleRequests.php(127): Illuminate\\Pipeline\\Pipeline->Illuminate\\Pipeline\\{closure}()
#22 /mnt/c/Users/Art/Documents/gitLab/blog/vendor/laravel/framework/src/Illuminate/Routing/Middleware/ThrottleRequests.php(63): Illuminate\\Routing\\Middleware\\ThrottleRequests->handleRequest()
#23 /mnt/c/Users/Art/Documents/gitLab/blog/vendor/laravel/framework/src/Illuminate/Pipeline/Pipeline.php(167): Illuminate\\Routing\\Middleware\\ThrottleRequests->handle()
#24 /mnt/c/Users/Art/Documents/gitLab/blog/vendor/laravel/framework/src/Illuminate/Pipeline/Pipeline.php(103): Illuminate\\Pipeline\\Pipeline->Illuminate\\Pipeline\\{closure}()
#25 /mnt/c/Users/Art/Documents/gitLab/blog/vendor/laravel/framework/src/Illuminate/Routing/Router.php(697): Illuminate\\Pipeline\\Pipeline->then()
#26 /mnt/c/Users/Art/Documents/gitLab/blog/vendor/laravel/framework/src/Illuminate/Routing/Router.php(672): Illuminate\\Routing\\Router->runRouteWithinStack()
#27 /mnt/c/Users/Art/Documents/gitLab/blog/vendor/laravel/framework/src/Illuminate/Routing/Router.php(636): Illuminate\\Routing\\Router->runRoute()
#28 /mnt/c/Users/Art/Documents/gitLab/blog/vendor/laravel/framework/src/Illuminate/Routing/Router.php(625): Illuminate\\Routing\\Router->dispatchToRoute()
#29 /mnt/c/Users/Art/Documents/gitLab/blog/vendor/laravel/framework/src/Illuminate/Foundation/Http/Kernel.php(167): Illuminate\\Routing\\Router->dispatch()
#30 /mnt/c/Users/Art/Documents/gitLab/blog/vendor/laravel/framework/src/Illuminate/Pipeline/Pipeline.php(128): Illuminate\\Foundation\\Http\\Kernel->Illuminate\\Foundation\\Http\\{closure}()
#31 /mnt/c/Users/Art/Documents/gitLab/blog/nova/src/Http/Middleware/ServeNova.php(24): Illuminate\\Pipeline\\Pipeline->Illuminate\\Pipeline\\{closure}()
#32 /mnt/c/Users/Art/Documents/gitLab/blog/vendor/laravel/framework/src/Illuminate/Pipeline/Pipeline.php(167): Laravel\\Nova\\Http\\Middleware\\ServeNova->handle()
#33 /mnt/c/Users/Art/Documents/gitLab/blog/app/Http/Middleware/DeleteEmptyAndNullStrings.php(21): Illuminate\\Pipeline\\Pipeline->Illuminate\\Pipeline\\{closure}()
#34 /mnt/c/Users/Art/Documents/gitLab/blog/vendor/laravel/framework/src/Illuminate/Pipeline/Pipeline.php(167): App\\Http\\Middleware\\DeleteEmptyAndNullStrings->handle()
#35 /mnt/c/Users/Art/Documents/gitLab/blog/app/Http/Middleware/Localization.php(23): Illuminate\\Pipeline\\Pipeline->Illuminate\\Pipeline\\{closure}()
#36 /mnt/c/Users/Art/Documents/gitLab/blog/vendor/laravel/framework/src/Illuminate/Pipeline/Pipeline.php(167): App\\Http\\Middleware\\Localization->handle()
#37 /mnt/c/Users/Art/Documents/gitLab/blog/app/Http/Middleware/ForceApiResponse.php(19): Illuminate\\Pipeline\\Pipeline->Illuminate\\Pipeline\\{closure}()
#38 /mnt/c/Users/Art/Documents/gitLab/blog/vendor/laravel/framework/src/Illuminate/Pipeline/Pipeline.php(167): App\\Http\\Middleware\\ForceApiResponse->handle()
#39 /mnt/c/Users/Art/Documents/gitLab/blog/vendor/laravel/framework/src/Illuminate/Foundation/Http/Middleware/TransformsRequest.php(21): Illuminate\\Pipeline\\Pipeline->Illuminate\\Pipeline\\{closure}()
#40 /mnt/c/Users/Art/Documents/gitLab/blog/vendor/laravel/framework/src/Illuminate/Foundation/Http/Middleware/ConvertEmptyStringsToNull.php(31): Illuminate\\Foundation\\Http\\Middleware\\TransformsRequest->handle()
#41 /mnt/c/Users/Art/Documents/gitLab/blog/vendor/laravel/framework/src/Illuminate/Pipeline/Pipeline.php(167): Illuminate\\Foundation\\Http\\Middleware\\ConvertEmptyStringsToNull->handle()
#42 /mnt/c/Users/Art/Documents/gitLab/blog/vendor/laravel/framework/src/Illuminate/Foundation/Http/Middleware/TransformsRequest.php(21): Illuminate\\Pipeline\\Pipeline->Illuminate\\Pipeline\\{closure}()
#43 /mnt/c/Users/Art/Documents/gitLab/blog/vendor/laravel/framework/src/Illuminate/Foundation/Http/Middleware/TrimStrings.php(40): Illuminate\\Foundation\\Http\\Middleware\\TransformsRequest->handle()
#44 /mnt/c/Users/Art/Documents/gitLab/blog/vendor/laravel/framework/src/Illuminate/Pipeline/Pipeline.php(167): Illuminate\\Foundation\\Http\\Middleware\\TrimStrings->handle()
#45 /mnt/c/Users/Art/Documents/gitLab/blog/vendor/laravel/framework/src/Illuminate/Foundation/Http/Middleware/ValidatePostSize.php(27): Illuminate\\Pipeline\\Pipeline->Illuminate\\Pipeline\\{closure}()
#46 /mnt/c/Users/Art/Documents/gitLab/blog/vendor/laravel/framework/src/Illuminate/Pipeline/Pipeline.php(167): Illuminate\\Foundation\\Http\\Middleware\\ValidatePostSize->handle()
#47 /mnt/c/Users/Art/Documents/gitLab/blog/vendor/laravel/framework/src/Illuminate/Foundation/Http/Middleware/PreventRequestsDuringMaintenance.php(86): Illuminate\\Pipeline\\Pipeline->Illuminate\\Pipeline\\{closure}()
#48 /mnt/c/Users/Art/Documents/gitLab/blog/vendor/laravel/framework/src/Illuminate/Pipeline/Pipeline.php(167): Illuminate\\Foundation\\Http\\Middleware\\PreventRequestsDuringMaintenance->handle()
#49 /mnt/c/Users/Art/Documents/gitLab/blog/vendor/fruitcake/laravel-cors/src/HandleCors.php(37): Illuminate\\Pipeline\\Pipeline->Illuminate\\Pipeline\\{closure}()
#50 /mnt/c/Users/Art/Documents/gitLab/blog/vendor/laravel/framework/src/Illuminate/Pipeline/Pipeline.php(167): Fruitcake\\Cors\\HandleCors->handle()
#51 /mnt/c/Users/Art/Documents/gitLab/blog/vendor/fideloper/proxy/src/TrustProxies.php(57): Illuminate\\Pipeline\\Pipeline->Illuminate\\Pipeline\\{closure}()
#52 /mnt/c/Users/Art/Documents/gitLab/blog/vendor/laravel/framework/src/Illuminate/Pipeline/Pipeline.php(167): Fideloper\\Proxy\\TrustProxies->handle()
#53 /mnt/c/Users/Art/Documents/gitLab/blog/vendor/laravel/framework/src/Illuminate/Pipeline/Pipeline.php(103): Illuminate\\Pipeline\\Pipeline->Illuminate\\Pipeline\\{closure}()
#54 /mnt/c/Users/Art/Documents/gitLab/blog/vendor/laravel/framework/src/Illuminate/Foundation/Http/Kernel.php(142): Illuminate\\Pipeline\\Pipeline->then()
#55 /mnt/c/Users/Art/Documents/gitLab/blog/vendor/laravel/framework/src/Illuminate/Foundation/Http/Kernel.php(111): Illuminate\\Foundation\\Http\\Kernel->sendRequestThroughRouter()
#56 /mnt/c/Users/Art/Documents/gitLab/blog/public/index.php(58): Illuminate\\Foundation\\Http\\Kernel->handle()
#57 /mnt/c/Users/Art/Documents/gitLab/blog/server.php(21): require_once('...')
#58 {main}

[previous exception] [object] (Doctrine\\DBAL\\Driver\\PDO\\Exception(code: 0): could not find driver at /mnt/c/Users/Art/Documents/gitLab/blog/vendor/doctrine/dbal/lib/Doctrine/DBAL/Driver/PDO/Exception.php:18)
[stacktrace]
#0 /mnt/c/Users/Art/Documents/gitLab/blog/vendor/doctrine/dbal/lib/Doctrine/DBAL/Driver/PDOConnection.php(44): Doctrine\\DBAL\\Driver\\PDO\\Exception::new()
#1 /mnt/c/Users/Art/Documents/gitLab/blog/vendor/laravel/framework/src/Illuminate/Database/Connectors/Connector.php(67): Doctrine\\DBAL\\Driver\\PDOConnection->__construct()
#2 /mnt/c/Users/Art/Documents/gitLab/blog/vendor/laravel/framework/src/Illuminate/Database/Connectors/Connector.php(46): Illuminate\\Database\\Connectors\\Connector->createPdoConnection()
#3 /mnt/c/Users/Art/Documents/gitLab/blog/vendor/laravel/framework/src/Illuminate/Database/Connectors/MySqlConnector.php(24): Illuminate\\Database\\Connectors\\Connector->createConnection()
#4 /mnt/c/Users/Art/Documents/gitLab/blog/vendor/laravel/framework/src/Illuminate/Database/Connectors/ConnectionFactory.php(184): Illuminate\\Database\\Connectors\\MySqlConnector->connect()
#5 [internal function]: Illuminate\\Database\\Connectors\\ConnectionFactory->Illuminate\\Database\\Connectors\\{closure}()
#6 /mnt/c/Users/Art/Documents/gitLab/blog/vendor/laravel/framework/src/Illuminate/Database/Connection.php(1021): call_user_func()
#7 /mnt/c/Users/Art/Documents/gitLab/blog/vendor/laravel/framework/src/Illuminate/Database/Connection.php(1057): Illuminate\\Database\\Connection->getPdo()
#8 /mnt/c/Users/Art/Documents/gitLab/blog/vendor/laravel/framework/src/Illuminate/Database/Connection.php(433): Illuminate\\Database\\Connection->getReadPdo()
#9 /mnt/c/Users/Art/Documents/gitLab/blog/vendor/laravel/framework/src/Illuminate/Database/Connection.php(359): Illuminate\\Database\\Connection->getPdoForSelect()
#10 /mnt/c/Users/Art/Documents/gitLab/blog/vendor/laravel/framework/src/Illuminate/Database/Connection.php(696): Illuminate\\Database\\Connection->Illuminate\\Database\\{closure}()
#11 /mnt/c/Users/Art/Documents/gitLab/blog/vendor/laravel/framework/src/Illuminate/Database/Connection.php(663): Illuminate\\Database\\Connection->runQueryCallback()
#12 /mnt/c/Users/Art/Documents/gitLab/blog/vendor/laravel/framework/src/Illuminate/Database/Connection.php(367): Illuminate\\Database\\Connection->run()
#13 /mnt/c/Users/Art/Documents/gitLab/blog/vendor/laravel/framework/src/Illuminate/Database/Query/Builder.php(2351): Illuminate\\Database\\Connection->select()
#14 /mnt/c/Users/Art/Documents/gitLab/blog/vendor/laravel/framework/src/Illuminate/Database/Query/Builder.php(2339): Illuminate\\Database\\Query\\Builder->runSelect()
#15 /mnt/c/Users/Art/Documents/gitLab/blog/vendor/laravel/framework/src/Illuminate/Database/Query/Builder.php(2873): Illuminate\\Database\\Query\\Builder->Illuminate\\Database\\Query\\{closure}()
#16 /mnt/c/Users/Art/Documents/gitLab/blog/vendor/laravel/framework/src/Illuminate/Database/Query/Builder.php(2340): Illuminate\\Database\\Query\\Builder->onceWithColumns()
#17 /mnt/c/Users/Art/Documents/gitLab/blog/vendor/laravel/framework/src/Illuminate/Database/Eloquent/Builder.php(615): Illuminate\\Database\\Query\\Builder->get()
#18 /mnt/c/Users/Art/Documents/gitLab/blog/vendor/laravel/framework/src/Illuminate/Database/Eloquent/Builder.php(599): Illuminate\\Database\\Eloquent\\Builder->getModels()
#19 /mnt/c/Users/Art/Documents/gitLab/blog/vendor/laravel/framework/src/Illuminate/Database/Concerns/BuildsQueries.php(259): Illuminate\\Database\\Eloquent\\Builder->get()
#20 /mnt/c/Users/Art/Documents/gitLab/blog/vendor/laravel/framework/src/Illuminate/Auth/EloquentUserProvider.php(134): Illuminate\\Database\\Eloquent\\Builder->first()
#21 /mnt/c/Users/Art/Documents/gitLab/blog/vendor/laravel/framework/src/Illuminate/Auth/SessionGuard.php(366): Illuminate\\Auth\\EloquentUserProvider->retrieveByCredentials()
#22 /mnt/c/Users/Art/Documents/gitLab/blog/vendor/laravel/framework/src/Illuminate/Auth/AuthManager.php(336): Illuminate\\Auth\\SessionGuard->attempt()
#23 /mnt/c/Users/Art/Documents/gitLab/blog/vendor/laravel/framework/src/Illuminate/Support/Facades/Facade.php(261): Illuminate\\Auth\\AuthManager->__call()
#24 /mnt/c/Users/Art/Documents/gitLab/blog/app/Http/Controllers/API/v1/SessionsController.php(65): Illuminate\\Support\\Facades\\Facade::__callStatic()
#25 /mnt/c/Users/Art/Documents/gitLab/blog/vendor/laravel/framework/src/Illuminate/Routing/ControllerDispatcher.php(48): App\\Http\\Controllers\\API\\v1\\SessionsController->login()
#26 /mnt/c/Users/Art/Documents/gitLab/blog/vendor/laravel/framework/src/Illuminate/Routing/Route.php(262): Illuminate\\Routing\\ControllerDispatcher->dispatch()
#27 /mnt/c/Users/Art/Documents/gitLab/blog/vendor/laravel/framework/src/Illuminate/Routing/Route.php(205): Illuminate\\Routing\\Route->runController()
#28 /mnt/c/Users/Art/Documents/gitLab/blog/vendor/laravel/framework/src/Illuminate/Routing/Router.php(695): Illuminate\\Routing\\Route->run()
#29 /mnt/c/Users/Art/Documents/gitLab/blog/vendor/laravel/framework/src/Illuminate/Pipeline/Pipeline.php(128): Illuminate\\Routing\\Router->Illuminate\\Routing\\{closure}()
#30 /mnt/c/Users/Art/Documents/gitLab/blog/vendor/laravel/framework/src/Illuminate/Routing/Middleware/SubstituteBindings.php(50): Illuminate\\Pipeline\\Pipeline->Illuminate\\Pipeline\\{closure}()
#31 /mnt/c/Users/Art/Documents/gitLab/blog/vendor/laravel/framework/src/Illuminate/Pipeline/Pipeline.php(167): Illuminate\\Routing\\Middleware\\SubstituteBindings->handle()
#32 /mnt/c/Users/Art/Documents/gitLab/blog/vendor/laravel/framework/src/Illuminate/Routing/Middleware/ThrottleRequests.php(127): Illuminate\\Pipeline\\Pipeline->Illuminate\\Pipeline\\{closure}()
#33 /mnt/c/Users/Art/Documents/gitLab/blog/vendor/laravel/framework/src/Illuminate/Routing/Middleware/ThrottleRequests.php(63): Illuminate\\Routing\\Middleware\\ThrottleRequests->handleRequest()
#34 /mnt/c/Users/Art/Documents/gitLab/blog/vendor/laravel/framework/src/Illuminate/Pipeline/Pipeline.php(167): Illuminate\\Routing\\Middleware\\ThrottleRequests->handle()
#35 /mnt/c/Users/Art/Documents/gitLab/blog/vendor/laravel/framework/src/Illuminate/Pipeline/Pipeline.php(103): Illuminate\\Pipeline\\Pipeline->Illuminate\\Pipeline\\{closure}()
#36 /mnt/c/Users/Art/Documents/gitLab/blog/vendor/laravel/framework/src/Illuminate/Routing/Router.php(697): Illuminate\\Pipeline\\Pipeline->then()
#37 /mnt/c/Users/Art/Documents/gitLab/blog/vendor/laravel/framework/src/Illuminate/Routing/Router.php(672): Illuminate\\Routing\\Router->runRouteWithinStack()
#38 /mnt/c/Users/Art/Documents/gitLab/blog/vendor/laravel/framework/src/Illuminate/Routing/Router.php(636): Illuminate\\Routing\\Router->runRoute()
#39 /mnt/c/Users/Art/Documents/gitLab/blog/vendor/laravel/framework/src/Illuminate/Routing/Router.php(625): Illuminate\\Routing\\Router->dispatchToRoute()
#40 /mnt/c/Users/Art/Documents/gitLab/blog/vendor/laravel/framework/src/Illuminate/Foundation/Http/Kernel.php(167): Illuminate\\Routing\\Router->dispatch()
#41 /mnt/c/Users/Art/Documents/gitLab/blog/vendor/laravel/framework/src/Illuminate/Pipeline/Pipeline.php(128): Illuminate\\Foundation\\Http\\Kernel->Illuminate\\Foundation\\Http\\{closure}()
#42 /mnt/c/Users/Art/Documents/gitLab/blog/nova/src/Http/Middleware/ServeNova.php(24): Illuminate\\Pipeline\\Pipeline->Illuminate\\Pipeline\\{closure}()
#43 /mnt/c/Users/Art/Documents/gitLab/blog/vendor/laravel/framework/src/Illuminate/Pipeline/Pipeline.php(167): Laravel\\Nova\\Http\\Middleware\\ServeNova->handle()
#44 /mnt/c/Users/Art/Documents/gitLab/blog/app/Http/Middleware/DeleteEmptyAndNullStrings.php(21): Illuminate\\Pipeline\\Pipeline->Illuminate\\Pipeline\\{closure}()
#45 /mnt/c/Users/Art/Documents/gitLab/blog/vendor/laravel/framework/src/Illuminate/Pipeline/Pipeline.php(167): App\\Http\\Middleware\\DeleteEmptyAndNullStrings->handle()
#46 /mnt/c/Users/Art/Documents/gitLab/blog/app/Http/Middleware/Localization.php(23): Illuminate\\Pipeline\\Pipeline->Illuminate\\Pipeline\\{closure}()
#47 /mnt/c/Users/Art/Documents/gitLab/blog/vendor/laravel/framework/src/Illuminate/Pipeline/Pipeline.php(167): App\\Http\\Middleware\\Localization->handle()
#48 /mnt/c/Users/Art/Documents/gitLab/blog/app/Http/Middleware/ForceApiResponse.php(19): Illuminate\\Pipeline\\Pipeline->Illuminate\\Pipeline\\{closure}()
#49 /mnt/c/Users/Art/Documents/gitLab/blog/vendor/laravel/framework/src/Illuminate/Pipeline/Pipeline.php(167): App\\Http\\Middleware\\ForceApiResponse->handle()
#50 /mnt/c/Users/Art/Documents/gitLab/blog/vendor/laravel/framework/src/Illuminate/Foundation/Http/Middleware/TransformsRequest.php(21): Illuminate\\Pipeline\\Pipeline->Illuminate\\Pipeline\\{closure}()
#51 /mnt/c/Users/Art/Documents/gitLab/blog/vendor/laravel/framework/src/Illuminate/Foundation/Http/Middleware/ConvertEmptyStringsToNull.php(31): Illuminate\\Foundation\\Http\\Middleware\\TransformsRequest->handle()
#52 /mnt/c/Users/Art/Documents/gitLab/blog/vendor/laravel/framework/src/Illuminate/Pipeline/Pipeline.php(167): Illuminate\\Foundation\\Http\\Middleware\\ConvertEmptyStringsToNull->handle()
#53 /mnt/c/Users/Art/Documents/gitLab/blog/vendor/laravel/framework/src/Illuminate/Foundation/Http/Middleware/TransformsRequest.php(21): Illuminate\\Pipeline\\Pipeline->Illuminate\\Pipeline\\{closure}()
#54 /mnt/c/Users/Art/Documents/gitLab/blog/vendor/laravel/framework/src/Illuminate/Foundation/Http/Middleware/TrimStrings.php(40): Illuminate\\Foundation\\Http\\Middleware\\TransformsRequest->handle()
#55 /mnt/c/Users/Art/Documents/gitLab/blog/vendor/laravel/framework/src/Illuminate/Pipeline/Pipeline.php(167): Illuminate\\Foundation\\Http\\Middleware\\TrimStrings->handle()
#56 /mnt/c/Users/Art/Documents/gitLab/blog/vendor/laravel/framework/src/Illuminate/Foundation/Http/Middleware/ValidatePostSize.php(27): Illuminate\\Pipeline\\Pipeline->Illuminate\\Pipeline\\{closure}()
#57 /mnt/c/Users/Art/Documents/gitLab/blog/vendor/laravel/framework/src/Illuminate/Pipeline/Pipeline.php(167): Illuminate\\Foundation\\Http\\Middleware\\ValidatePostSize->handle()
#58 /mnt/c/Users/Art/Documents/gitLab/blog/vendor/laravel/framework/src/Illuminate/Foundation/Http/Middleware/PreventRequestsDuringMaintenance.php(86): Illuminate\\Pipeline\\Pipeline->Illuminate\\Pipeline\\{closure}()
#59 /mnt/c/Users/Art/Documents/gitLab/blog/vendor/laravel/framework/src/Illuminate/Pipeline/Pipeline.php(167): Illuminate\\Foundation\\Http\\Middleware\\PreventRequestsDuringMaintenance->handle()
#60 /mnt/c/Users/Art/Documents/gitLab/blog/vendor/fruitcake/laravel-cors/src/HandleCors.php(37): Illuminate\\Pipeline\\Pipeline->Illuminate\\Pipeline\\{closure}()
#61 /mnt/c/Users/Art/Documents/gitLab/blog/vendor/laravel/framework/src/Illuminate/Pipeline/Pipeline.php(167): Fruitcake\\Cors\\HandleCors->handle()
#62 /mnt/c/Users/Art/Documents/gitLab/blog/vendor/fideloper/proxy/src/TrustProxies.php(57): Illuminate\\Pipeline\\Pipeline->Illuminate\\Pipeline\\{closure}()
#63 /mnt/c/Users/Art/Documents/gitLab/blog/vendor/laravel/framework/src/Illuminate/Pipeline/Pipeline.php(167): Fideloper\\Proxy\\TrustProxies->handle()
#64 /mnt/c/Users/Art/Documents/gitLab/blog/vendor/laravel/framework/src/Illuminate/Pipeline/Pipeline.php(103): Illuminate\\Pipeline\\Pipeline->Illuminate\\Pipeline\\{closure}()
#65 /mnt/c/Users/Art/Documents/gitLab/blog/vendor/laravel/framework/src/Illuminate/Foundation/Http/Kernel.php(142): Illuminate\\Pipeline\\Pipeline->then()
#66 /mnt/c/Users/Art/Documents/gitLab/blog/vendor/laravel/framework/src/Illuminate/Foundation/Http/Kernel.php(111): Illuminate\\Foundation\\Http\\Kernel->sendRequestThroughRouter()
#67 /mnt/c/Users/Art/Documents/gitLab/blog/public/index.php(58): Illuminate\\Foundation\\Http\\Kernel->handle()
#68 /mnt/c/Users/Art/Documents/gitLab/blog/server.php(21): require_once('...')
#69 {main}

[previous exception] [object] (PDOException(code: 0): could not find driver at /mnt/c/Users/Art/Documents/gitLab/blog/vendor/doctrine/dbal/lib/Doctrine/DBAL/Driver/PDOConnection.php:40)
[stacktrace]
#0 /mnt/c/Users/Art/Documents/gitLab/blog/vendor/doctrine/dbal/lib/Doctrine/DBAL/Driver/PDOConnection.php(40): PDO->__construct()
#1 /mnt/c/Users/Art/Documents/gitLab/blog/vendor/laravel/framework/src/Illuminate/Database/Connectors/Connector.php(67): Doctrine\\DBAL\\Driver\\PDOConnection->__construct()
#2 /mnt/c/Users/Art/Documents/gitLab/blog/vendor/laravel/framework/src/Illuminate/Database/Connectors/Connector.php(46): Illuminate\\Database\\Connectors\\Connector->createPdoConnection()
#3 /mnt/c/Users/Art/Documents/gitLab/blog/vendor/laravel/framework/src/Illuminate/Database/Connectors/MySqlConnector.php(24): Illuminate\\Database\\Connectors\\Connector->createConnection()
#4 /mnt/c/Users/Art/Documents/gitLab/blog/vendor/laravel/framework/src/Illuminate/Database/Connectors/ConnectionFactory.php(184): Illuminate\\Database\\Connectors\\MySqlConnector->connect()
#5 [internal function]: Illuminate\\Database\\Connectors\\ConnectionFactory->Illuminate\\Database\\Connectors\\{closure}()
#6 /mnt/c/Users/Art/Documents/gitLab/blog/vendor/laravel/framework/src/Illuminate/Database/Connection.php(1021): call_user_func()
#7 /mnt/c/Users/Art/Documents/gitLab/blog/vendor/laravel/framework/src/Illuminate/Database/Connection.php(1057): Illuminate\\Database\\Connection->getPdo()
#8 /mnt/c/Users/Art/Documents/gitLab/blog/vendor/laravel/framework/src/Illuminate/Database/Connection.php(433): Illuminate\\Database\\Connection->getReadPdo()
#9 /mnt/c/Users/Art/Documents/gitLab/blog/vendor/laravel/framework/src/Illuminate/Database/Connection.php(359): Illuminate\\Database\\Connection->getPdoForSelect()
#10 /mnt/c/Users/Art/Documents/gitLab/blog/vendor/laravel/framework/src/Illuminate/Database/Connection.php(696): Illuminate\\Database\\Connection->Illuminate\\Database\\{closure}()
#11 /mnt/c/Users/Art/Documents/gitLab/blog/vendor/laravel/framework/src/Illuminate/Database/Connection.php(663): Illuminate\\Database\\Connection->runQueryCallback()
#12 /mnt/c/Users/Art/Documents/gitLab/blog/vendor/laravel/framework/src/Illuminate/Database/Connection.php(367): Illuminate\\Database\\Connection->run()
#13 /mnt/c/Users/Art/Documents/gitLab/blog/vendor/laravel/framework/src/Illuminate/Database/Query/Builder.php(2351): Illuminate\\Database\\Connection->select()
#14 /mnt/c/Users/Art/Documents/gitLab/blog/vendor/laravel/framework/src/Illuminate/Database/Query/Builder.php(2339): Illuminate\\Database\\Query\\Builder->runSelect()
#15 /mnt/c/Users/Art/Documents/gitLab/blog/vendor/laravel/framework/src/Illuminate/Database/Query/Builder.php(2873): Illuminate\\Database\\Query\\Builder->Illuminate\\Database\\Query\\{closure}()
#16 /mnt/c/Users/Art/Documents/gitLab/blog/vendor/laravel/framework/src/Illuminate/Database/Query/Builder.php(2340): Illuminate\\Database\\Query\\Builder->onceWithColumns()
#17 /mnt/c/Users/Art/Documents/gitLab/blog/vendor/laravel/framework/src/Illuminate/Database/Eloquent/Builder.php(615): Illuminate\\Database\\Query\\Builder->get()
#18 /mnt/c/Users/Art/Documents/gitLab/blog/vendor/laravel/framework/src/Illuminate/Database/Eloquent/Builder.php(599): Illuminate\\Database\\Eloquent\\Builder->getModels()
#19 /mnt/c/Users/Art/Documents/gitLab/blog/vendor/laravel/framework/src/Illuminate/Database/Concerns/BuildsQueries.php(259): Illuminate\\Database\\Eloquent\\Builder->get()
#20 /mnt/c/Users/Art/Documents/gitLab/blog/vendor/laravel/framework/src/Illuminate/Auth/EloquentUserProvider.php(134): Illuminate\\Database\\Eloquent\\Builder->first()
#21 /mnt/c/Users/Art/Documents/gitLab/blog/vendor/laravel/framework/src/Illuminate/Auth/SessionGuard.php(366): Illuminate\\Auth\\EloquentUserProvider->retrieveByCredentials()
#22 /mnt/c/Users/Art/Documents/gitLab/blog/vendor/laravel/framework/src/Illuminate/Auth/AuthManager.php(336): Illuminate\\Auth\\SessionGuard->attempt()
#23 /mnt/c/Users/Art/Documents/gitLab/blog/vendor/laravel/framework/src/Illuminate/Support/Facades/Facade.php(261): Illuminate\\Auth\\AuthManager->__call()
#24 /mnt/c/Users/Art/Documents/gitLab/blog/app/Http/Controllers/API/v1/SessionsController.php(65): Illuminate\\Support\\Facades\\Facade::__callStatic()
#25 /mnt/c/Users/Art/Documents/gitLab/blog/vendor/laravel/framework/src/Illuminate/Routing/ControllerDispatcher.php(48): App\\Http\\Controllers\\API\\v1\\SessionsController->login()
#26 /mnt/c/Users/Art/Documents/gitLab/blog/vendor/laravel/framework/src/Illuminate/Routing/Route.php(262): Illuminate\\Routing\\ControllerDispatcher->dispatch()
#27 /mnt/c/Users/Art/Documents/gitLab/blog/vendor/laravel/framework/src/Illuminate/Routing/Route.php(205): Illuminate\\Routing\\Route->runController()
#28 /mnt/c/Users/Art/Documents/gitLab/blog/vendor/laravel/framework/src/Illuminate/Routing/Router.php(695): Illuminate\\Routing\\Route->run()
#29 /mnt/c/Users/Art/Documents/gitLab/blog/vendor/laravel/framework/src/Illuminate/Pipeline/Pipeline.php(128): Illuminate\\Routing\\Router->Illuminate\\Routing\\{closure}()
#30 /mnt/c/Users/Art/Documents/gitLab/blog/vendor/laravel/framework/src/Illuminate/Routing/Middleware/SubstituteBindings.php(50): Illuminate\\Pipeline\\Pipeline->Illuminate\\Pipeline\\{closure}()
#31 /mnt/c/Users/Art/Documents/gitLab/blog/vendor/laravel/framework/src/Illuminate/Pipeline/Pipeline.php(167): Illuminate\\Routing\\Middleware\\SubstituteBindings->handle()
#32 /mnt/c/Users/Art/Documents/gitLab/blog/vendor/laravel/framework/src/Illuminate/Routing/Middleware/ThrottleRequests.php(127): Illuminate\\Pipeline\\Pipeline->Illuminate\\Pipeline\\{closure}()
#33 /mnt/c/Users/Art/Documents/gitLab/blog/vendor/laravel/framework/src/Illuminate/Routing/Middleware/ThrottleRequests.php(63): Illuminate\\Routing\\Middleware\\ThrottleRequests->handleRequest()
#34 /mnt/c/Users/Art/Documents/gitLab/blog/vendor/laravel/framework/src/Illuminate/Pipeline/Pipeline.php(167): Illuminate\\Routing\\Middleware\\ThrottleRequests->handle()
#35 /mnt/c/Users/Art/Documents/gitLab/blog/vendor/laravel/framework/src/Illuminate/Pipeline/Pipeline.php(103): Illuminate\\Pipeline\\Pipeline->Illuminate\\Pipeline\\{closure}()
#36 /mnt/c/Users/Art/Documents/gitLab/blog/vendor/laravel/framework/src/Illuminate/Routing/Router.php(697): Illuminate\\Pipeline\\Pipeline->then()
#37 /mnt/c/Users/Art/Documents/gitLab/blog/vendor/laravel/framework/src/Illuminate/Routing/Router.php(672): Illuminate\\Routing\\Router->runRouteWithinStack()
#38 /mnt/c/Users/Art/Documents/gitLab/blog/vendor/laravel/framework/src/Illuminate/Routing/Router.php(636): Illuminate\\Routing\\Router->runRoute()
#39 /mnt/c/Users/Art/Documents/gitLab/blog/vendor/laravel/framework/src/Illuminate/Routing/Router.php(625): Illuminate\\Routing\\Router->dispatchToRoute()
#40 /mnt/c/Users/Art/Documents/gitLab/blog/vendor/laravel/framework/src/Illuminate/Foundation/Http/Kernel.php(167): Illuminate\\Routing\\Router->dispatch()
#41 /mnt/c/Users/Art/Documents/gitLab/blog/vendor/laravel/framework/src/Illuminate/Pipeline/Pipeline.php(128): Illuminate\\Foundation\\Http\\Kernel->Illuminate\\Foundation\\Http\\{closure}()
#42 /mnt/c/Users/Art/Documents/gitLab/blog/nova/src/Http/Middleware/ServeNova.php(24): Illuminate\\Pipeline\\Pipeline->Illuminate\\Pipeline\\{closure}()
#43 /mnt/c/Users/Art/Documents/gitLab/blog/vendor/laravel/framework/src/Illuminate/Pipeline/Pipeline.php(167): Laravel\\Nova\\Http\\Middleware\\ServeNova->handle()
#44 /mnt/c/Users/Art/Documents/gitLab/blog/app/Http/Middleware/DeleteEmptyAndNullStrings.php(21): Illuminate\\Pipeline\\Pipeline->Illuminate\\Pipeline\\{closure}()
#45 /mnt/c/Users/Art/Documents/gitLab/blog/vendor/laravel/framework/src/Illuminate/Pipeline/Pipeline.php(167): App\\Http\\Middleware\\DeleteEmptyAndNullStrings->handle()
#46 /mnt/c/Users/Art/Documents/gitLab/blog/app/Http/Middleware/Localization.php(23): Illuminate\\Pipeline\\Pipeline->Illuminate\\Pipeline\\{closure}()
#47 /mnt/c/Users/Art/Documents/gitLab/blog/vendor/laravel/framework/src/Illuminate/Pipeline/Pipeline.php(167): App\\Http\\Middleware\\Localization->handle()
#48 /mnt/c/Users/Art/Documents/gitLab/blog/app/Http/Middleware/ForceApiResponse.php(19): Illuminate\\Pipeline\\Pipeline->Illuminate\\Pipeline\\{closure}()
#49 /mnt/c/Users/Art/Documents/gitLab/blog/vendor/laravel/framework/src/Illuminate/Pipeline/Pipeline.php(167): App\\Http\\Middleware\\ForceApiResponse->handle()
#50 /mnt/c/Users/Art/Documents/gitLab/blog/vendor/laravel/framework/src/Illuminate/Foundation/Http/Middleware/TransformsRequest.php(21): Illuminate\\Pipeline\\Pipeline->Illuminate\\Pipeline\\{closure}()
#51 /mnt/c/Users/Art/Documents/gitLab/blog/vendor/laravel/framework/src/Illuminate/Foundation/Http/Middleware/ConvertEmptyStringsToNull.php(31): Illuminate\\Foundation\\Http\\Middleware\\TransformsRequest->handle()
#52 /mnt/c/Users/Art/Documents/gitLab/blog/vendor/laravel/framework/src/Illuminate/Pipeline/Pipeline.php(167): Illuminate\\Foundation\\Http\\Middleware\\ConvertEmptyStringsToNull->handle()
#53 /mnt/c/Users/Art/Documents/gitLab/blog/vendor/laravel/framework/src/Illuminate/Foundation/Http/Middleware/TransformsRequest.php(21): Illuminate\\Pipeline\\Pipeline->Illuminate\\Pipeline\\{closure}()
#54 /mnt/c/Users/Art/Documents/gitLab/blog/vendor/laravel/framework/src/Illuminate/Foundation/Http/Middleware/TrimStrings.php(40): Illuminate\\Foundation\\Http\\Middleware\\TransformsRequest->handle()
#55 /mnt/c/Users/Art/Documents/gitLab/blog/vendor/laravel/framework/src/Illuminate/Pipeline/Pipeline.php(167): Illuminate\\Foundation\\Http\\Middleware\\TrimStrings->handle()
#56 /mnt/c/Users/Art/Documents/gitLab/blog/vendor/laravel/framework/src/Illuminate/Foundation/Http/Middleware/ValidatePostSize.php(27): Illuminate\\Pipeline\\Pipeline->Illuminate\\Pipeline\\{closure}()
#57 /mnt/c/Users/Art/Documents/gitLab/blog/vendor/laravel/framework/src/Illuminate/Pipeline/Pipeline.php(167): Illuminate\\Foundation\\Http\\Middleware\\ValidatePostSize->handle()
#58 /mnt/c/Users/Art/Documents/gitLab/blog/vendor/laravel/framework/src/Illuminate/Foundation/Http/Middleware/PreventRequestsDuringMaintenance.php(86): Illuminate\\Pipeline\\Pipeline->Illuminate\\Pipeline\\{closure}()
#59 /mnt/c/Users/Art/Documents/gitLab/blog/vendor/laravel/framework/src/Illuminate/Pipeline/Pipeline.php(167): Illuminate\\Foundation\\Http\\Middleware\\PreventRequestsDuringMaintenance->handle()
#60 /mnt/c/Users/Art/Documents/gitLab/blog/vendor/fruitcake/laravel-cors/src/HandleCors.php(37): Illuminate\\Pipeline\\Pipeline->Illuminate\\Pipeline\\{closure}()
#61 /mnt/c/Users/Art/Documents/gitLab/blog/vendor/laravel/framework/src/Illuminate/Pipeline/Pipeline.php(167): Fruitcake\\Cors\\HandleCors->handle()
#62 /mnt/c/Users/Art/Documents/gitLab/blog/vendor/fideloper/proxy/src/TrustProxies.php(57): Illuminate\\Pipeline\\Pipeline->Illuminate\\Pipeline\\{closure}()
#63 /mnt/c/Users/Art/Documents/gitLab/blog/vendor/laravel/framework/src/Illuminate/Pipeline/Pipeline.php(167): Fideloper\\Proxy\\TrustProxies->handle()
#64 /mnt/c/Users/Art/Documents/gitLab/blog/vendor/laravel/framework/src/Illuminate/Pipeline/Pipeline.php(103): Illuminate\\Pipeline\\Pipeline->Illuminate\\Pipeline\\{closure}()
#65 /mnt/c/Users/Art/Documents/gitLab/blog/vendor/laravel/framework/src/Illuminate/Foundation/Http/Kernel.php(142): Illuminate\\Pipeline\\Pipeline->then()
#66 /mnt/c/Users/Art/Documents/gitLab/blog/vendor/laravel/framework/src/Illuminate/Foundation/Http/Kernel.php(111): Illuminate\\Foundation\\Http\\Kernel->sendRequestThroughRouter()
#67 /mnt/c/Users/Art/Documents/gitLab/blog/public/index.php(58): Illuminate\\Foundation\\Http\\Kernel->handle()
#68 /mnt/c/Users/Art/Documents/gitLab/blog/server.php(21): require_once('...')
#69 {main}
"} 
[2021-11-12 10:16:20] local.ERROR: could not find driver (SQL: select count(*) as aggregate from `telescope_entries` where `type` = exception and `family_hash` = 6ad7a3513d9530f93eda3b1c0778799c) {"exception":"[object] (Illuminate\\Database\\QueryException(code: 0): could not find driver (SQL: select count(*) as aggregate from `telescope_entries` where `type` = exception and `family_hash` = 6ad7a3513d9530f93eda3b1c0778799c) at /mnt/c/Users/Art/Documents/gitLab/blog/vendor/laravel/framework/src/Illuminate/Database/Connection.php:703)
[stacktrace]
#0 /mnt/c/Users/Art/Documents/gitLab/blog/vendor/laravel/framework/src/Illuminate/Database/Connection.php(663): Illuminate\\Database\\Connection->runQueryCallback()
#1 /mnt/c/Users/Art/Documents/gitLab/blog/vendor/laravel/framework/src/Illuminate/Database/Connection.php(367): Illuminate\\Database\\Connection->run()
#2 /mnt/c/Users/Art/Documents/gitLab/blog/vendor/laravel/framework/src/Illuminate/Database/Query/Builder.php(2351): Illuminate\\Database\\Connection->select()
#3 /mnt/c/Users/Art/Documents/gitLab/blog/vendor/laravel/framework/src/Illuminate/Database/Query/Builder.php(2339): Illuminate\\Database\\Query\\Builder->runSelect()
#4 /mnt/c/Users/Art/Documents/gitLab/blog/vendor/laravel/framework/src/Illuminate/Database/Query/Builder.php(2873): Illuminate\\Database\\Query\\Builder->Illuminate\\Database\\Query\\{closure}()
#5 /mnt/c/Users/Art/Documents/gitLab/blog/vendor/laravel/framework/src/Illuminate/Database/Query/Builder.php(2340): Illuminate\\Database\\Query\\Builder->onceWithColumns()
#6 /mnt/c/Users/Art/Documents/gitLab/blog/vendor/laravel/framework/src/Illuminate/Database/Query/Builder.php(2800): Illuminate\\Database\\Query\\Builder->get()
#7 /mnt/c/Users/Art/Documents/gitLab/blog/vendor/laravel/framework/src/Illuminate/Database/Query/Builder.php(2728): Illuminate\\Database\\Query\\Builder->aggregate()
#8 /mnt/c/Users/Art/Documents/gitLab/blog/vendor/laravel/telescope/src/Storage/DatabaseEntriesRepository.php(122): Illuminate\\Database\\Query\\Builder->count()
#9 /mnt/c/Users/Art/Documents/gitLab/blog/vendor/laravel/telescope/src/Storage/DatabaseEntriesRepository.php(164): Laravel\\Telescope\\Storage\\DatabaseEntriesRepository->countExceptionOccurences()
#10 [internal function]: Laravel\\Telescope\\Storage\\DatabaseEntriesRepository->Laravel\\Telescope\\Storage\\{closure}()
#11 /mnt/c/Users/Art/Documents/gitLab/blog/vendor/laravel/framework/src/Illuminate/Collections/Collection.php(664): array_map()
#12 /mnt/c/Users/Art/Documents/gitLab/blog/vendor/laravel/telescope/src/Storage/DatabaseEntriesRepository.php(177): Illuminate\\Support\\Collection->map()
#13 /mnt/c/Users/Art/Documents/gitLab/blog/vendor/laravel/framework/src/Illuminate/Collections/Traits/EnumeratesValues.php(242): Laravel\\Telescope\\Storage\\DatabaseEntriesRepository->Laravel\\Telescope\\Storage\\{closure}()
#14 /mnt/c/Users/Art/Documents/gitLab/blog/vendor/laravel/telescope/src/Storage/DatabaseEntriesRepository.php(178): Illuminate\\Support\\Collection->each()
#15 /mnt/c/Users/Art/Documents/gitLab/blog/vendor/laravel/telescope/src/Storage/DatabaseEntriesRepository.php(139): Laravel\\Telescope\\Storage\\DatabaseEntriesRepository->storeExceptions()
#16 /mnt/c/Users/Art/Documents/gitLab/blog/vendor/laravel/telescope/src/Telescope.php(660): Laravel\\Telescope\\Storage\\DatabaseEntriesRepository->store()
#17 [internal function]: Laravel\\Telescope\\Telescope::Laravel\\Telescope\\{closure}()
#18 /mnt/c/Users/Art/Documents/gitLab/blog/vendor/laravel/telescope/src/Telescope.php(281): call_user_func()
#19 /mnt/c/Users/Art/Documents/gitLab/blog/vendor/laravel/telescope/src/Telescope.php(671): Laravel\\Telescope\\Telescope::withoutRecording()
#20 /mnt/c/Users/Art/Documents/gitLab/blog/vendor/laravel/telescope/src/ListensForStorageOpportunities.php(65): Laravel\\Telescope\\Telescope::store()
#21 /mnt/c/Users/Art/Documents/gitLab/blog/vendor/laravel/framework/src/Illuminate/Container/BoundMethod.php(36): Laravel\\Telescope\\Telescope::Laravel\\Telescope\\{closure}()
#22 /mnt/c/Users/Art/Documents/gitLab/blog/vendor/laravel/framework/src/Illuminate/Container/Util.php(40): Illuminate\\Container\\BoundMethod::Illuminate\\Container\\{closure}()
#23 /mnt/c/Users/Art/Documents/gitLab/blog/vendor/laravel/framework/src/Illuminate/Container/BoundMethod.php(81): Illuminate\\Container\\Util::unwrapIfClosure()
#24 /mnt/c/Users/Art/Documents/gitLab/blog/vendor/laravel/framework/src/Illuminate/Container/BoundMethod.php(37): Illuminate\\Container\\BoundMethod::callBoundMethod()
#25 /mnt/c/Users/Art/Documents/gitLab/blog/vendor/laravel/framework/src/Illuminate/Container/Container.php(653): Illuminate\\Container\\BoundMethod::call()
#26 /mnt/c/Users/Art/Documents/gitLab/blog/vendor/laravel/framework/src/Illuminate/Foundation/Application.php(1148): Illuminate\\Container\\Container->call()
#27 /mnt/c/Users/Art/Documents/gitLab/blog/vendor/laravel/framework/src/Illuminate/Foundation/Http/Kernel.php(182): Illuminate\\Foundation\\Application->terminate()
#28 /mnt/c/Users/Art/Documents/gitLab/blog/public/index.php(63): Illuminate\\Foundation\\Http\\Kernel->terminate()
#29 /mnt/c/Users/Art/Documents/gitLab/blog/server.php(21): require_once('...')
#30 {main}

[previous exception] [object] (Doctrine\\DBAL\\Driver\\PDO\\Exception(code: 0): could not find driver at /mnt/c/Users/Art/Documents/gitLab/blog/vendor/doctrine/dbal/lib/Doctrine/DBAL/Driver/PDO/Exception.php:18)
[stacktrace]
#0 /mnt/c/Users/Art/Documents/gitLab/blog/vendor/doctrine/dbal/lib/Doctrine/DBAL/Driver/PDOConnection.php(44): Doctrine\\DBAL\\Driver\\PDO\\Exception::new()
#1 /mnt/c/Users/Art/Documents/gitLab/blog/vendor/laravel/framework/src/Illuminate/Database/Connectors/Connector.php(67): Doctrine\\DBAL\\Driver\\PDOConnection->__construct()
#2 /mnt/c/Users/Art/Documents/gitLab/blog/vendor/laravel/framework/src/Illuminate/Database/Connectors/Connector.php(46): Illuminate\\Database\\Connectors\\Connector->createPdoConnection()
#3 /mnt/c/Users/Art/Documents/gitLab/blog/vendor/laravel/framework/src/Illuminate/Database/Connectors/MySqlConnector.php(24): Illuminate\\Database\\Connectors\\Connector->createConnection()
#4 /mnt/c/Users/Art/Documents/gitLab/blog/vendor/laravel/framework/src/Illuminate/Database/Connectors/ConnectionFactory.php(184): Illuminate\\Database\\Connectors\\MySqlConnector->connect()
#5 [internal function]: Illuminate\\Database\\Connectors\\ConnectionFactory->Illuminate\\Database\\Connectors\\{closure}()
#6 /mnt/c/Users/Art/Documents/gitLab/blog/vendor/laravel/framework/src/Illuminate/Database/Connection.php(1021): call_user_func()
#7 /mnt/c/Users/Art/Documents/gitLab/blog/vendor/laravel/framework/src/Illuminate/Database/Connection.php(1057): Illuminate\\Database\\Connection->getPdo()
#8 /mnt/c/Users/Art/Documents/gitLab/blog/vendor/laravel/framework/src/Illuminate/Database/Connection.php(433): Illuminate\\Database\\Connection->getReadPdo()
#9 /mnt/c/Users/Art/Documents/gitLab/blog/vendor/laravel/framework/src/Illuminate/Database/Connection.php(359): Illuminate\\Database\\Connection->getPdoForSelect()
#10 /mnt/c/Users/Art/Documents/gitLab/blog/vendor/laravel/framework/src/Illuminate/Database/Connection.php(696): Illuminate\\Database\\Connection->Illuminate\\Database\\{closure}()
#11 /mnt/c/Users/Art/Documents/gitLab/blog/vendor/laravel/framework/src/Illuminate/Database/Connection.php(663): Illuminate\\Database\\Connection->runQueryCallback()
#12 /mnt/c/Users/Art/Documents/gitLab/blog/vendor/laravel/framework/src/Illuminate/Database/Connection.php(367): Illuminate\\Database\\Connection->run()
#13 /mnt/c/Users/Art/Documents/gitLab/blog/vendor/laravel/framework/src/Illuminate/Database/Query/Builder.php(2351): Illuminate\\Database\\Connection->select()
#14 /mnt/c/Users/Art/Documents/gitLab/blog/vendor/laravel/framework/src/Illuminate/Database/Query/Builder.php(2339): Illuminate\\Database\\Query\\Builder->runSelect()
#15 /mnt/c/Users/Art/Documents/gitLab/blog/vendor/laravel/framework/src/Illuminate/Database/Query/Builder.php(2873): Illuminate\\Database\\Query\\Builder->Illuminate\\Database\\Query\\{closure}()
#16 /mnt/c/Users/Art/Documents/gitLab/blog/vendor/laravel/framework/src/Illuminate/Database/Query/Builder.php(2340): Illuminate\\Database\\Query\\Builder->onceWithColumns()
#17 /mnt/c/Users/Art/Documents/gitLab/blog/vendor/laravel/framework/src/Illuminate/Database/Query/Builder.php(2800): Illuminate\\Database\\Query\\Builder->get()
#18 /mnt/c/Users/Art/Documents/gitLab/blog/vendor/laravel/framework/src/Illuminate/Database/Query/Builder.php(2728): Illuminate\\Database\\Query\\Builder->aggregate()
#19 /mnt/c/Users/Art/Documents/gitLab/blog/vendor/laravel/telescope/src/Storage/DatabaseEntriesRepository.php(122): Illuminate\\Database\\Query\\Builder->count()
#20 /mnt/c/Users/Art/Documents/gitLab/blog/vendor/laravel/telescope/src/Storage/DatabaseEntriesRepository.php(164): Laravel\\Telescope\\Storage\\DatabaseEntriesRepository->countExceptionOccurences()
#21 [internal function]: Laravel\\Telescope\\Storage\\DatabaseEntriesRepository->Laravel\\Telescope\\Storage\\{closure}()
#22 /mnt/c/Users/Art/Documents/gitLab/blog/vendor/laravel/framework/src/Illuminate/Collections/Collection.php(664): array_map()
#23 /mnt/c/Users/Art/Documents/gitLab/blog/vendor/laravel/telescope/src/Storage/DatabaseEntriesRepository.php(177): Illuminate\\Support\\Collection->map()
#24 /mnt/c/Users/Art/Documents/gitLab/blog/vendor/laravel/framework/src/Illuminate/Collections/Traits/EnumeratesValues.php(242): Laravel\\Telescope\\Storage\\DatabaseEntriesRepository->Laravel\\Telescope\\Storage\\{closure}()
#25 /mnt/c/Users/Art/Documents/gitLab/blog/vendor/laravel/telescope/src/Storage/DatabaseEntriesRepository.php(178): Illuminate\\Support\\Collection->each()
#26 /mnt/c/Users/Art/Documents/gitLab/blog/vendor/laravel/telescope/src/Storage/DatabaseEntriesRepository.php(139): Laravel\\Telescope\\Storage\\DatabaseEntriesRepository->storeExceptions()
#27 /mnt/c/Users/Art/Documents/gitLab/blog/vendor/laravel/telescope/src/Telescope.php(660): Laravel\\Telescope\\Storage\\DatabaseEntriesRepository->store()
#28 [internal function]: Laravel\\Telescope\\Telescope::Laravel\\Telescope\\{closure}()
#29 /mnt/c/Users/Art/Documents/gitLab/blog/vendor/laravel/telescope/src/Telescope.php(281): call_user_func()
#30 /mnt/c/Users/Art/Documents/gitLab/blog/vendor/laravel/telescope/src/Telescope.php(671): Laravel\\Telescope\\Telescope::withoutRecording()
#31 /mnt/c/Users/Art/Documents/gitLab/blog/vendor/laravel/telescope/src/ListensForStorageOpportunities.php(65): Laravel\\Telescope\\Telescope::store()
#32 /mnt/c/Users/Art/Documents/gitLab/blog/vendor/laravel/framework/src/Illuminate/Container/BoundMethod.php(36): Laravel\\Telescope\\Telescope::Laravel\\Telescope\\{closure}()
#33 /mnt/c/Users/Art/Documents/gitLab/blog/vendor/laravel/framework/src/Illuminate/Container/Util.php(40): Illuminate\\Container\\BoundMethod::Illuminate\\Container\\{closure}()
#34 /mnt/c/Users/Art/Documents/gitLab/blog/vendor/laravel/framework/src/Illuminate/Container/BoundMethod.php(81): Illuminate\\Container\\Util::unwrapIfClosure()
#35 /mnt/c/Users/Art/Documents/gitLab/blog/vendor/laravel/framework/src/Illuminate/Container/BoundMethod.php(37): Illuminate\\Container\\BoundMethod::callBoundMethod()
#36 /mnt/c/Users/Art/Documents/gitLab/blog/vendor/laravel/framework/src/Illuminate/Container/Container.php(653): Illuminate\\Container\\BoundMethod::call()
#37 /mnt/c/Users/Art/Documents/gitLab/blog/vendor/laravel/framework/src/Illuminate/Foundation/Application.php(1148): Illuminate\\Container\\Container->call()
#38 /mnt/c/Users/Art/Documents/gitLab/blog/vendor/laravel/framework/src/Illuminate/Foundation/Http/Kernel.php(182): Illuminate\\Foundation\\Application->terminate()
#39 /mnt/c/Users/Art/Documents/gitLab/blog/public/index.php(63): Illuminate\\Foundation\\Http\\Kernel->terminate()
#40 /mnt/c/Users/Art/Documents/gitLab/blog/server.php(21): require_once('...')
#41 {main}

[previous exception] [object] (PDOException(code: 0): could not find driver at /mnt/c/Users/Art/Documents/gitLab/blog/vendor/doctrine/dbal/lib/Doctrine/DBAL/Driver/PDOConnection.php:40)
[stacktrace]
#0 /mnt/c/Users/Art/Documents/gitLab/blog/vendor/doctrine/dbal/lib/Doctrine/DBAL/Driver/PDOConnection.php(40): PDO->__construct()
#1 /mnt/c/Users/Art/Documents/gitLab/blog/vendor/laravel/framework/src/Illuminate/Database/Connectors/Connector.php(67): Doctrine\\DBAL\\Driver\\PDOConnection->__construct()
#2 /mnt/c/Users/Art/Documents/gitLab/blog/vendor/laravel/framework/src/Illuminate/Database/Connectors/Connector.php(46): Illuminate\\Database\\Connectors\\Connector->createPdoConnection()
#3 /mnt/c/Users/Art/Documents/gitLab/blog/vendor/laravel/framework/src/Illuminate/Database/Connectors/MySqlConnector.php(24): Illuminate\\Database\\Connectors\\Connector->createConnection()
#4 /mnt/c/Users/Art/Documents/gitLab/blog/vendor/laravel/framework/src/Illuminate/Database/Connectors/ConnectionFactory.php(184): Illuminate\\Database\\Connectors\\MySqlConnector->connect()
#5 [internal function]: Illuminate\\Database\\Connectors\\ConnectionFactory->Illuminate\\Database\\Connectors\\{closure}()
#6 /mnt/c/Users/Art/Documents/gitLab/blog/vendor/laravel/framework/src/Illuminate/Database/Connection.php(1021): call_user_func()
#7 /mnt/c/Users/Art/Documents/gitLab/blog/vendor/laravel/framework/src/Illuminate/Database/Connection.php(1057): Illuminate\\Database\\Connection->getPdo()
#8 /mnt/c/Users/Art/Documents/gitLab/blog/vendor/laravel/framework/src/Illuminate/Database/Connection.php(433): Illuminate\\Database\\Connection->getReadPdo()
#9 /mnt/c/Users/Art/Documents/gitLab/blog/vendor/laravel/framework/src/Illuminate/Database/Connection.php(359): Illuminate\\Database\\Connection->getPdoForSelect()
#10 /mnt/c/Users/Art/Documents/gitLab/blog/vendor/laravel/framework/src/Illuminate/Database/Connection.php(696): Illuminate\\Database\\Connection->Illuminate\\Database\\{closure}()
#11 /mnt/c/Users/Art/Documents/gitLab/blog/vendor/laravel/framework/src/Illuminate/Database/Connection.php(663): Illuminate\\Database\\Connection->runQueryCallback()
#12 /mnt/c/Users/Art/Documents/gitLab/blog/vendor/laravel/framework/src/Illuminate/Database/Connection.php(367): Illuminate\\Database\\Connection->run()
#13 /mnt/c/Users/Art/Documents/gitLab/blog/vendor/laravel/framework/src/Illuminate/Database/Query/Builder.php(2351): Illuminate\\Database\\Connection->select()
#14 /mnt/c/Users/Art/Documents/gitLab/blog/vendor/laravel/framework/src/Illuminate/Database/Query/Builder.php(2339): Illuminate\\Database\\Query\\Builder->runSelect()
#15 /mnt/c/Users/Art/Documents/gitLab/blog/vendor/laravel/framework/src/Illuminate/Database/Query/Builder.php(2873): Illuminate\\Database\\Query\\Builder->Illuminate\\Database\\Query\\{closure}()
#16 /mnt/c/Users/Art/Documents/gitLab/blog/vendor/laravel/framework/src/Illuminate/Database/Query/Builder.php(2340): Illuminate\\Database\\Query\\Builder->onceWithColumns()
#17 /mnt/c/Users/Art/Documents/gitLab/blog/vendor/laravel/framework/src/Illuminate/Database/Query/Builder.php(2800): Illuminate\\Database\\Query\\Builder->get()
#18 /mnt/c/Users/Art/Documents/gitLab/blog/vendor/laravel/framework/src/Illuminate/Database/Query/Builder.php(2728): Illuminate\\Database\\Query\\Builder->aggregate()
#19 /mnt/c/Users/Art/Documents/gitLab/blog/vendor/laravel/telescope/src/Storage/DatabaseEntriesRepository.php(122): Illuminate\\Database\\Query\\Builder->count()
#20 /mnt/c/Users/Art/Documents/gitLab/blog/vendor/laravel/telescope/src/Storage/DatabaseEntriesRepository.php(164): Laravel\\Telescope\\Storage\\DatabaseEntriesRepository->countExceptionOccurences()
#21 [internal function]: Laravel\\Telescope\\Storage\\DatabaseEntriesRepository->Laravel\\Telescope\\Storage\\{closure}()
#22 /mnt/c/Users/Art/Documents/gitLab/blog/vendor/laravel/framework/src/Illuminate/Collections/Collection.php(664): array_map()
#23 /mnt/c/Users/Art/Documents/gitLab/blog/vendor/laravel/telescope/src/Storage/DatabaseEntriesRepository.php(177): Illuminate\\Support\\Collection->map()
#24 /mnt/c/Users/Art/Documents/gitLab/blog/vendor/laravel/framework/src/Illuminate/Collections/Traits/EnumeratesValues.php(242): Laravel\\Telescope\\Storage\\DatabaseEntriesRepository->Laravel\\Telescope\\Storage\\{closure}()
#25 /mnt/c/Users/Art/Documents/gitLab/blog/vendor/laravel/telescope/src/Storage/DatabaseEntriesRepository.php(178): Illuminate\\Support\\Collection->each()
#26 /mnt/c/Users/Art/Documents/gitLab/blog/vendor/laravel/telescope/src/Storage/DatabaseEntriesRepository.php(139): Laravel\\Telescope\\Storage\\DatabaseEntriesRepository->storeExceptions()
#27 /mnt/c/Users/Art/Documents/gitLab/blog/vendor/laravel/telescope/src/Telescope.php(660): Laravel\\Telescope\\Storage\\DatabaseEntriesRepository->store()
#28 [internal function]: Laravel\\Telescope\\Telescope::Laravel\\Telescope\\{closure}()
#29 /mnt/c/Users/Art/Documents/gitLab/blog/vendor/laravel/telescope/src/Telescope.php(281): call_user_func()
#30 /mnt/c/Users/Art/Documents/gitLab/blog/vendor/laravel/telescope/src/Telescope.php(671): Laravel\\Telescope\\Telescope::withoutRecording()
#31 /mnt/c/Users/Art/Documents/gitLab/blog/vendor/laravel/telescope/src/ListensForStorageOpportunities.php(65): Laravel\\Telescope\\Telescope::store()
#32 /mnt/c/Users/Art/Documents/gitLab/blog/vendor/laravel/framework/src/Illuminate/Container/BoundMethod.php(36): Laravel\\Telescope\\Telescope::Laravel\\Telescope\\{closure}()
#33 /mnt/c/Users/Art/Documents/gitLab/blog/vendor/laravel/framework/src/Illuminate/Container/Util.php(40): Illuminate\\Container\\BoundMethod::Illuminate\\Container\\{closure}()
#34 /mnt/c/Users/Art/Documents/gitLab/blog/vendor/laravel/framework/src/Illuminate/Container/BoundMethod.php(81): Illuminate\\Container\\Util::unwrapIfClosure()
#35 /mnt/c/Users/Art/Documents/gitLab/blog/vendor/laravel/framework/src/Illuminate/Container/BoundMethod.php(37): Illuminate\\Container\\BoundMethod::callBoundMethod()
#36 /mnt/c/Users/Art/Documents/gitLab/blog/vendor/laravel/framework/src/Illuminate/Container/Container.php(653): Illuminate\\Container\\BoundMethod::call()
#37 /mnt/c/Users/Art/Documents/gitLab/blog/vendor/laravel/framework/src/Illuminate/Foundation/Application.php(1148): Illuminate\\Container\\Container->call()
#38 /mnt/c/Users/Art/Documents/gitLab/blog/vendor/laravel/framework/src/Illuminate/Foundation/Http/Kernel.php(182): Illuminate\\Foundation\\Application->terminate()
#39 /mnt/c/Users/Art/Documents/gitLab/blog/public/index.php(63): Illuminate\\Foundation\\Http\\Kernel->terminate()
#40 /mnt/c/Users/Art/Documents/gitLab/blog/server.php(21): require_once('...')
#41 {main}
"} 
