directenergy,143
tetratech,130
schroders,119
assurant,113
edenred,105
towergate,99
axausa,97
edenredrpop,91
hdfcb,80
jdasoftware,69
ausmallfin,67
telusdigital,67
centrica,65
fwdhk,59
machcs,55
fwdth,50
dvla,45
aiaau,44
equifaxuk,40
gphpywaf,40
hsl,40
aiathailand,39
axa,39
italgas,39
lolc,39
amtrust,36
resmed,36
etransfer,35
aiazealandrp,34
defraawsdev,34
hmlr,33
nintendo,32
aiaph,31
aiasingapore,29
bgc,28
jubilant,28
talktalk,28
tcenergy,28
navitimejp,27
aiahkgrp,26
maricopa,25
travelers,25
mjb,24
shawbrookbank,24
teracms,24
wipro,24
adtsec,23
atlantagroup,23
emaar,23
defraawsprepr,22
defraawsprod,22
equifaxsec,22
aiakh,20
ert,20
hire,20
servicenow,20
diageo,19
openwork,19
visiant,19
paypalwaf,18
sikaiag,18
fwdkh,17
fwdph,17
luminor,17
opmpl,17
upllimited,17
swift,16
attbn,15
boi,15
cadph,15
defraazprepro,15
defraazuredev,15
defraazurprod,15
herffjones,15
marketforce,15
ordancesurvey,15
rpartners,15
njm,14
solaredge,14
vsp,14
aiatw,13
americanccf,13
batelco,13
caest,13
fwdgo,13
ocado,13
agency,12
chinabanking,12
equifax,12
hoopp,12
netspend,12
rambus,12
siagroup,12
aiaid,11
aiamy,11
cbc,11
fhlbdm,11
firstdata,11
nsel,11
royaljordan,11
saga,11
unisys,11
aiamm,10
aiasrilanka,10
alaskausa,10
asianpaints,10
fwdjp,10
hachette,10
highmark,10
valleybancorp,10
adtblue,9
fwdvn,9
hitachi,9
kar,9
lbrandsinc,9
lplfinancial,9
netmagic,9
segurosmont,9
tmxgroup,9
axapartneres,8
cbs,8
firstdatac2,8
fwdmy,8
geisinger,8
gpaunzwaf,8
meggitt,8
scotgovare,8
ssd,8
teluscanada,8
vmmulesoft,8
aiahkofficeap,7
arca,7
cjispsj,7
fssa,7
ippl,7
kvatfoodcity,7
provident,7
statcasino,7
utahtransit,7
vwaf,7
axaphlocal,6
epuma,6
equifaxwebcoe,6
fednot,6
fwdid,6
korektel,6
oracleahealth,6
oraclemccd,6
oraclemglbank,6
oraclenyjc,6
parallex,6
spire,6
tcs,6
utmost,6
axapartnerit,5
axapartnerpt,5
colorcon,5
f5mktg,5
firstdatac1,5
lbs,5
mmc,5
mmi,5
nttgdcciplpl,5
oraclegibk,5
oracleweather,5
tilray,5
vadoe,5
a2a,4
acmecorp,4
aiaviet,4
axapartneruki,4
bluesnap,4
brewin,4
camerarpop,4
centralsq,4
dictngdc,4
equifaxoracle,4
f5tsvs6,4
fsvdedicated,4
hslchild,4
icbpi,4
isc2,4
kellyservices,4
mbtpl,4
mpcb,4
oracleesen,4
oraclehmshost,4
partnershold,4
piramal,4
qatarpost,4
sdccu,4
sicc,4
teraoreg,4
teravas,4
trafigura,4
uboc,4
vadoa,4
vavec,4
wpcu,4
aaawa,3
abletech,3
aiabc,3
axios,3
capita,3
dotai,3
hancock,3
inprs,3
iriworldwide,3
jdarpop,3
microlisa,3
oraclebt,3
oracleimh,3
qpaxprod,3
russell,3
scotcourts,3
seralberta,3
televisa,3
vadjj,3
vdh,3
vitol,3
wpd,3
ymcatoronto,3
amcreations,2
axapartnercee,2
barrsteel,2
becu,2
blueinsurance,2
cachecreek,2
cadmv,2
cbe,2
columbiafg,2
defensenet,2
dixons,2
dosproof,2
evolent,2
f5tsvs1,2
gic,2
kgispl,2
mednet,2
mph,2
nasa,2
nichd,2
nicmx,2
nmdws,2
nttjap,2
officemax,2
oraclenea,2
oraclenwrl,2
oracleobe,2
pgewaf,2
pretamanger,2
raleys,2
senkafian,2
sikaiagchild,2
tier2zpax,2
trafiglatam,2
websites,2
acmesyd,1
aiavitality,1
ancheim,1
axapartnerus,1
axiosrpop,1
babw,1
bankofcyprus,1
bertrandt,1
bezeqi,1
caliber,1
californiadof,1
central,1
cinfin,1
cybereco,1
dbm,1
dialogtech,1
ecb,1
equifaxoid,1
equifaxwallet,1
f5networks,1
f5tsvs10,1
firstdatac4,1
forrester,1
fwdtimseceng,1
globalpaywaf,1
gpcomwaf,1
hdb,1
highwire,1
hssapl,1
lgamerica,1
lplnonprod,1
macpaw,1
matrixcare,1
mdes,1
mipl,1
mmim,1
mtb,1
nccourt,1
neaodos,1
ngpspl,1
novafibre,1
nsrcc,1
odas,1
omw,1
opayinc,1
oraclels,1
oraclenzhp,1
orange1,1
ordancesurvb,1
partnerslatam,1
pbmit,1
pespl,1
plcb,1
printec,1
qpaxos2qa,1
resmedeu,1
saas,1
sbcourts,1
seutilities,1
smartns,1
stada,1
stanislaus,1
taconic,1
tatastarbucks,1
telusmobility,1
teramanitoba,1
ucop,1
veritasfin,1
virginmedia,1
watech,1
westconsol,1