Policy,Check Out Status,Check Out Job Status URI,Check In Status,Check In Job Status URI
f5soc-wafm_default,Completed,http://api.ss1-pdx.defense.net/api/v1/job-manager/jobs/9240973/intention,Completed,http://api.ss1-pdx.defense.net/api/v1/job-manager/jobs/9240995/intention
f5soc-iso_amended,Completed,http://api.ss1-pdx.defense.net/api/v1/job-manager/jobs/9240975/intention,Completed,http://api.ss1-pdx.defense.net/api/v1/job-manager/jobs/9240998/intention
f5soc-silverline_default,Completed,http://api.ss1-pdx.defense.net/api/v1/job-manager/jobs/9240977/intention,Completed,http://api.ss1-pdx.defense.net/api/v1/job-manager/jobs/9241001/intention
f5soc-f5soc_windows_server_2012,Completed,http://api.ss1-pdx.defense.net/api/v1/job-manager/jobs/9240979/intention,Completed,http://api.ss1-pdx.defense.net/api/v1/job-manager/jobs/9241004/intention
f5soc-dvwa_training_0820201,Completed,http://api.ss1-pdx.defense.net/api/v1/job-manager/jobs/9240981/intention,Completed,http://api.ss1-pdx.defense.net/api/v1/job-manager/jobs/9241013/intention
f5soc-waf_jchen,Completed,http://api.ss1-pdx.defense.net/api/v1/job-manager/jobs/9241022/intention,Completed,http://api.ss1-pdx.defense.net/api/v1/job-manager/jobs/9241038/intention
f5soc-AlexWafTest,Completed,http://api.ss1-pdx.defense.net/api/v1/job-manager/jobs/9241024/intention,Completed,http://api.ss1-pdx.defense.net/api/v1/job-manager/jobs/9241041/intention
f5soc-alejandrotestpolicy,Completed,http://api.ss1-pdx.defense.net/api/v1/job-manager/jobs/9241026/intention,Completed,http://api.ss1-pdx.defense.net/api/v1/job-manager/jobs/9241044/intention
f5soc-AlexV_WAF,Completed,http://api.ss1-pdx.defense.net/api/v1/job-manager/jobs/9241028/intention,Completed,http://api.ss1-pdx.defense.net/api/v1/job-manager/jobs/9241047/intention
f5soc-2018_iso_managed,Completed,http://api.ss1-pdx.defense.net/api/v1/job-manager/jobs/9241030/intention,Completed,http://api.ss1-pdx.defense.net/api/v1/job-manager/jobs/9241056/intention
f5soc-edgar_test_policy,Completed,http://api.ss1-pdx.defense.net/api/v1/job-manager/jobs/9241077/intention,Completed,http://api.ss1-pdx.defense.net/api/v1/job-manager/jobs/9241093/intention
f5soc-adam.policy,Completed,http://api.ss1-pdx.defense.net/api/v1/job-manager/jobs/9241079/intention,Completed,http://api.ss1-pdx.defense.net/api/v1/job-manager/jobs/9241096/intention
f5soc-2020_v14_testing,Completed,http://api.ss1-pdx.defense.net/api/v1/job-manager/jobs/9241081/intention,Completed,http://api.ss1-pdx.defense.net/api/v1/job-manager/jobs/9241099/intention
f5soc-ja3_transparent,Completed,http://api.ss1-pdx.defense.net/api/v1/job-manager/jobs/9241083/intention,Completed,http://api.ss1-pdx.defense.net/api/v1/job-manager/jobs/9241102/intention
f5soc-marek.aws,Completed,http://api.ss1-pdx.defense.net/api/v1/job-manager/jobs/9241085/intention,Completed,http://api.ss1-pdx.defense.net/api/v1/job-manager/jobs/9241105/intention
f5soc-Alberto_ISO8859_TEST,Completed,http://api.ss1-pdx.defense.net/api/v1/job-manager/jobs/9241171/intention,Completed,http://api.ss1-pdx.defense.net/api/v1/job-manager/jobs/9241187/intention
f5soc-Pau_Test,Completed,http://api.ss1-pdx.defense.net/api/v1/job-manager/jobs/9241174/intention,Completed,http://api.ss1-pdx.defense.net/api/v1/job-manager/jobs/9241190/intention
f5soc-george_login_page,Completed,http://api.ss1-pdx.defense.net/api/v1/job-manager/jobs/9241181/intention,Completed,http://api.ss1-pdx.defense.net/api/v1/job-manager/jobs/9241193/intention
f5soc-alex_test_01,Completed,http://api.ss1-pdx.defense.net/api/v1/job-manager/jobs/9241183/intention,Completed,http://api.ss1-pdx.defense.net/api/v1/job-manager/jobs/9241202/intention
f5soc-ipxv11,FAILED. Request the job status URI to investigate further.,http://api.ss1-pdx.defense.net/api/v1/job-manager/jobs/9241185/intention,Not attempted because policy failed check out.,N/A
f5soc-dixonsnemotest,FAILED. Request the job status URI to investigate further.,http://api.ss1-pdx.defense.net/api/v1/job-manager/jobs/9241205/intention,Not attempted because policy failed check out.,N/A
f5soc-ipexc_policymgr,FAILED. Request the job status URI to investigate further.,http://api.ss1-pdx.defense.net/api/v1/job-manager/jobs/9241207/intention,Not attempted because policy failed check out.,N/A
f5soc-exceptiontest,Completed,http://api.ss1-pdx.defense.net/api/v1/job-manager/jobs/9241209/intention,Completed,http://api.ss1-pdx.defense.net/api/v1/job-manager/jobs/9241233/intention
f5soc-pmgrscript,FAILED. Request the job status URI to investigate further.,http://api.ss1-pdx.defense.net/api/v1/job-manager/jobs/9241212/intention,Not attempted because policy failed check out.,N/A
f5soc-waf_kyle,Completed,http://api.ss1-pdx.defense.net/api/v1/job-manager/jobs/9241226/intention,Completed,http://api.ss1-pdx.defense.net/api/v1/job-manager/jobs/9241236/intention
f5soc-garmendia_testing,Completed,http://api.ss1-pdx.defense.net/api/v1/job-manager/jobs/9241239/intention,Completed,http://api.ss1-pdx.defense.net/api/v1/job-manager/jobs/9241255/intention
f5soc-mariusz_ema,Completed,http://api.ss1-pdx.defense.net/api/v1/job-manager/jobs/9241241/intention,Completed,http://api.ss1-pdx.defense.net/api/v1/job-manager/jobs/9241258/intention
f5soc-wpcharlie2,Completed,http://api.ss1-pdx.defense.net/api/v1/job-manager/jobs/9241249/intention,Completed,http://api.ss1-pdx.defense.net/api/v1/job-manager/jobs/9241275/intention
f5soc-dansito_test_policy,Completed,http://api.ss1-pdx.defense.net/api/v1/job-manager/jobs/9241251/intention,Completed,http://api.ss1-pdx.defense.net/api/v1/job-manager/jobs/9241278/intention
f5soc-Alberto_Transparent,Completed,http://api.ss1-pdx.defense.net/api/v1/job-manager/jobs/9241253/intention,Completed,http://api.ss1-pdx.defense.net/api/v1/job-manager/jobs/9241281/intention
f5soc-Akamai_policy_test,Completed,http://api.ss1-pdx.defense.net/api/v1/job-manager/jobs/9241284/intention,Completed,http://api.ss1-pdx.defense.net/api/v1/job-manager/jobs/9241300/intention
f5soc-Nic_Testing,Completed,http://api.ss1-pdx.defense.net/api/v1/job-manager/jobs/9241286/intention,Completed,http://api.ss1-pdx.defense.net/api/v1/job-manager/jobs/9241303/intention
f5soc-Nic_Test,Completed,http://api.ss1-pdx.defense.net/api/v1/job-manager/jobs/9241294/intention,Completed,http://api.ss1-pdx.defense.net/api/v1/job-manager/jobs/9241326/intention
f5soc-DiegoWAFpolicy,Completed,http://api.ss1-pdx.defense.net/api/v1/job-manager/jobs/9241296/intention,Completed,http://api.ss1-pdx.defense.net/api/v1/job-manager/jobs/9241329/intention
f5soc-sasitest,Completed,http://api.ss1-pdx.defense.net/api/v1/job-manager/jobs/9241298/intention,Completed,http://api.ss1-pdx.defense.net/api/v1/job-manager/jobs/9241332/intention
f5soc-viewstate,Completed,http://api.ss1-pdx.defense.net/api/v1/job-manager/jobs/9241347/intention,Completed,http://api.ss1-pdx.defense.net/api/v1/job-manager/jobs/9241365/intention
f5soc-test_pawel,Completed,http://api.ss1-pdx.defense.net/api/v1/job-manager/jobs/9241349/intention,Completed,http://api.ss1-pdx.defense.net/api/v1/job-manager/jobs/9241368/intention
f5soc-felipePolicy2,Completed,http://api.ss1-pdx.defense.net/api/v1/job-manager/jobs/9241359/intention,Completed,http://api.ss1-pdx.defense.net/api/v1/job-manager/jobs/9241371/intention
f5soc-Avi_WAF_Policy_Test,Completed,http://api.ss1-pdx.defense.net/api/v1/job-manager/jobs/9241361/intention,Completed,http://api.ss1-pdx.defense.net/api/v1/job-manager/jobs/9241374/intention
f5soc-os_linked_data,Completed,http://api.ss1-pdx.defense.net/api/v1/job-manager/jobs/9241363/intention,Completed,http://api.ss1-pdx.defense.net/api/v1/job-manager/jobs/9241377/intention
f5soc-Sianko_WAF_TEST,Completed,http://api.ss1-pdx.defense.net/api/v1/job-manager/jobs/9241386/intention,Completed,http://api.ss1-pdx.defense.net/api/v1/job-manager/jobs/9241404/intention
f5soc-Wednesday_test_policy,Completed,http://api.ss1-pdx.defense.net/api/v1/job-manager/jobs/9241388/intention,Completed,http://api.ss1-pdx.defense.net/api/v1/job-manager/jobs/9241413/intention
f5soc-Monday_policy,Completed,http://api.ss1-pdx.defense.net/api/v1/job-manager/jobs/9241398/intention,Completed,http://api.ss1-pdx.defense.net/api/v1/job-manager/jobs/9241416/intention
f5soc-wojtek_policy,Completed,http://api.ss1-pdx.defense.net/api/v1/job-manager/jobs/9241400/intention,Completed,http://api.ss1-pdx.defense.net/api/v1/job-manager/jobs/9241419/intention
f5soc-test_poc_Ale,Completed,http://api.ss1-pdx.defense.net/api/v1/job-manager/jobs/9241402/intention,Completed,http://api.ss1-pdx.defense.net/api/v1/job-manager/jobs/9241422/intention
f5soc-test_managed_Ale,Completed,http://api.ss1-pdx.defense.net/api/v1/job-manager/jobs/9241431/intention,Completed,http://api.ss1-pdx.defense.net/api/v1/job-manager/jobs/9241447/intention
f5soc-felipe_policy,Completed,http://api.ss1-pdx.defense.net/api/v1/job-manager/jobs/9241439/intention,Completed,http://api.ss1-pdx.defense.net/api/v1/job-manager/jobs/9241450/intention
f5soc-sasi_test,Completed,http://api.ss1-pdx.defense.net/api/v1/job-manager/jobs/9241441/intention,Completed,http://api.ss1-pdx.defense.net/api/v1/job-manager/jobs/9241453/intention
f5soc-blocking_test,Completed,http://api.ss1-pdx.defense.net/api/v1/job-manager/jobs/9241443/intention,Completed,http://api.ss1-pdx.defense.net/api/v1/job-manager/jobs/9241456/intention
f5soc-Szczypinska_test_policy,Completed,http://api.ss1-pdx.defense.net/api/v1/job-manager/jobs/9241445/intention,Completed,http://api.ss1-pdx.defense.net/api/v1/job-manager/jobs/9241459/intention
f5soc-imported_xml_test,Completed,http://api.ss1-pdx.defense.net/api/v1/job-manager/jobs/9241468/intention,Completed,http://api.ss1-pdx.defense.net/api/v1/job-manager/jobs/9241478/intention
f5soc-TechR_PROD,Completed,http://api.ss1-pdx.defense.net/api/v1/job-manager/jobs/9241470/intention,Completed,http://api.ss1-pdx.defense.net/api/v1/job-manager/jobs/9241481/intention
f5soc-__F5SL_Managed_WAF_UTF8_2023,Completed,http://api.ss1-pdx.defense.net/api/v1/job-manager/jobs/9241472/intention,Completed,http://api.ss1-pdx.defense.net/api/v1/job-manager/jobs/9241484/intention
f5soc-__F5SL_Managed_WAF_ISO8859_2023,Completed,http://api.ss1-pdx.defense.net/api/v1/job-manager/jobs/9241474/intention,Completed,http://api.ss1-pdx.defense.net/api/v1/job-manager/jobs/9241487/intention
f5soc-automation_test_1,Completed,http://api.ss1-pdx.defense.net/api/v1/job-manager/jobs/9241476/intention,Completed,http://api.ss1-pdx.defense.net/api/v1/job-manager/jobs/9241490/intention
f5soc-automation_test_2,Completed,http://api.ss1-pdx.defense.net/api/v1/job-manager/jobs/9241511/intention,Completed,http://api.ss1-pdx.defense.net/api/v1/job-manager/jobs/9241527/intention
f5soc-automation_test_4_pawel,Completed,http://api.ss1-pdx.defense.net/api/v1/job-manager/jobs/9241513/intention,Completed,http://api.ss1-pdx.defense.net/api/v1/job-manager/jobs/9241530/intention
f5soc-automation_test_5,Completed,http://api.ss1-pdx.defense.net/api/v1/job-manager/jobs/9241515/intention,Completed,http://api.ss1-pdx.defense.net/api/v1/job-manager/jobs/9241533/intention
f5soc-auto_frankowski_1_iso,Completed,http://api.ss1-pdx.defense.net/api/v1/job-manager/jobs/9241523/intention,Completed,http://api.ss1-pdx.defense.net/api/v1/job-manager/jobs/9241542/intention
f5soc-modern_test,Completed,http://api.ss1-pdx.defense.net/api/v1/job-manager/jobs/9241525/intention,Completed,http://api.ss1-pdx.defense.net/api/v1/job-manager/jobs/9241545/intention
f5soc-ESC57793,Completed,http://api.ss1-pdx.defense.net/api/v1/job-manager/jobs/9241554/intention,Completed,http://api.ss1-pdx.defense.net/api/v1/job-manager/jobs/9241570/intention
f5soc-ana_training,Completed,http://api.ss1-pdx.defense.net/api/v1/job-manager/jobs/9241562/intention,Completed,http://api.ss1-pdx.defense.net/api/v1/job-manager/jobs/9241573/intention
f5soc-Ale_training,Completed,http://api.ss1-pdx.defense.net/api/v1/job-manager/jobs/9241564/intention,Completed,http://api.ss1-pdx.defense.net/api/v1/job-manager/jobs/9241582/intention
f5soc-Vee_test,Completed,http://api.ss1-pdx.defense.net/api/v1/job-manager/jobs/9241566/intention,Completed,http://api.ss1-pdx.defense.net/api/v1/job-manager/jobs/9241585/intention
f5soc-Maribel_training,Completed,http://api.ss1-pdx.defense.net/api/v1/job-manager/jobs/9241568/intention,Completed,http://api.ss1-pdx.defense.net/api/v1/job-manager/jobs/9241588/intention
f5soc-Justin_Training,Completed,http://api.ss1-pdx.defense.net/api/v1/job-manager/jobs/9241597/intention,Completed,http://api.ss1-pdx.defense.net/api/v1/job-manager/jobs/9241607/intention
f5soc-threatcamps,Completed,http://api.ss1-pdx.defense.net/api/v1/job-manager/jobs/9241599/intention,Completed,http://api.ss1-pdx.defense.net/api/v1/job-manager/jobs/9241616/intention
f5soc-syme_waf_validation,Completed,http://api.ss1-pdx.defense.net/api/v1/job-manager/jobs/9241601/intention,Completed,http://api.ss1-pdx.defense.net/api/v1/job-manager/jobs/9241619/intention
f5soc-Justin_Public_AWS_C_Default,Completed,http://api.ss1-pdx.defense.net/api/v1/job-manager/jobs/9241603/intention,Completed,http://api.ss1-pdx.defense.net/api/v1/job-manager/jobs/9241622/intention
f5soc-waf_kyle_2023,Completed,http://api.ss1-pdx.defense.net/api/v1/job-manager/jobs/9241605/intention,Completed,http://api.ss1-pdx.defense.net/api/v1/job-manager/jobs/9241625/intention
f5soc-maribel_new_test_policy,Completed,http://api.ss1-pdx.defense.net/api/v1/job-manager/jobs/9241648/intention,Completed,http://api.ss1-pdx.defense.net/api/v1/job-manager/jobs/9241664/intention
f5soc-ACG_test_Policy,Completed,http://api.ss1-pdx.defense.net/api/v1/job-manager/jobs/9241650/intention,Completed,http://api.ss1-pdx.defense.net/api/v1/job-manager/jobs/9241667/intention
f5soc-felipePolicyclone,Completed,http://api.ss1-pdx.defense.net/api/v1/job-manager/jobs/9241652/intention,Completed,http://api.ss1-pdx.defense.net/api/v1/job-manager/jobs/9241670/intention
f5soc-nat_wafpolicy,Completed,http://api.ss1-pdx.defense.net/api/v1/job-manager/jobs/9241654/intention,Completed,http://api.ss1-pdx.defense.net/api/v1/job-manager/jobs/9241673/intention
f5soc-scantarget,Completed,http://api.ss1-pdx.defense.net/api/v1/job-manager/jobs/9241662/intention,Completed,http://api.ss1-pdx.defense.net/api/v1/job-manager/jobs/9241690/intention
f5soc-filip_poc,Completed,http://api.ss1-pdx.defense.net/api/v1/job-manager/jobs/9241699/intention,Completed,http://api.ss1-pdx.defense.net/api/v1/job-manager/jobs/9241731/intention
f5soc-filip_managed,Completed,http://api.ss1-pdx.defense.net/api/v1/job-manager/jobs/9241707/intention,Completed,http://api.ss1-pdx.defense.net/api/v1/job-manager/jobs/9241734/intention
f5soc-haines_waf_test,Completed,http://api.ss1-pdx.defense.net/api/v1/job-manager/jobs/9241709/intention,Completed,http://api.ss1-pdx.defense.net/api/v1/job-manager/jobs/9241745/intention
f5soc-niki_waf_test,Completed,http://api.ss1-pdx.defense.net/api/v1/job-manager/jobs/9241711/intention,Completed,http://api.ss1-pdx.defense.net/api/v1/job-manager/jobs/9241748/intention
f5soc-automation_test_8,Completed,http://api.ss1-pdx.defense.net/api/v1/job-manager/jobs/9241713/intention,Completed,http://api.ss1-pdx.defense.net/api/v1/job-manager/jobs/9241751/intention
f5soc-automation_test_9,Completed,http://api.ss1-pdx.defense.net/api/v1/job-manager/jobs/9241766/intention,Completed,http://api.ss1-pdx.defense.net/api/v1/job-manager/jobs/9241776/intention
f5soc-wojtek_test,Completed,http://api.ss1-pdx.defense.net/api/v1/job-manager/jobs/9241768/intention,Completed,http://api.ss1-pdx.defense.net/api/v1/job-manager/jobs/9241785/intention
f5soc-juan_salinas_waf_test,Completed,http://api.ss1-pdx.defense.net/api/v1/job-manager/jobs/9241770/intention,Completed,http://api.ss1-pdx.defense.net/api/v1/job-manager/jobs/9241788/intention
f5soc-NaserBotrus_WAF_policy,Completed,http://api.ss1-pdx.defense.net/api/v1/job-manager/jobs/9241772/intention,Completed,http://api.ss1-pdx.defense.net/api/v1/job-manager/jobs/9241791/intention
f5soc-default_test,Completed,http://api.ss1-pdx.defense.net/api/v1/job-manager/jobs/9241774/intention,Completed,http://api.ss1-pdx.defense.net/api/v1/job-manager/jobs/9241794/intention
f5soc-sathish_WAF_policy_test,Completed,http://api.ss1-pdx.defense.net/api/v1/job-manager/jobs/9241866/intention,Completed,http://api.ss1-pdx.defense.net/api/v1/job-manager/jobs/9241896/intention
f5soc-Fehzan.waf.policy,Completed,http://api.ss1-pdx.defense.net/api/v1/job-manager/jobs/9241868/intention,Completed,http://api.ss1-pdx.defense.net/api/v1/job-manager/jobs/9241899/intention
f5soc-xctemplate,Completed,http://api.ss1-pdx.defense.net/api/v1/job-manager/jobs/9241870/intention,Completed,http://api.ss1-pdx.defense.net/api/v1/job-manager/jobs/9241908/intention
f5soc-sl_template,Completed,http://api.ss1-pdx.defense.net/api/v1/job-manager/jobs/9241892/intention,Completed,http://api.ss1-pdx.defense.net/api/v1/job-manager/jobs/9241911/intention
f5soc-allow_all_GEO_WAF_Policy,Completed,http://api.ss1-pdx.defense.net/api/v1/job-manager/jobs/9241894/intention,Completed,http://api.ss1-pdx.defense.net/api/v1/job-manager/jobs/9241914/intention
f5soc-allow_only_romania,Completed,http://api.ss1-pdx.defense.net/api/v1/job-manager/jobs/9241935/intention,Completed,http://api.ss1-pdx.defense.net/api/v1/job-manager/jobs/9241951/intention
f5soc-charlie_utf_2023,Completed,http://api.ss1-pdx.defense.net/api/v1/job-manager/jobs/9241937/intention,Completed,http://api.ss1-pdx.defense.net/api/v1/job-manager/jobs/9241954/intention
f5soc-basetest,Completed,http://api.ss1-pdx.defense.net/api/v1/job-manager/jobs/9241939/intention,Completed,http://api.ss1-pdx.defense.net/api/v1/job-manager/jobs/9241957/intention
f5soc-haines_waf_base,Completed,http://api.ss1-pdx.defense.net/api/v1/job-manager/jobs/9241941/intention,Completed,http://api.ss1-pdx.defense.net/api/v1/job-manager/jobs/9241960/intention
f5soc-haines_waf_modified1,Completed,http://api.ss1-pdx.defense.net/api/v1/job-manager/jobs/9241949/intention,Completed,http://api.ss1-pdx.defense.net/api/v1/job-manager/jobs/9241963/intention
f5soc-new_policy_oct,Completed,http://api.ss1-pdx.defense.net/api/v1/job-manager/jobs/9241992/intention,Completed,http://api.ss1-pdx.defense.net/api/v1/job-manager/jobs/9242008/intention
f5soc-wildparam,Completed,http://api.ss1-pdx.defense.net/api/v1/job-manager/jobs/9241994/intention,Completed,http://api.ss1-pdx.defense.net/api/v1/job-manager/jobs/9242011/intention
f5soc-guillo_training,Completed,http://api.ss1-pdx.defense.net/api/v1/job-manager/jobs/9241996/intention,Completed,http://api.ss1-pdx.defense.net/api/v1/job-manager/jobs/9242014/intention
f5soc-jonathan_training,Completed,http://api.ss1-pdx.defense.net/api/v1/job-manager/jobs/9241998/intention,Completed,http://api.ss1-pdx.defense.net/api/v1/job-manager/jobs/9242017/intention
f5soc-arlette_training,Completed,http://api.ss1-pdx.defense.net/api/v1/job-manager/jobs/9242000/intention,Completed,http://api.ss1-pdx.defense.net/api/v1/job-manager/jobs/9242020/intention
f5soc-piotr_test,Completed,http://api.ss1-pdx.defense.net/api/v1/job-manager/jobs/9242035/intention,Completed,http://api.ss1-pdx.defense.net/api/v1/job-manager/jobs/9242072/intention
f5soc-Aman_WAF_Policy_UTF,Completed,http://api.ss1-pdx.defense.net/api/v1/job-manager/jobs/9242037/intention,Completed,http://api.ss1-pdx.defense.net/api/v1/job-manager/jobs/9242075/intention
f5soc-niki_baseline,Completed,http://api.ss1-pdx.defense.net/api/v1/job-manager/jobs/9242047/intention,Completed,http://api.ss1-pdx.defense.net/api/v1/job-manager/jobs/9242078/intention
f5soc-juan_base,Completed,http://api.ss1-pdx.defense.net/api/v1/job-manager/jobs/9242062/intention,Completed,http://api.ss1-pdx.defense.net/api/v1/job-manager/jobs/9242081/intention
f5soc-ewa_test_now,Completed,http://api.ss1-pdx.defense.net/api/v1/job-manager/jobs/9242064/intention,Completed,http://api.ss1-pdx.defense.net/api/v1/job-manager/jobs/9242084/intention
f5soc-DiegoWAF_transparent,Completed,http://api.ss1-pdx.defense.net/api/v1/job-manager/jobs/9242099/intention,Completed,http://api.ss1-pdx.defense.net/api/v1/job-manager/jobs/9242111/intention
f5soc-barttest_123,Completed,http://api.ss1-pdx.defense.net/api/v1/job-manager/jobs/9242107/intention,Completed,http://api.ss1-pdx.defense.net/api/v1/job-manager/jobs/9242114/intention
f5soc-Clone_Aman_WAF_Policy,Completed,http://api.ss1-pdx.defense.net/api/v1/job-manager/jobs/9242109/intention,Completed,http://api.ss1-pdx.defense.net/api/v1/job-manager/jobs/9242117/intention