{
  "__type__": "cc.AnimationClip",
  "_name": "GameOverAnimation",
  "_objFlags": 0,
  "_native": "",
  "_duration": 1.5333333333333334,
  "sample": 60,
  "speed": 1,
  "wrapMode": 1,
  "curveData": {
    "props": {
      "opacity": [
        {
          "frame": 0,
          "value": 0
        },
        {
          "frame": 1.5,
          "value": 252
        },
        {
          "frame": 1.5166666666666666,
          "value": 255
        },
        {
          "frame": 1.5333333333333334,
          "value": 252
        }
      ],
      "color": [
        {
          "frame": 0,
          "value": {
            "__type__": "cc.Color",
            "r": 40,
            "g": 66,
            "b": 41,
            "a": 255
          }
        },
        {
          "frame": 1.5,
          "value": {
            "__type__": "cc.Color",
            "r": 0,
            "g": 78,
            "b": 12,
            "a": 255
          }
        },
        {
          "frame": 1.5166666666666666,
          "value": {
            "__type__": "cc.Color",
            "r": 0,
            "g": 77,
            "b": 12,
            "a": 255
          }
        },
        {
          "frame": 1.5333333333333334,
          "value": {
            "__type__": "cc.Color",
            "r": 0,
            "g": 80,
            "b": 13,
            "a": 255
          }
        }
      ]
    }
  },
  "events": []
}