<?xml version="1.0" encoding="UTF-8" standalone="no"?>
<!-- Created with Inkscape (http://www.inkscape.org/) -->

<svg
   xmlns:dc="http://purl.org/dc/elements/1.1/"
   xmlns:cc="http://creativecommons.org/ns#"
   xmlns:rdf="http://www.w3.org/1999/02/22-rdf-syntax-ns#"
   xmlns:svg="http://www.w3.org/2000/svg"
   xmlns="http://www.w3.org/2000/svg"
   xmlns:xlink="http://www.w3.org/1999/xlink"
   xmlns:sodipodi="http://sodipodi.sourceforge.net/DTD/sodipodi-0.dtd"
   xmlns:inkscape="http://www.inkscape.org/namespaces/inkscape"
   width="96"
   height="96"
   id="svg7387"
   sodipodi:version="0.32"
   inkscape:version="0.91 r"
   sodipodi:docname="mintupdatex-error.svg"
   inkscape:output_extension="org.inkscape.output.svg.inkscape"
   version="1.1">
  <defs
     id="defs7389">
    <linearGradient
       inkscape:collect="always"
       id="linearGradient5185">
      <stop
         style="stop-color:#000000;stop-opacity:1;"
         offset="0"
         id="stop5187" />
      <stop
         style="stop-color:#000000;stop-opacity:0;"
         offset="1"
         id="stop5189" />
    </linearGradient>
    <linearGradient
       inkscape:collect="always"
       id="linearGradient5177">
      <stop
         style="stop-color:#000000;stop-opacity:1;"
         offset="0"
         id="stop5179" />
      <stop
         style="stop-color:#000000;stop-opacity:0;"
         offset="1"
         id="stop5181" />
    </linearGradient>
    <inkscape:perspective
       sodipodi:type="inkscape:persp3d"
       inkscape:vp_x="0 : 24 : 1"
       inkscape:vp_y="0 : 1000 : 0"
       inkscape:vp_z="48 : 24 : 1"
       inkscape:persp3d-origin="24 : 16 : 1"
       id="perspective34" />
    <radialGradient
       inkscape:collect="always"
       xlink:href="#linearGradient11494"
       id="radialGradient3213"
       gradientUnits="userSpaceOnUse"
       gradientTransform="matrix(1.341804,0,0,1.341804,-9.425986,-5.222852)"
       cx="27.577173"
       cy="15.048258"
       fx="27.577173"
       fy="15.048258"
       r="3.8335035" />
    <linearGradient
       id="linearGradient11494"
       inkscape:collect="always">
      <stop
         id="stop11496"
         offset="0"
         style="stop-color:#ef2929;stop-opacity:1;" />
      <stop
         id="stop11498"
         offset="1"
         style="stop-color:#ef2929;stop-opacity:0;" />
    </linearGradient>
    <radialGradient
       inkscape:collect="always"
       xlink:href="#linearGradient11494"
       id="radialGradient3211"
       gradientUnits="userSpaceOnUse"
       gradientTransform="matrix(1.478479,0,0,1.478479,-13.1951,-7.329062)"
       cx="27.577173"
       cy="15.258821"
       fx="27.577173"
       fy="15.258821"
       r="3.8335035" />
    <linearGradient
       id="linearGradient2660">
      <stop
         style="stop-color:#edeeec;stop-opacity:1;"
         offset="0"
         id="stop2662" />
      <stop
         style="stop-color:#babdb6;stop-opacity:1;"
         offset="1"
         id="stop2664" />
    </linearGradient>
    <radialGradient
       inkscape:collect="always"
       xlink:href="#linearGradient2660"
       id="radialGradient3209"
       gradientUnits="userSpaceOnUse"
       gradientTransform="matrix(4.072994,0,0,2.874492,-48.88488,-43.21542)"
       cx="17.62042"
       cy="21.610504"
       fx="17.62042"
       fy="21.610504"
       r="7.9999995" />
    <linearGradient
       id="linearGradient15653">
      <stop
         style="stop-color:#f0f1ee;stop-opacity:1;"
         offset="0"
         id="stop15655" />
      <stop
         style="stop-color:#d5d9d1;stop-opacity:1;"
         offset="1"
         id="stop15657" />
    </linearGradient>
    <radialGradient
       inkscape:collect="always"
       xlink:href="#linearGradient15653"
       id="radialGradient3207"
       gradientUnits="userSpaceOnUse"
       gradientTransform="matrix(1.616548,0,0,1.708051,-14.02647,-8.007523)"
       cx="22.75"
       cy="10.250003"
       fx="22.75"
       fy="10.250003"
       r="19.875" />
    <linearGradient
       inkscape:collect="always"
       id="linearGradient15679">
      <stop
         style="stop-color:#000000;stop-opacity:1;"
         offset="0"
         id="stop15681" />
      <stop
         style="stop-color:#000000;stop-opacity:0;"
         offset="1"
         id="stop15683" />
    </linearGradient>
    <radialGradient
       inkscape:collect="always"
       xlink:href="#linearGradient15679"
       id="radialGradient15685"
       cx="23.3125"
       cy="40.9375"
       fx="23.3125"
       fy="40.9375"
       r="17.1875"
       gradientTransform="matrix(1,0,0,0.316364,0,27.98636)"
       gradientUnits="userSpaceOnUse" />
    <linearGradient
       gradientUnits="userSpaceOnUse"
       y2="25.265627"
       x2="52.122673"
       y1="25.265627"
       x1="8.6878576"
       id="linearGradient5341"
       xlink:href="#linearGradient5335"
       inkscape:collect="always" />
    <linearGradient
       y2="19.776045"
       x2="11.881318"
       y1="37.904068"
       x1="49.412277"
       gradientUnits="userSpaceOnUse"
       id="linearGradient8174"
       xlink:href="#linearGradient8152"
       inkscape:collect="always" />
    <linearGradient
       gradientUnits="userSpaceOnUse"
       y2="19.776045"
       x2="11.881318"
       y1="37.904068"
       x1="49.412277"
       id="linearGradient8158"
       xlink:href="#linearGradient8152"
       inkscape:collect="always" />
    <linearGradient
       id="linearGradient2831">
      <stop
         id="stop2833"
         offset="0"
         style="stop-color:#3465a4;stop-opacity:1;" />
      <stop
         style="stop-color:#5b86be;stop-opacity:1;"
         offset="0.33333334"
         id="stop2855" />
      <stop
         id="stop2835"
         offset="1"
         style="stop-color:#83a8d8;stop-opacity:0;" />
    </linearGradient>
    <linearGradient
       id="linearGradient3207">
      <stop
         id="stop3209"
         offset="0"
         style="stop-color:#eeeeec;stop-opacity:0.47058824;" />
      <stop
         id="stop3211"
         offset="1"
         style="stop-color:#eeeeec;stop-opacity:0;" />
    </linearGradient>
    <linearGradient
       id="linearGradient8152">
      <stop
         id="stop8154"
         offset="0"
         style="stop-color:#3465a4;stop-opacity:1;" />
      <stop
         style="stop-color:#4f7eba;stop-opacity:1;"
         offset="0.5"
         id="stop3174" />
      <stop
         id="stop8156"
         offset="1"
         style="stop-color:#729fcf;stop-opacity:1;" />
    </linearGradient>
    <linearGradient
       id="linearGradient5313">
      <stop
         style="stop-color:#99b8df;stop-opacity:1"
         offset="0"
         id="stop5315" />
      <stop
         id="stop5333"
         offset="0.23705086"
         style="stop-color:#3969a8;stop-opacity:1;" />
      <stop
         id="stop5317"
         offset="0.54706067"
         style="stop-color:#4f7eba;stop-opacity:1;" />
      <stop
         style="stop-color:#96b6d7;stop-opacity:1"
         offset="0.74557692"
         id="stop5321" />
      <stop
         id="stop5331"
         offset="0.87321436"
         style="stop-color:#a0bddc;stop-opacity:1" />
      <stop
         style="stop-color:#729fcf;stop-opacity:1;"
         offset="1"
         id="stop5319" />
    </linearGradient>
    <linearGradient
       id="linearGradient5335"
       inkscape:collect="always">
      <stop
         id="stop5337"
         offset="0"
         style="stop-color:#ffffff;stop-opacity:1;" />
      <stop
         id="stop5339"
         offset="1"
         style="stop-color:#ffffff;stop-opacity:0;" />
    </linearGradient>
    <inkscape:perspective
       id="perspective2889"
       inkscape:persp3d-origin="24 : 16 : 1"
       inkscape:vp_z="48 : 24 : 1"
       inkscape:vp_y="0 : 1000 : 0"
       inkscape:vp_x="0 : 24 : 1"
       sodipodi:type="inkscape:persp3d" />
    <linearGradient
       id="linearGradient1731">
      <stop
         style="stop-color:#b8d67a;stop-opacity:1"
         offset="0"
         id="stop1733" />
      <stop
         style="stop-color:#789e2d;stop-opacity:1;"
         offset="1"
         id="stop1735" />
    </linearGradient>
    <inkscape:perspective
       id="perspective2989"
       inkscape:persp3d-origin="24 : 16 : 1"
       inkscape:vp_z="48 : 24 : 1"
       inkscape:vp_y="0 : 1000 : 0"
       inkscape:vp_x="0 : 24 : 1"
       sodipodi:type="inkscape:persp3d" />
    <linearGradient
       id="linearGradient3533">
      <stop
         offset="0"
         style="stop-color:#729fcf;stop-opacity:1"
         id="stop3535" />
      <stop
         offset="1"
         style="stop-color:#3465a4;stop-opacity:1"
         id="stop3545" />
    </linearGradient>
    <linearGradient
       id="linearGradient3266">
      <stop
         id="stop3268"
         offset="0"
         style="stop-color:#204a87;stop-opacity:1" />
      <stop
         id="stop3270"
         offset="1"
         style="stop-color:#204a87;stop-opacity:0" />
    </linearGradient>
    <linearGradient
       id="linearGradient3319">
      <stop
         id="stop3321"
         offset="0"
         style="stop-color:#ffffff;stop-opacity:0;" />
      <stop
         style="stop-color:#ffffff;stop-opacity:0.14383562;"
         offset="0.57424062"
         id="stop3323" />
      <stop
         id="stop3325"
         offset="1"
         style="stop-color:#ffffff;stop-opacity:0;" />
    </linearGradient>
    <inkscape:perspective
       id="perspective3125"
       inkscape:persp3d-origin="24 : 16 : 1"
       inkscape:vp_z="48 : 24 : 1"
       inkscape:vp_y="0 : 1000 : 0"
       inkscape:vp_x="0 : 24 : 1"
       sodipodi:type="inkscape:persp3d" />
    <inkscape:perspective
       id="perspective3398"
       inkscape:persp3d-origin="24 : 16 : 1"
       inkscape:vp_z="48 : 24 : 1"
       inkscape:vp_y="0 : 1000 : 0"
       inkscape:vp_x="0 : 24 : 1"
       sodipodi:type="inkscape:persp3d" />
    <linearGradient
       id="linearGradient5252">
      <stop
         style="stop-color:#fed496;stop-opacity:1;"
         offset="0"
         id="stop5256" />
      <stop
         style="stop-color:#fcaf3e;stop-opacity:1;"
         offset="1"
         id="stop5254" />
    </linearGradient>
    <linearGradient
       id="linearGradient11223"
       gradientUnits="userSpaceOnUse"
       x1="4.1914001"
       y1="11.1133"
       x2="47.319698"
       y2="56.052299">
      <stop
         offset="0"
         style="stop-color:#ffffff;stop-opacity:1;"
         id="stop11225" />
      <stop
         offset="1"
         style="stop-color:#ffffff;stop-opacity:0"
         id="stop11227" />
    </linearGradient>
    <inkscape:perspective
       id="perspective3527"
       inkscape:persp3d-origin="24 : 16 : 1"
       inkscape:vp_z="48 : 24 : 1"
       inkscape:vp_y="0 : 1000 : 0"
       inkscape:vp_x="0 : 24 : 1"
       sodipodi:type="inkscape:persp3d" />
    <linearGradient
       id="linearGradient3690">
      <stop
         style="stop-color:white;stop-opacity:1;"
         offset="0"
         id="stop3692" />
      <stop
         style="stop-color:white;stop-opacity:0.46875"
         offset="1"
         id="stop3694" />
    </linearGradient>
    <linearGradient
       id="linearGradient3674">
      <stop
         style="stop-color:#555753;stop-opacity:1"
         offset="0"
         id="stop3676" />
      <stop
         style="stop-color:#888a85;stop-opacity:1"
         offset="1"
         id="stop3678" />
    </linearGradient>
    <linearGradient
       id="linearGradient2781">
      <stop
         style="stop-color:#d3d7cf;stop-opacity:1"
         offset="0"
         id="stop2783" />
      <stop
         style="stop-color:#eeeeec;stop-opacity:1"
         offset="1"
         id="stop2785" />
    </linearGradient>
    <linearGradient
       id="linearGradient51765">
      <stop
         style="stop-color:#000000;stop-opacity:1"
         offset="0"
         id="stop51767" />
      <stop
         style="stop-color:#000000;stop-opacity:0"
         offset="1"
         id="stop51769" />
    </linearGradient>
    <linearGradient
       id="linearGradient47870">
      <stop
         style="stop-color:#000000;stop-opacity:0"
         offset="0"
         id="stop47872" />
      <stop
         style="stop-color:#000000;stop-opacity:1"
         offset="0.5"
         id="stop47878" />
      <stop
         style="stop-color:#000000;stop-opacity:0"
         offset="1"
         id="stop47874" />
    </linearGradient>
    <linearGradient
       id="linearGradient2378">
      <stop
         style="stop-color:#ffffff;stop-opacity:1;"
         offset="0"
         id="stop2380" />
      <stop
         id="stop4146"
         offset="0.25"
         style="stop-color:#fefede;stop-opacity:0.91836733;" />
      <stop
         id="stop2386"
         offset="0.5"
         style="stop-color:#f5f328;stop-opacity:1;" />
      <stop
         style="stop-color:#f5f32d;stop-opacity:0.12234043;"
         offset="1"
         id="stop2382" />
    </linearGradient>
    <inkscape:perspective
       id="perspective3624"
       inkscape:persp3d-origin="24 : 16 : 1"
       inkscape:vp_z="48 : 24 : 1"
       inkscape:vp_y="0 : 1000 : 0"
       inkscape:vp_x="0 : 24 : 1"
       sodipodi:type="inkscape:persp3d" />
    <radialGradient
       r="10.982252"
       fy="15.746525"
       fx="11.026446"
       cy="15.746525"
       cx="11.026446"
       gradientTransform="matrix(1,0,0,0.4889336,0,8.0475196)"
       gradientUnits="userSpaceOnUse"
       id="radialGradient8567"
       xlink:href="#linearGradient3383"
       inkscape:collect="always" />
    <linearGradient
       id="linearGradient3383"
       inkscape:collect="always">
      <stop
         id="stop3385"
         offset="0"
         style="stop-color:#000000;stop-opacity:1;" />
      <stop
         id="stop3387"
         offset="1"
         style="stop-color:#000000;stop-opacity:0;" />
    </linearGradient>
    <radialGradient
       gradientUnits="userSpaceOnUse"
       gradientTransform="matrix(-0.9906918,0.9838734,-0.9873672,-0.9911854,14.34067,-13.780844)"
       r="15.17675"
       fy="-3.1232908"
       fx="6.484127"
       cy="-3.1232908"
       cx="6.484127"
       id="radialGradient2766"
       xlink:href="#linearGradient2760"
       inkscape:collect="always" />
    <linearGradient
       id="linearGradient2760">
      <stop
         id="stop2762"
         offset="0"
         style="stop-color:#fff6aa;stop-opacity:1" />
      <stop
         style="stop-color:#fce94f;stop-opacity:1"
         offset="0.56428707"
         id="stop1884" />
      <stop
         id="stop2764"
         offset="1"
         style="stop-color:#fcaf3e;stop-opacity:1" />
    </linearGradient>
    <linearGradient
       gradientUnits="userSpaceOnUse"
       y2="21.047073"
       x2="11.000734"
       y1="-7.5773058"
       x1="11.000734"
       id="linearGradient7955"
       xlink:href="#linearGradient7948"
       inkscape:collect="always" />
    <linearGradient
       id="linearGradient7948"
       inkscape:collect="always">
      <stop
         id="stop7950"
         offset="0"
         style="stop-color:#c4a000;stop-opacity:1;" />
      <stop
         id="stop7953"
         offset="1"
         style="stop-color:#ce5c00;stop-opacity:1" />
    </linearGradient>
    <linearGradient
       gradientUnits="userSpaceOnUse"
       y2="20.587196"
       x2="11"
       y1="-7.0623527"
       x1="11"
       id="linearGradient7956"
       xlink:href="#linearGradient7950"
       inkscape:collect="always" />
    <linearGradient
       id="linearGradient7950"
       inkscape:collect="always">
      <stop
         id="stop7952"
         offset="0"
         style="stop-color:#ffffff;stop-opacity:1;" />
      <stop
         id="stop7954"
         offset="1"
         style="stop-color:#ffffff;stop-opacity:0;" />
    </linearGradient>
    <inkscape:perspective
       id="perspective3713"
       inkscape:persp3d-origin="24 : 16 : 1"
       inkscape:vp_z="48 : 24 : 1"
       inkscape:vp_y="0 : 1000 : 0"
       inkscape:vp_x="0 : 24 : 1"
       sodipodi:type="inkscape:persp3d" />
    <radialGradient
       r="7.228416"
       fy="73.615715"
       fx="6.702713"
       cy="73.615715"
       cx="6.702713"
       gradientTransform="scale(1.902215,0.525703)"
       gradientUnits="userSpaceOnUse"
       id="radialGradient3080"
       xlink:href="#linearGradient10691"
       inkscape:collect="always" />
    <linearGradient
       inkscape:collect="always"
       id="linearGradient10691">
      <stop
         style="stop-color:#000000;stop-opacity:1;"
         offset="0"
         id="stop10693" />
      <stop
         style="stop-color:#000000;stop-opacity:0;"
         offset="1"
         id="stop10695" />
    </linearGradient>
    <radialGradient
       r="9.7552834"
       fy="-5.7132163"
       fx="62.202274"
       cy="-5.7132163"
       cx="62.202274"
       gradientTransform="matrix(-7.565785,-6.219707e-7,3.9644633e-7,-4.8230546,494.60904,-26.555114)"
       gradientUnits="userSpaceOnUse"
       id="radialGradient2707"
       xlink:href="#linearGradient5106"
       inkscape:collect="always" />
    <linearGradient
       id="linearGradient5106">
      <stop
         id="stop5108"
         offset="0"
         style="stop-color:#8fb3d9;stop-opacity:1" />
      <stop
         style="stop-color:#729fcf;stop-opacity:1"
         offset="0.25288007"
         id="stop8208" />
      <stop
         id="stop8210"
         offset="0.68271071"
         style="stop-color:#3465a4;stop-opacity:1" />
      <stop
         id="stop5110"
         offset="1"
         style="stop-color:#204a87;stop-opacity:1" />
    </linearGradient>
    <linearGradient
       gradientTransform="matrix(1.0805272,0,0,1.0805026,-1.5082857,-3.3507598)"
       gradientUnits="userSpaceOnUse"
       y2="3.8851264"
       x2="15.046636"
       y1="44.787998"
       x1="15.046636"
       id="linearGradient3927"
       xlink:href="#linearGradient3811"
       inkscape:collect="always" />
    <linearGradient
       id="linearGradient3811">
      <stop
         style="stop-color:#204a87;stop-opacity:1"
         offset="0"
         id="stop3813" />
      <stop
         style="stop-color:#3465a4;stop-opacity:1"
         offset="1"
         id="stop3815" />
    </linearGradient>
    <linearGradient
       y2="7.1072145"
       x2="62.608765"
       y1="-13.444987"
       x1="62.745731"
       gradientTransform="matrix(2.3440063,0,0,2.3440063,-121.79862,31.22942)"
       gradientUnits="userSpaceOnUse"
       id="linearGradient2704"
       xlink:href="#linearGradient4873"
       inkscape:collect="always" />
    <linearGradient
       id="linearGradient4873"
       inkscape:collect="always">
      <stop
         id="stop4875"
         offset="0"
         style="stop-color:#ffffff;stop-opacity:1;" />
      <stop
         id="stop4877"
         offset="1"
         style="stop-color:#ffffff;stop-opacity:0;" />
    </linearGradient>
    <inkscape:perspective
       id="perspective3786"
       inkscape:persp3d-origin="24 : 16 : 1"
       inkscape:vp_z="48 : 24 : 1"
       inkscape:vp_y="0 : 1000 : 0"
       inkscape:vp_x="0 : 24 : 1"
       sodipodi:type="inkscape:persp3d" />
    <radialGradient
       inkscape:collect="always"
       xlink:href="#linearGradient2660"
       id="radialGradient2949"
       gradientUnits="userSpaceOnUse"
       gradientTransform="matrix(8.2058966,0,0,5.6072569,-97.6306,-129.8057)"
       cx="17.62042"
       cy="21.610504"
       fx="17.62042"
       fy="21.610504"
       r="7.9999995" />
    <radialGradient
       inkscape:collect="always"
       xlink:href="#linearGradient15653"
       id="radialGradient2953"
       gradientUnits="userSpaceOnUse"
       gradientTransform="matrix(3.2568734,0,0,3.3318864,-31.458385,-57.380604)"
       cx="22.75"
       cy="10.250003"
       fx="22.75"
       fy="10.250003"
       r="19.875" />
    <linearGradient
       inkscape:collect="always"
       xlink:href="#linearGradient5177"
       id="linearGradient5183"
       x1="24.001118"
       y1="60.65036"
       x2="24.001118"
       y2="0.97107655"
       gradientUnits="userSpaceOnUse"
       gradientTransform="matrix(2.0021174,0,0,1.9506949,-0.0985049,-46.480945)" />
    <linearGradient
       inkscape:collect="always"
       xlink:href="#linearGradient5185"
       id="linearGradient5191"
       x1="24.001118"
       y1="60.65036"
       x2="24.001118"
       y2="0.97107655"
       gradientUnits="userSpaceOnUse"
       gradientTransform="matrix(2.0021174,0,0,1.9506949,-0.0985049,-46.480945)" />
    <radialGradient
       r="10.31934"
       fy="35.127438"
       fx="23.070683"
       cy="35.127438"
       cx="23.070683"
       gradientTransform="matrix(0.914812,0.01265023,-0.00821502,0.213562,2.253914,27.18889)"
       gradientUnits="userSpaceOnUse"
       id="radialGradient2177"
       xlink:href="#linearGradient5185"
       inkscape:collect="always" />
    <radialGradient
       gradientUnits="userSpaceOnUse"
       gradientTransform="matrix(-2.1314195e-8,2.5479117,-4.8841578,-2.2328085e-8,144.16406,-10.748097)"
       r="18.500046"
       fy="24.500458"
       fx="6.5734448"
       cy="24.500458"
       cx="6.5734448"
       id="radialGradient7958"
       xlink:href="#linearGradient3165"
       inkscape:collect="always" />
    <linearGradient
       id="linearGradient3165">
      <stop
         id="stop3167"
         offset="0"
         style="stop-color:#e78181;stop-opacity:1" />
      <stop
         style="stop-color:#e15f5f;stop-opacity:1"
         offset="0.25"
         id="stop8599" />
      <stop
         id="stop8601"
         offset="0.68000001"
         style="stop-color:#c22f2f;stop-opacity:1" />
      <stop
         id="stop3169"
         offset="1"
         style="stop-color:#a40000;stop-opacity:1" />
    </linearGradient>
    <linearGradient
       gradientUnits="userSpaceOnUse"
       y2="43.000458"
       x2="23.099995"
       y1="6.0004601"
       x1="23.172504"
       id="linearGradient7961"
       xlink:href="#linearGradient7955-8"
       inkscape:collect="always" />
    <linearGradient
       id="linearGradient7955-8"
       inkscape:collect="always">
      <stop
         id="stop7957"
         offset="0"
         style="stop-color:#c22f2f;stop-opacity:1" />
      <stop
         id="stop7959"
         offset="1"
         style="stop-color:#a40000;stop-opacity:1" />
    </linearGradient>
    <linearGradient
       y2="36.296539"
       x2="12.717501"
       y1="17.041941"
       x1="31.972097"
       gradientTransform="matrix(1.0494758,-1.0494758,1.0494758,1.0494758,-26.939092,23.169297)"
       gradientUnits="userSpaceOnUse"
       id="linearGradient3005"
       xlink:href="#linearGradient5335"
       inkscape:collect="always" />
  </defs>
  <sodipodi:namedview
     id="base"
     pagecolor="#ffffff"
     bordercolor="#666666"
     borderopacity="1.0"
     inkscape:pageopacity="0.0"
     inkscape:pageshadow="2"
     inkscape:zoom="1.6020388"
     inkscape:cx="152.74554"
     inkscape:cy="44.294857"
     inkscape:current-layer="g3215"
     showgrid="false"
     inkscape:grid-bbox="true"
     inkscape:document-units="px"
     inkscape:window-width="1410"
     inkscape:window-height="851"
     inkscape:window-x="222"
     inkscape:window-y="102"
     inkscape:window-maximized="0"
     inkscape:snap-global="false">
    <inkscape:grid
       type="xygrid"
       id="grid4273" />
  </sodipodi:namedview>
  <metadata
     id="metadata7392">
    <rdf:RDF>
      <cc:Work
         rdf:about="">
        <dc:format>image/svg+xml</dc:format>
        <dc:type
           rdf:resource="http://purl.org/dc/dcmitype/StillImage" />
        <dc:title></dc:title>
      </cc:Work>
    </rdf:RDF>
  </metadata>
  <g
     id="layer1"
     inkscape:label="Layer 1"
     inkscape:groupmode="layer"
     transform="translate(0,48)">
    <g
       id="g3215"
       transform="translate(-1.5095767e-4,0)">
      <g
         id="g4274"
         transform="translate(4.0573299,-3.7452276)">
        <path
           inkscape:connector-curvature="0"
           inkscape:r_cy="true"
           inkscape:r_cx="true"
           style="display:block;overflow:visible;visibility:visible;fill:url(#radialGradient2953);fill-opacity:1;fill-rule:nonzero;stroke:#888a85;stroke-width:1.00000012;stroke-linecap:round;stroke-linejoin:round;stroke-miterlimit:4;stroke-dasharray:none;stroke-dashoffset:0;stroke-opacity:1;marker:none"
           d="M 43.139166,-35.908285 C 28.228374,-25.030067 4.8597,-18.352031 4.8597,-18.352031 c 6.044126,50.230394 39.034981,62.422237 39.034981,62.422237 0,0 32.487177,-12.679517 39.034982,-63.153747 0,0 -28.205922,-9.997312 -39.790497,-16.824744 z"
           id="path15651"
           sodipodi:nodetypes="ccccc" />
      </g>
      <path
         style="display:block;overflow:visible;visibility:visible;fill:none;stroke:#ffffff;stroke-width:1.00000012;stroke-linecap:round;stroke-linejoin:round;stroke-miterlimit:4;stroke-dasharray:none;stroke-dashoffset:0;stroke-opacity:1;marker:none"
         d="m 47.24569,-38.246358 c -13.973006,10.194054 -36.977077,17.035844 -36.977077,17.035844 5.663993,47.071253 37.69366,60.159904 37.69366,60.159904 0,0 31.53773,-13.583279 37.673719,-60.883034 0,0 -27.534315,-9.91468 -38.390302,-16.312714 z"
         id="path15665"
         sodipodi:nodetypes="ccccc"
         inkscape:r_cx="true"
         inkscape:r_cy="true"
         inkscape:connector-curvature="0" />
      <path
         inkscape:r_cy="true"
         inkscape:r_cx="true"
         sodipodi:nodetypes="cccc"
         id="path15667"
         d="M 46.960754,-34.499009 47.181444,35.15 c 0,0 -26.693965,-14.211471 -34.1112,-54.670007 22.437107,-5.452086 33.89051,-14.979002 33.89051,-14.979002 z"
         style="display:block;overflow:visible;visibility:visible;fill:url(#radialGradient2949);fill-opacity:1;fill-rule:nonzero;stroke:none;stroke-width:1.00000024;marker:none"
         inkscape:connector-curvature="0" />
      <path
         style="fill:url(#linearGradient5183);fill-opacity:1;stroke:url(#linearGradient5191);stroke-width:0.49999997;stroke-miterlimit:4;stroke-dasharray:none;stroke-opacity:1"
         d="M 45.109235,39.490238 C 30.333925,31.740958 18.344629,16.25069 12.355674,-3.1140476 10.208051,-10.05819 8.3591916,-19.851302 8.4724194,-22.285793 c 0.1965539,-0.224533 3.0933486,-1.101041 4.6153706,-1.589261 12.323463,-3.953017 24.426077,-9.668032 31.783382,-14.70706 1.203773,-0.824465 2.151404,-1.609372 2.341861,-1.609372 0.190461,0 1.485526,0.842825 2.844205,1.586357 6.008358,3.288047 17.048223,7.900424 31.857531,13.411084 2.748234,1.02264 5.474812,1.901589 5.520655,2.185905 0.09015,0.559072 -0.105119,1.820016 -1.208814,7.748215 -4.088092,21.958042 -15.047085,40.233214 -30.162045,51.336647 -2.159952,1.586701 -7.545206,4.727755 -8.105819,4.720486 -0.165855,-0.0021 -1.319387,-0.504456 -2.849511,-1.30697 z m 6.610693,-1.496214 c 9.731964,-5.709842 19.038984,-16.173234 24.88504,-27.619592 3.073757,-6.018289 6.115207,-14.2151143 7.757205,-21.321654 0.693155,-2.999957 2.250875,-11.424905 2.131434,-11.529544 -0.02971,-0.02602 -3.958778,-1.413436 -8.284781,-3.057602 -10.778864,-4.096678 -18.926986,-7.489806 -25.34742,-10.604268 -2.977743,-1.444461 -5.499757,-2.929742 -5.621333,-2.929742 -0.121569,0 -1.293706,0.936235 -2.284426,1.60849 -7.115762,4.828423 -19.863902,10.951064 -32.157171,14.682754 l -3.3434477,1.014922 0.3273425,1.978462 c 0.2262112,1.936851 1.3195952,8.138644 2.3941172,12.3104453 5.356321,20.7957607 16.97726,37.1199387 32.731857,45.8629687 1.193633,0.662409 2.781834,1.300458 3.094407,1.305171 0.31257,0.0047 2.084461,-0.742879 3.717176,-1.700811 z"
         id="path3727"
         inkscape:connector-curvature="0"
         sodipodi:nodetypes="cscssssssssccccsscssssscsssc" />
      <g
         inkscape:label="Layer 1"
         id="layer1-7"
         transform="matrix(1.0869565,0,0,1.0584392,20.513181,-27.750937)">
        <ellipse
           ry="2.320194"
           rx="10.31934"
           cy="34.94062"
           cx="22.958872"
           transform="matrix(2.2288248,0,0,1.9190478,-27.171303,-25.505284)"
           id="path1361"
           style="opacity:0.2557078;fill:url(#radialGradient2177);fill-opacity:1;stroke:none" />
        <path
           inkscape:connector-curvature="0"
           sodipodi:nodetypes="ccccccccccccc"
           id="text1314"
           d="m 42.5,35.000459 -10.50009,-11 10.500001,-10 L 34.99991,6.5004602 24.499911,17.000459 13.999912,6.5004602 6.4999133,14.000459 l 10.4999977,10 -10.4999977,11 7.4999987,7.499999 10.499999,-10.5 9.5,10.5 L 42.5,35.000459 Z"
           style="font-style:normal;font-variant:normal;font-weight:bold;font-stretch:normal;font-size:59.90107727px;line-height:125%;font-family:'Bitstream Vera Sans';text-align:start;writing-mode:lr-tb;text-anchor:start;fill:url(#radialGradient7958);fill-opacity:1;stroke:url(#linearGradient7961);stroke-width:0.50669092;stroke-linecap:butt;stroke-linejoin:round;stroke-miterlimit:4;stroke-dasharray:none;stroke-opacity:1" />
        <path
           inkscape:connector-curvature="0"
           sodipodi:nodetypes="ccccccccccccc"
           id="path7076"
           d="m 41,35.000459 -10.50009,-11 10.5,-10 -6,-5.9999998 L 24.50022,18.500459 13.999912,8.0004592 7.9999123,14.000459 l 10.4999987,10 -10.4999987,11 5.9999997,6 10.499999,-10.5 L 34,41 41,35.000459 Z"
           style="font-style:normal;font-variant:normal;font-weight:bold;font-stretch:normal;font-size:59.90107727px;line-height:125%;font-family:'Bitstream Vera Sans';text-align:start;writing-mode:lr-tb;text-anchor:start;opacity:0.4;fill:none;stroke:url(#linearGradient3005);stroke-width:0.50669092;stroke-linecap:butt;stroke-linejoin:round;stroke-miterlimit:4;stroke-dasharray:none;stroke-opacity:1" />
      </g>
    </g>
  </g>
</svg>
