{
  "smart-system.gaiamobile.org": {
    "origin": "app://smart-system.gaiamobile.org",
    "installOrigin": "app://smart-system.gaiamobile.org",
    "receipt": null,
    "installTime": 1448425623401,
    "updateTime": 1448425623401,
    "manifestURL": "app://smart-system.gaiamobile.org/manifest.webapp",
    "localId": 1,
    "appStatus": 3,
    "manifestHash": "ed8248b475d1b3871ff345c47c03bd35"
  },
  "smart-settings.gaiamobile.org": {
    "origin": "app://smart-settings.gaiamobile.org",
    "installOrigin": "app://smart-settings.gaiamobile.org",
    "receipt": null,
    "installTime": 1448425623401,
    "updateTime": 1448425623401,
    "manifestURL": "app://smart-settings.gaiamobile.org/manifest.webapp",
    "localId": 2,
    "appStatus": 3,
    "manifestHash": "e89438a50ae65d907ea393587128210b"
  },
  "smart-home.gaiamobile.org": {
    "origin": "app://smart-home.gaiamobile.org",
    "installOrigin": "app://smart-home.gaiamobile.org",
    "receipt": null,
    "installTime": 1448425623401,
    "updateTime": 1448425623401,
    "manifestURL": "app://smart-home.gaiamobile.org/manifest.webapp",
    "localId": 3,
    "appStatus": 3,
    "manifestHash": "c106f9cfde113f10fd9c4fad1c1ca108"
  },
  "browser.gaiamobile.org": {
    "origin": "app://browser.gaiamobile.org",
    "installOrigin": "app://browser.gaiamobile.org",
    "receipt": null,
    "installTime": 1448425623401,
    "updateTime": 1448425623401,
    "manifestURL": "app://browser.gaiamobile.org/manifest.webapp",
    "localId": 4,
    "appStatus": 3,
    "manifestHash": "a3b8aa509aa4c326f835ebd8b58db5d1"
  },
  "tv-deck.gaiamobile.org": {
    "origin": "app://tv-deck.gaiamobile.org",
    "installOrigin": "app://tv-deck.gaiamobile.org",
    "receipt": null,
    "installTime": 1448425623401,
    "updateTime": 1448425623401,
    "manifestURL": "app://tv-deck.gaiamobile.org/manifest.webapp",
    "localId": 5,
    "appStatus": 3,
    "manifestHash": "bfeab26b3a62c987490473a04410d856"
  },
  "tv-epg.gaiamobile.org": {
    "origin": "app://tv-epg.gaiamobile.org",
    "installOrigin": "app://tv-epg.gaiamobile.org",
    "receipt": null,
    "installTime": 1448425623401,
    "updateTime": 1448425623401,
    "manifestURL": "app://tv-epg.gaiamobile.org/manifest.webapp",
    "localId": 6,
    "appStatus": 3,
    "manifestHash": "756629cd5afd21b290b2ede71f3e8e38"
  },
  "app-deck.gaiamobile.org": {
    "origin": "app://app-deck.gaiamobile.org",
    "installOrigin": "app://app-deck.gaiamobile.org",
    "receipt": null,
    "installTime": 1448425623401,
    "updateTime": 1448425623401,
    "manifestURL": "app://app-deck.gaiamobile.org/manifest.webapp",
    "localId": 7,
    "appStatus": 3,
    "manifestHash": "224399d2a8982d57b643b42953e88c56"
  },
  "device-deck.gaiamobile.org": {
    "origin": "app://device-deck.gaiamobile.org",
    "installOrigin": "app://device-deck.gaiamobile.org",
    "receipt": null,
    "installTime": 1448425623401,
    "updateTime": 1448425623401,
    "manifestURL": "app://device-deck.gaiamobile.org/manifest.webapp",
    "localId": 8,
    "appStatus": 3,
    "manifestHash": "4fdae320d8b64f1dfcc706c0099bf94b"
  },
  "dashboard.gaiamobile.org": {
    "origin": "app://dashboard.gaiamobile.org",
    "installOrigin": "app://dashboard.gaiamobile.org",
    "receipt": null,
    "installTime": 1448425623401,
    "updateTime": 1448425623401,
    "manifestURL": "app://dashboard.gaiamobile.org/manifest.webapp",
    "localId": 9,
    "appStatus": 3,
    "manifestHash": "ff7e523bb616adf627b3b747033ba310"
  },
  "dlna-player.gaiamobile.org": {
    "origin": "app://dlna-player.gaiamobile.org",
    "installOrigin": "app://dlna-player.gaiamobile.org",
    "receipt": null,
    "installTime": 1448425623401,
    "updateTime": 1448425623401,
    "manifestURL": "app://dlna-player.gaiamobile.org/manifest.webapp",
    "localId": 10,
    "appStatus": 3,
    "manifestHash": "759271fd078ef134fa5cb7baee2ad6e4"
  },
  "fling-player.gaiamobile.org": {
    "origin": "app://fling-player.gaiamobile.org",
    "installOrigin": "app://fling-player.gaiamobile.org",
    "receipt": null,
    "installTime": 1448425623401,
    "updateTime": 1448425623401,
    "manifestURL": "app://fling-player.gaiamobile.org/manifest.webapp",
    "localId": 11,
    "appStatus": 3,
    "manifestHash": "8577ebd5d83c4036b02195376d557260"
  },
  "notification-receiver.gaiamobile.org": {
    "origin": "app://notification-receiver.gaiamobile.org",
    "installOrigin": "app://notification-receiver.gaiamobile.org",
    "receipt": null,
    "installTime": 1448425623401,
    "updateTime": 1448425623401,
    "manifestURL": "app://notification-receiver.gaiamobile.org/manifest.webapp",
    "localId": 12,
    "appStatus": 3,
    "manifestHash": "c097434463ea1f0d23c228d9ed97dd3f"
  },
  "weather-widget.gaiamobile.org": {
    "origin": "app://weather-widget.gaiamobile.org",
    "installOrigin": "app://weather-widget.gaiamobile.org",
    "receipt": null,
    "installTime": 1448425623401,
    "updateTime": 1448425623401,
    "manifestURL": "app://weather-widget.gaiamobile.org/manifest.webapp",
    "localId": 13,
    "appStatus": 3,
    "manifestHash": "7f61b424934da8327b438f54370f6618"
  },
  "fling-tutorial.gaiamobile.org": {
    "origin": "app://fling-tutorial.gaiamobile.org",
    "installOrigin": "app://fling-tutorial.gaiamobile.org",
    "receipt": null,
    "installTime": 1448425623401,
    "updateTime": 1448425623401,
    "manifestURL": "app://fling-tutorial.gaiamobile.org/manifest.webapp",
    "localId": 14,
    "appStatus": 3,
    "manifestHash": "bb41becaaea270c258fe6586a265f2ca"
  },
  "remote-control.gaiamobile.org": {
    "origin": "app://remote-control.gaiamobile.org",
    "installOrigin": "app://remote-control.gaiamobile.org",
    "receipt": null,
    "installTime": 1448425623401,
    "updateTime": 1448425623401,
    "manifestURL": "app://remote-control.gaiamobile.org/manifest.webapp",
    "localId": 15,
    "appStatus": 3,
    "manifestHash": "23d56af094e3d6a53e023419132f9d3e"
  },
  "remote-control-client.gaiamobile.org": {
    "origin": "app://remote-control-client.gaiamobile.org",
    "installOrigin": "app://remote-control-client.gaiamobile.org",
    "receipt": null,
    "installTime": 1448425623401,
    "updateTime": 1448425623401,
    "manifestURL": "app://remote-control-client.gaiamobile.org/manifest.webapp",
    "localId": 16,
    "appStatus": 3,
    "manifestHash": "c29245fd30001df9cc8f262092e73476"
  },
  "marketplace.firefox.com": {
    "origin": "app://marketplace.firefox.com",
    "installOrigin": "https://marketplace.firefox.com",
    "receipt": null,
    "installTime": 1448425623401,
    "updateTime": 1448425623401,
    "manifestURL": "https://marketplace.firefox.com/packaged.webapp",
    "removable": false,
    "localId": 17,
    "etag": "\"2676c5e93248619106d35c706f0edc1e6c5a4a80c9418458b0605ea1f34c01c6\"",
    "packageEtag": "\"9c6e8d1c3821e0ffcc7322f995bb299022b007e8745dcb857a9d2991871aba0b\"",
    "appStatus": 2,
    "manifestHash": "8ca59a32d5ecbf1d7690cb559839312b"
  },
  "sync.gaiamobile.org": {
    "origin": "app://sync.gaiamobile.org",
    "installOrigin": "app://sync.gaiamobile.org",
    "receipt": null,
    "installTime": 1448425623401,
    "updateTime": 1448425623401,
    "manifestURL": "app://sync.gaiamobile.org/manifest.webapp",
    "localId": 18,
    "appStatus": 3,
    "manifestHash": "dd3b4569d0c37643269b5511b7531e39"
  }
}