{
 "check_memory": false, 
 "enable_e10s": false, 
 "is-sdk-bundled": false, 
 "jetpackID": "fxos_1_4_simulator@mozilla.org", 
 "loader": "addon-sdk/lib/sdk/loader/cuddlefish.js", 
 "main": "main", 
 "mainPath": "fxos_1_4_simulator/main", 
 "manifest": {
  "fxos_1_4_simulator/main": {
   "docsSHA256": null, 
   "jsSHA256": "8a08b76a5526702f7fe8f99c5b8008ec4181a91428c0dff4a1752341af32853c", 
   "moduleName": "main", 
   "packageName": "fxos_1_4_simulator", 
   "requirements": {
    "./simulator-process": "fxos_1_4_simulator/simulator-process", 
    "chrome": "chrome", 
    "sdk/core/promise": "sdk/core/promise", 
    "sdk/self": "sdk/self", 
    "sdk/system": "sdk/system", 
    "sdk/system/unload": "sdk/system/unload"
   }, 
   "sectionName": "lib"
  }, 
  "fxos_1_4_simulator/simulator-process": {
   "docsSHA256": null, 
   "jsSHA256": "a290aa1d9d3ad746846ce9824acd12bb259a4519d3d76031bced94deddb667d7", 
   "moduleName": "simulator-process", 
   "packageName": "fxos_1_4_simulator", 
   "requirements": {
    "@loader/options": "@loader/options", 
    "chrome": "chrome", 
    "sdk/core/heritage": "sdk/core/heritage", 
    "sdk/core/promise": "sdk/core/promise", 
    "sdk/event/core": "sdk/event/core", 
    "sdk/event/target": "sdk/event/target", 
    "sdk/self": "sdk/self", 
    "sdk/simple-prefs": "sdk/simple-prefs", 
    "sdk/system/environment": "sdk/system/environment", 
    "sdk/system/runtime": "sdk/system/runtime", 
    "sdk/url": "sdk/url", 
    "subprocess": "subprocess/subprocess"
   }, 
   "sectionName": "lib"
  }, 
  "subprocess/subprocess": {
   "docsSHA256": null, 
   "jsSHA256": "664c2686f3fe62d9fc8ae0385338eeea00ab3e7e35531c792f50eeb147c605ec", 
   "moduleName": "subprocess", 
   "packageName": "subprocess", 
   "requirements": {
    "chrome": "chrome", 
    "sdk/system/environment": "sdk/system/environment", 
    "sdk/system/runtime": "sdk/system/runtime", 
    "subprocess_worker_unix.js": "subprocess/subprocess_worker_unix", 
    "subprocess_worker_win.js": "subprocess/subprocess_worker_win"
   }, 
   "sectionName": "lib"
  }, 
  "subprocess/subprocess_worker_unix": {
   "docsSHA256": null, 
   "jsSHA256": "b3637f3c3514fa73c55ecb313d9a821c6327ca1ea0e0f7c006e8d1495da53eb8", 
   "moduleName": "subprocess_worker_unix.js", 
   "packageName": "subprocess", 
   "requirements": {}, 
   "sectionName": "lib"
  }, 
  "subprocess/subprocess_worker_win": {
   "docsSHA256": null, 
   "jsSHA256": "7668fdd35733df98de7227a80c11384ff237758fd5dfd2a7d3209ab595f61775", 
   "moduleName": "subprocess_worker_win.js", 
   "packageName": "subprocess", 
   "requirements": {}, 
   "sectionName": "lib"
  }
 }, 
 "metadata": {
  "addon-sdk": {
   "description": "Add-on development made easy.", 
   "keywords": [
    "javascript", 
    "engine", 
    "addon", 
    "extension", 
    "xulrunner", 
    "firefox", 
    "browser"
   ], 
   "license": "MPL 2.0", 
   "name": "addon-sdk"
  }, 
  "fxos_1_4_simulator": {
   "author": "Myk Melez (https://github.com/mykmelez)", 
   "contributors": [
    "Alexandre Poirot (https://github.com/ochameau)", 
    "Anant Narayanan (https://github.com/anantn)", 
    "Brandon Kase (https://github.com/bkase)", 
    "Breck Yunits (https://github.com/breck7)", 
    "C\u00e9sar Carruitero (https://github.com/ccarruitero)", 
    "David Gomes (https://github.com/davidgomes)", 
    "Fabrice Desr\u00e9 (https://github.com/fabricedesre)", 
    "Fraser Tweedale (https://github.com/frasertweedale)", 
    "Harald Kirschner (https://github.com/digitarald)", 
    "J\u00e9r\u00e9mie Patonnier (https://github.com/JeremiePat)", 
    "J. Ryan Stinnett (https://github.com/jryans)", 
    "Kan-Ru Chen (\u9673\u4f83\u5982) (https://github.com/kanru)", 
    "Louis Stowasser (https://github.com/louisstow)", 
    "Luca Greco (https://github.com/rpl)", 
    "Matthew Claypotch (https://github.com/potch)", 
    "Matthew Riley MacPherson (https://github.com/tofumatt)", 
    "Nick Desaulniers (https://github.com/nickdesaulniers)", 
    "Soumen Ganguly (https://github.com/SoumenG)", 
    "Sudheesh Singanamalla (https://github.com/sudheesh001)", 
    "Victor Bjelkholm (https://github.com/VictorBjelkholm)"
   ], 
   "description": "a Firefox OS 1.4 simulator", 
   "license": "MPL 2.0", 
   "main": "main", 
   "name": "fxos_1_4_simulator", 
   "permissions": {
    "private-browsing": true
   }, 
   "version": "1.4.20140506"
  }, 
  "subprocess": {
   "author": "Alexandre Poirot", 
   "contributors": [
    "Jan Gerber (original creator) <j@mailb.org>", 
    "Patrick Brunschwig (author of almost all code) <patrick@mozilla-enigmail.org>", 
    "Ramalingam Saravanan (from enigmail team) <svn@xmlterm.org>"
   ], 
   "description": "Addon-sdk package for subprocess xpcom components from enigmail. Allow to run process, manipulate stdin/out and kill it.", 
   "license": "MPL 1.1/GPL 2.0/LGPL 2.1", 
   "name": "subprocess", 
   "version": "0.1.1"
  }
 }, 
 "name": "fxos_1_4_simulator", 
 "parseable": false, 
 "preferences": [
  {
   "name": "gaiaProfile", 
   "title": "Select a custom Gaia profile directory", 
   "type": "directory"
  }, 
  {
   "name": "customRuntime", 
   "title": "Select a custom runtime executable", 
   "type": "file"
  }
 ], 
 "preferencesBranch": "fxos_1_4_simulator@mozilla.org", 
 "sdkVersion": "unknown", 
 "staticArgs": {
  "label": "Firefox OS 1.4"
 }, 
 "verbose": false
}