{
  "uol.com.br": "Mozilla/5.0 (Linux; Android 4.0.4; Galaxy Nexus Build/IMM76B) AppleWebKit/535.19 (KHTML, like Gecko) Chrome/18.0.1025.133 Mobile Safari/535.19",
  "globo.com": "\\(Mobile#(Android; Mobile",
  "yahoo.com": "\\(Mobile#(Android; Mobile",
  "mercadolivre.com.br": "\\(Mobile#(Android; Mobile",
  "ig.com.br": "\\(Mobile#(Android; Mobile",
  "abril.com.br": "\\(Mobile#(Android; Mobile",
  "msn.com": "Mozilla/5.0 (Linux; Android 4.0.4; Galaxy Nexus Build/IMM76B) AppleWebKit/535.19 (KHTML, like Gecko) Chrome/18.0.1025.133 Mobile Safari/535.19",
  "linkedin.com": "Mozilla/5.0 (Linux; Android 4.0.4; Galaxy Nexus Build/IMM76B) AppleWebKit/535.19 (KHTML, like Gecko) Chrome/18.0.1025.133 Mobile Safari/535.19",
  "itau.com.br": "\\(Mobile#(Android; Mobile",
  "orkut.com.br": "Mozilla/5.0 (Linux; Android 4.0.4; Galaxy Nexus Build/IMM76B) AppleWebKit/535.19 (KHTML, like Gecko) Chrome/18.0.1025.133 Mobile Safari/535.19",
  "r7.com": "\\(Mobile#(Android; Mobile",
  "estadao.com.br": "\\(Mobile#(Android; Mobile",
  "letras.mus.br": "Mozilla/5.0 (Linux; Android 4.0.4; Galaxy Nexus Build/IMM76B) AppleWebKit/535.19 (KHTML, like Gecko) Chrome/18.0.1025.133 Mobile Safari/535.19",
  "bb.com.br": "\\(Mobile#(Android; Mobile",
  "orkut.com": "Mozilla/5.0 (Linux; Android 4.0.4; Galaxy Nexus Build/IMM76B) AppleWebKit/535.19 (KHTML, like Gecko) Chrome/18.0.1025.133 Mobile Safari/535.19",
  "noticias.uol.com.br": "\\(Mobile#(Android; Mobile",
  "olx.com.br": "\\(Mobile#(Android; Mobile",
  "techtudo.com.br": "\\(Mobile#(Android; Mobile",
  "ebay.com": "\\(Mobile#(Android; Mobile",
  "bing.com": "\\(Mobile#(Android; Mobile",
  "pagseguro.uol.com.br": "\\(Mobile#(Android; Mobile",
  "magazineluiza.com.br": "\\(Mobile#(Android; Mobile",
  "bol.uol.com.br": "Mozilla/5.0 (Linux; Android 4.0.4; Galaxy Nexus Build/IMM76B) AppleWebKit/535.19 (KHTML, like Gecko) Chrome/18.0.1025.133 Mobile Safari/535.19",
  "groupon.com.br": "\\(Mobile#(Android; Mobile",
  "vagalume.com.br": "\\(Mobile#(Android; Mobile",
  "climatempo.com.br": "\\(Mobile#(Android; Mobile",
  "tecmundo.com.br": "\\(Mobile#(Android; Mobile",
  "hao123.com": "\\(Mobile#(Android; Mobile",
  "lancenet.com.br": "\\(Mobile#(Android; Mobile",
  "webmotors.com.br": "\\(Mobile#(Android; Mobile",
  "mercadolibre.com.co": "\\(Mobile#(Android; Mobile",
  "elespectador.com": "\\(Mobile#(Android; Mobile",
  "scribd.com": "\\(Mobile#(Android; Mobile",
  "elpais.com.co": "Mozilla/5.0 (Linux; Android 4.0.4; Galaxy Nexus Build/IMM76B) AppleWebKit/535.19 (KHTML, like Gecko) Chrome/18.0.1025.133 Mobile Safari/535.19",
  "olx.com.co": "\\(Mobile#(Android; Mobile",
  "avianca.com": "\\(Mobile#(Android; Mobile",
  "marca.com": "\\(Mobile#(Android; Mobile",
  "gazeta.pl": "\\(Mobile#(Android; Mobile",
  "sport.pl": "\\(Mobile#(Android; Mobile",
  "nk.pl": "\\(Mobile#(Android; Mobile",
  "wyborcza.biz": "\\(Mobile#(Android; Mobile",
  "money.pl": "\\(Mobile#(Android; Mobile",
  "ingbank.pl": "\\(Mobile#(Android; Mobile",
  "wyborcza.pl": "\\(Mobile#(Android; Mobile",
  "deser.pl": "\\(Mobile#(Android; Mobile",
  "ebay.es": "\\(Mobile#(Android; Mobile",
  "infojobs.net": "\\(Mobile#(Android; Mobile",
  "antena3.com": "\\(Mobile#(Android; Mobile",
  "ingdirect.es": "\\(Mobile#(Android; Mobile",
  "fotocasa.es": "\\(Mobile#(Android; Mobile",
  "orange.es": "\\(Mobile#(Android; Mobile",
  "paginasamarillas.es": "\\(Mobile#(Android; Mobile",
  "loteriasyapuestas.es": "\\(Mobile#(Android; Mobile",
  "bbva.es": "\\(Mobile#(Android; Mobile",
  "publico.es": "\\(Mobile#(Android; Mobile",
  "mercadolibre.com.ve": "\\(Mobile#(Android; Mobile",
  "olx.com.ve": "\\(Mobile#(Android; Mobile",
  "movistar.com.ve": "\\(Mobile#(Android; Mobile",
  "bumeran.com.ve": "\\(Mobile#(Android; Mobile",
  "petardas.com": "\\(Mobile#(Android; Mobile",
  "movil.bankinter.es": "\\(Mobile#(Android; Mobile",
  "einforma.com": "\\(Mobile#(Android; Mobile",
  "wwwhatsnew.com": "\\(Mobile#(Android; Mobile",
  "askthebuilder.com": "\\(Mobile#(Android; Mobile",
  "tor.com": "\\(Mobile#(Android; Mobile",
  "maruccisports.com": "\\(Mobile#(Android; Mobile",
  "es.playstation.com": "Mozilla/5.0 (Linux; Android 4.0.4; Galaxy Nexus Build/IMM76B) AppleWebKit/535.19 (KHTML, like Gecko) Chrome/18.0.1025.133 Mobile Safari/535.19",
  "11870.com": "\\(Mobile#(Android; Mobile",
  "iphonejuegosgratis.com": "\\(Mobile#(Android; Mobile",
  "comunio.es": "\\(Mobile#(Android; Mobile",
  "deviantart.com": "\\(Mobile#(Android; Mobile",
  "consumersearch.com": "\\(Mobile#(Android; Mobile",
  "foodily.com": "\\(Mobile#(Android; Mobile",
  "citibank.com": "\\(Mobile#(Android; Mobile",
  "games.com": "\\(Mobile#(Android; Mobile",
  "orbitz.com": "\\(Mobile#(Android; Mobile",
  "starwoodhotels.com": "\\(Mobile#(Android; Mobile",
  "ehow.com": "\\(Mobile#(Android; Mobile",
  "urbanspoon.com": "\\(Mobile#(Android; Mobile",
  "virginatlantic.com": "\\(Mobile#(Android; Mobile",
  "cheaptickets.com": "\\(Mobile#(Android; Mobile",
  "zimbio.com": "\\(Mobile#(Android; Mobile",
  "tylted.com": "\\(Mobile#(Android; Mobile",
  "txt2nite.com": "\\(Mobile#(Android; Mobile",
  "slashgear.com": "\\(Mobile#(Android; Mobile",
  "chevrolet.com": "\\(Mobile#(Android; Mobile",
  "deadline.com": "\\(Mobile#(Android; Mobile",
  "3g.qq.com": "\\(Mobile#(Android; Mobile",
  "arukereso.hu": "\\(Mobile#(Android; Mobile",
  "blikk.hu": "\\(Mobile#(Android; Mobile",
  "citromail.hu": "\\(Mobile#(Android; Mobile",
  "hazipatika.com": "\\(Mobile#(Android; Mobile",
  "hvg.hu": "\\(Mobile#(Android; Mobile",
  "jofogas.hu": "\\(Mobile#(Android; Mobile",
  "koponyeg.hu": "\\(Mobile#(Android; Mobile",
  "kuruc.info": "\\(Mobile#(Android; Mobile",
  "nemzetisport.hu": "\\(Mobile#(Android; Mobile",
  "nlcafe.hu": "Mozilla/5.0 (Linux; Android 4.0.4; Galaxy Nexus Build/IMM76B) AppleWebKit/535.19 (KHTML, like Gecko) Chrome/18.0.1025.133 Mobile Safari/535.19",
  "port.hu": "\\(Mobile#(Android; Mobile",
  "portfolio.hu": "\\(Mobile#(Android; Mobile",
  "vatera.hu": "\\(Mobile#(Android; Mobile",
  "24sata.hr": "\\(Mobile#(Android; Mobile",
  "blackhatteam.com": "\\(Mobile#(Android; Mobile",
  "cdm.me": "\\(Mobile#(Android; Mobile",
  "download.com": "\\(Mobile#(Android; Mobile",
  "haber.ba": "\\(Mobile#(Android; Mobile",
  "jutarnji.hr": "\\(Mobile#(Android; Mobile",
  "kurir-info.rs": "\\(Mobile#(Android; Mobile",
  "livescore.com": "\\(Mobile#(Android; Mobile",
  "mondo.rs": "\\(Mobile#(Android; Mobile",
  "naslovi.net": "\\(Mobile#(Android; Mobile",
  "softonic.com": "\\(Mobile#(Android; Mobile",
  "yandex.ru": "\\(Mobile#(Android; Mobile",
  "ask.com": "\\(Mobile#(Android; Mobile",
  "banorte.com": "\\(Mobile#(Android; Mobile",
  "buenastareas.com": "\\(Mobile#(Android; Mobile",
  "eluniversal.com.mx": "\\(Mobile#(Android; Mobile",
  "hootsuite.com": "\\(Mobile#(Android; Mobile",
  "mercadolibre.com.mx": "\\(Mobile#(Android; Mobile",
  "olx.com.mx": "\\(Mobile#(Android; Mobile",
  "sat.gob.mx": "\\(Mobile#(Android; Mobile",
  "univision.com": "\\(Mobile#(Android; Mobile",
  "redstarbelgrade.info": "\\(Mobile#(Android; Mobile",
  "vesti-online.com": "\\(Mobile#(Android; Mobile"
}
