{
  "extensionDescription_v1": {
    "message": "A Firefox Relay megkönnyíti az e-mail álnevek létrehozását, amelyek a valódi postaládájába továbbítják a leveleket.",
    "description": "Shortened description of the extension. Must remain under 132 characters. DO NOT TRANSLATE \"Firefox Relay\"."
  },
  "extensionDescription_mask": {
    "message": "A Firefox Relay megkönnyíti az e-mail-maszkok létrehozását, amelyek a valódi postaládájába továbbítják a leveleket.",
    "description": "Shortened description of the extension. Must remain under 132 characters. DO NOT TRANSLATE \"Firefox Relay\"."
  },
  "extensionDescriptionStore": {
    "message": "A Firefox Relay segít megvédeni valódi e-mail címét – amely a legszorosabban kötődik online személyazonosságához. Lehetővé teszi az egyedi, véletlenszerű álnevek létrehozását, melyek segítségével fiókokat, alkalmazásokat vagy hírleveleket regisztrálhat, és az üzeneteket a valós címére továbbítja. Ha úgy találja, hogy egy fiók nem kívánt e-maileket vagy levélszemetet küld, akkor letilthatja az álnevet, és az többé nem küld e-maileket a beérkező levelek mappájába. Ha már nem szeretne egy fiókot, akkor törölheti az álnevet.",
    "description": "Shortened description of the extension. Must remain under 132 characters. DO NOT TRANSLATE \"Firefox Relay\"."
  },
  "labelRelayPremium": {
    "message": "Firefox Relay Premium",
    "description": "Alt text for the premium Relay logo. DO NOT TRANSLATE \"Firefox Relay Premium\"."
  },
  "firstRunP": {
    "message": "Sikeresen telepítette a Firefox Relay kiegészítőt. A kezdéshez jelentkezzen be a Relay szolgáltatásba Firefox-fiókjával.",
    "description": "First sentence on the first run page after installing the add-on. DO NOT TRANSLATE \"Firefox Relay\", \"Relay\", or \"Firefox\"."
  },
  "firstRunCollectDataLabel": {
    "message": "Engedélyezés a Mozillának, hogy információkat gyűjtsön arról, hogyan használja a kiegészítőt.",
    "description": "On the first run page after installing the add-on, we show a toggle and ask the user if the add-on can send interaction data to Mozilla. DO NOT TRANSLATE \"Mozilla\"."
  },
  "allowDataCollection": {
    "message": "Adatgyűjtés engedélyezése",
    "description": "The label on the toggle that ALLOWS sending interaction data to Mozilla."
  },
  "disableDataCollection": {
    "message": "Adatgyűjtés letiltása",
    "description": "The label on the toggle that DISABLES sending interaction data to Mozilla."
  },
  "firstRunPrefP": {
    "message": "Az interakciós adatok gyűjtése, amikor a Relay ikonra kattint az eszköztáron vagy egy új álnevet hoz létre, segítenek megtudnunk, hogy mi működik jól, és hol fejleszthetünk. Ezt bármikor kikapcsolhatja a Beállítások panelen.",
    "description": "On the first run page after installing the add-on, we tell the user how interaction data helps Mozilla. DO NOT TRANSLATE \"Relay\"."
  },
  "firstRunPrefP_mask": {
    "message": "Az interakciós adatok gyűjtése, amikor a Relay ikonra kattint az eszköztáron vagy egy új maszkot hoz létre, segítenek megtudnunk, hogy mi működik jól, és hol fejleszthetünk. Ezt bármikor kikapcsolhatja a Beállítások panelen.",
    "description": "On the first run page after installing the add-on, we tell the user how interaction data helps Mozilla. DO NOT TRANSLATE \"Relay\"."
  },
  "firstRunSignInButton": {
    "message": "Belépés/regisztráció"
  },
  "popupSettingsTitle": {
    "message": "Beállítások"
  },
  "popupSettingsReturn": {
    "message": "Vissza a fő panelre"
  },
  "popupSettingsShowIcon": {
    "message": "A Relay ikon megjelenítése a webhelyek e-mail mezőiben",
    "description": "In the settings panel, we display a toggle so the user can enable or disable the Relay icon in websites. DO NOT TRANSLATE \"Relay\"."
  },
  "popupSettingsCollectData": {
    "message": "Engedélyezés, hogy a Mozilla interakciós adatokat gyűjtsön",
    "description": "The label on the toggle that ENABLES sending interaction data to Mozilla. DO NOT TRANSLATE \"Mozilla\"."
  },
  "popupSettingsLeaveFeedback": {
    "message": "Visszajelzés küldése"
  },
  "popupSettingsPrivacy": {
    "message": "Adatvédelem"
  },
  "popupSettingsTermsOfService": {
    "message": "Szolgáltatás feltételei"
  },
  "popupSettingsReportIssue": {
    "message": "Probléma jelentése"
  },
  "popupSettingsSubmitReport": {
    "message": "Jelentés beküldése"
  },
  "popupReportIssueSiteLabelHeadline": {
    "message": "Problémáim vannak ezzel a webhellyel"
  },
  "popupReportIssueSituationHeadline": {
    "message": "Probléma leírása"
  },
  "popupReportIssueCaseOne": {
    "message": "A webhely nem fogadta el az e-mail-maszkot"
  },
  "popupReportIssueCaseTwo": {
    "message": "A Relay bővítmény vizuális problémát okozott a webhelyen",
    "description": "DO NOT TRANSLATE \"Relay\"."
  },
  "popupReportIssueCaseThree": {
    "message": "Nem kaptam meg egy várt e-mailt ettől a webhelytől"
  },
  "popupReportIssueCaseOther": {
    "message": "Egyéb"
  },
  "popupReportIssueCaseOtherDetails": {
    "message": "Adjon részletesebb információt"
  },
  "popupReportIssueSuccessHeadline": {
    "message": "Jelentés elküldve!"
  },
  "popupReportIssueSuccessBody": {
    "message": "Köszönjük, hogy segít nekünk a Firefox Relay tökéletesítésében!",
    "description": "DO NOT TRANSLATE \"Firefox Relay\"."
  },
  "popupReportIssueSuccessContinue": {
    "message": "Folytatás"
  },
  "popupSignUpPanelWelcome": {
    "message": "Üdvözöljük"
  },
  "popupSignUpPanelIntro": {
    "message": "Kezdje azzal, hogy Firefox-fiókjával bejelentkezik a Relay szolgáltatásba.",
    "description": "In the pop-up panel, before the user has signed in, we invite to them sign in. DO NOT TRANSLATE \"Relay\", OR \"Firefox\"."
  },
  "popupSignUpPanelContinue": {
    "message": "Folytatás"
  },
  "popupRemainingAliases_2": {
    "message": "Hátralévő álnevek: $REMAINING$",
    "description": "Tells the user how many more aliases they can make.",
    "placeholders": {
      "remaining": {
        "content": "$1"
      }
    }
  },
  "popupRemainingAliases_2_mask": {
    "message": "Hátralévő maszkok: $REMAINING$",
    "description": "Tells the user how many more masks they can make.",
    "placeholders": {
      "remaining": {
        "content": "$1"
      }
    }
  },
  "popupRemainingFreeMasks": {
    "message": "Hátralévő ingyenes maszkok: $REMAINING$",
    "description": "Tells the user how many more free masks they can make.",
    "placeholders": {
      "remaining": {
        "content": "$1"
      }
    }
  },
  "popupRecentlyUsedMasks": {
    "message": "Nemrég használt e-mail-maszkok",
    "description": "Label for list of most recently used masks."
  },
  "popupGetUnlimitedAliases": {
    "message": "Szerezzen korlátlan számú álnevet"
  },
  "popupGetUnlimitedAliases_mask": {
    "message": "Szerezzen korlátlan számú maszkot"
  },
  "popupUnlimitedAliases": {
    "message": "Létrehozott álnevek: $COUNT$",
    "description": "Tells the premium user how many aliases they have created.",
    "placeholders": {
      "count": {
        "content": "$1"
      }
    }
  },
  "popupUnlimitedAliases_mask": {
    "message": "Létrehozott maszkok: $COUNT$",
    "description": "Tells the premium user how many masks they have created.",
    "placeholders": {
      "count": {
        "content": "$1"
      }
    }
  },
  "popupOnboardingShowPrevious": {
    "message": "Előző panel megjelenítése"
  },
  "popupOnboardingShowNext": {
    "message": "Ugrás a következő panelre"
  },
  "ManageAllAliases": {
    "message": "Összes álnév kezelése"
  },
  "ManageAllAliases_mask": {
    "message": "Összes maszk kezelése"
  },
  "labelManage": {
    "message": "Kezelés"
  },
  "labelSearch": {
    "message": "Keresés"
  },
  "labelFromThisWebsite": {
    "message": "Erről a weboldalról",
    "description": "In the pop-up panel, the use can view masks only created or used on a certain website."
  },
  "labelAllEmailMasks": {
    "message": "Összes e-mail-maszk",
    "description": "In the pop-up panel, the use can view all masks they've created."
  },
  "popupOnboardingMaxAliasesPanelHeadline": {
    "message": "Pacsi!"
  },
  "popupOnboardingMaxAliasesPanelBody": {
    "message": "Ön egy komoly Firefox Relay felhasználó!",
    "description": "In the pop-up panel, when a free user has hit their mask limit, we tell them they're a power-user. DO NOT TRANSLATE \"Firefox Relay\"."
  },
  "popupRegisterDomainHeadline": {
    "message": "Szerezzen egyéni domaint a Relay e-mail álnevekhez",
    "description": "DO NOT TRANSLATE \"Relay\"."
  },
  "popupRegisterDomainHeadline_mask": {
    "message": "Szerezzen egyéni aldomaint a Relay e-mail-maszkokhoz",
    "description": "DO NOT TRANSLATE \"Relay\"."
  },
  "popupRegisterDomainButton": {
    "message": "E-mail domain regisztrálása"
  },
  "popupRegisterDomainButton_mask": {
    "message": "E-mail aldomain regisztrálása"
  },
  "popupAliasesUsed": {
    "message": "Használt e-mail álnevek"
  },
  "popupAliasesUsed_mask": {
    "message": "Használt e-mail-maszkok"
  },
  "popupEmailsBlocked": {
    "message": "Blokkolt e-mailek"
  },
  "popupEmailsForwarded": {
    "message": "Továbbított e-mailek"
  },
  "popupEmailTrackersRemoved": {
    "message": "E-mail-követők eltávolítva"
  },
  "popupUpgradeToPremiumBanner": {
    "message": "Frissítsen Relay Premiumra a még nagyobb védelem érdekében.",
    "description": "DO NOT TRANSLATE \"Relay Premium\"."
  },
  "popupEducationalComponent1Headline": {
    "message": "Világméretű védelmi eszköz"
  },
  "popupEducationalComponent1Body": {
    "message": "A Relay segíthet megvédeni az e-mail-címét, bárhol is legyen.",
    "description": "DO NOT TRANSLATE \"Relay\"."
  },
  "popupAttachmentSizeIncreaseHeadline": {
    "message": "Mellékletek méretének növelése"
  },
  "popupAttachmentSizeIncreaseBody": {
    "message": "A Firefox Relay mostantól akár 25 MB-os e-maileket is képes továbbítani, mellékletekkel együtt.",
    "description": "DO NOT TRANSLATE \"Firefox Relay\"."
  },
  "popupEndOfIntroPricingHeadline": {
    "message": "Bevezető árajánlatunk hamarosan lejár."
  },
  "popupEndOfIntroPricingBody": {
    "message": "Szerezze be a Relay Premiumpt szeptember 27. előtt, és élvezze a korlátlan maszkolást a bevezető havi árunkon.",
    "description": "DO NOT TRANSLATE \"Relay Premium\"."
  },
  "popupEndOfIntroPricingCTA": {
    "message": "Frissítés most"
  },
  "popupEndOfIntroPricingCountdownDays": {
    "message": "nap",
    "description": "This label displayed on top of a large number representing the number of DAYS of the remaining time that the introductory pricing offer is still valid. Please abbreviate if the word exceeds 5 characters."
  },
  "popupEndOfIntroPricingCountdownHours": {
    "message": "óra",
    "description": "This label displayed on top of a large number representing the number of HOURS of the remaining time that the introductory pricing offer is still valid. Please abbreviate if the word exceeds 5 characters."
  },
  "popupEndOfIntroPricingCountdownMinutes": {
    "message": "perc",
    "description": "This label displayed on top of a large number representing the number of MINUTES of the remaining time that the introductory pricing offer is still valid. There's not much room for this, hence the abbreviation."
  },
  "popupEndOfIntroPricingCountdownSeconds": {
    "message": "mp",
    "description": "This label displayed on top of a large number representing the number of SECONDS of the remaining time that the introductory pricing offer is still valid. There's not much room for this, hence the abbreviation."
  },
  "popupCriticalEmailForwardingHeadline": {
    "message": "Kritikus e-mailek továbbítása"
  },
  "popupCriticalEmailForwardingBody": {
    "message": "A Relay Premium lehetővé teszi, hogy csak az álnévre küldött kritikus e-maileket fogadja. Meg fogja kapni például nyugtákat, de marketing e-maileket nem.",
    "description": "DO NOT TRANSLATE \"Relay Premium\"."
  },
  "popupCriticalEmailForwardingBody_mask": {
    "message": "A Relay Premium lehetővé teszi, hogy csak a maszkra küldött kritikus e-maileket fogadja. Meg fogja kapni például nyugtákat, de marketing e-maileket nem.",
    "description": "DO NOT TRANSLATE \"Relay Premium\"."
  },
  "popupBlockPromotionalEmailsHeadline_2": {
    "message": "Promóciós e-mailek blokkolása"
  },
  "popupBlockPromotionalEmailsBody": {
    "message": "Engedélyezze a Promóciós e-mailek letiltását egy álnéven, hogy megakadályozza, hogy a marketinges e-mailek eljussanak a postaládájába."
  },
  "popupBlockPromotionalEmailsBody_mask": {
    "message": "Engedélyezze a Promóciós e-mailek letiltását egy maszkon, hogy megakadályozza, hogy a marketinges e-mailek eljussanak a postaládájába."
  },
  "popupBlockPromotionalEmailsBodyNonPremium": {
    "message": "A Relay Premium segítségével letilthatja a promóciós e-maileket, hogy ne jussanak el a postaládájába, miközben továbbra is lehetővé teszi a nyugtákat vagy szállítási információkat tartalmazó e-mailek fogadását.",
    "description": "DO NOT TRANSLATE \"Relay Premium\"."
  },
  "popupBundlePromoHeadline_2": {
    "message": "Mozilla VPN hozzáadása $SAVINGS$ kedvezménnyel.",
    "description": "DO NOT TRANSLATE \"Mozilla VPN\". This string includes a savings variable, e.g. 50%",
    "placeholders": {
      "savings": {
        "content": "$1",
        "example": "50%"
      }
    }
  },
  "popupBundlePromoHeadline_3": {
    "message": "Mozilla VPN hozzáadása $SAVINGS$ kedvezménnyel.",
    "description": "DO NOT TRANSLATE \"Mozilla VPN\". This string includes a savings variable, e.g. 50%",
    "placeholders": {
      "savings": {
        "content": "$1",
        "example": "40%"
      }
    }
  },
  "popupBundlePromoBody_2": {
    "message": "1 éves előfizetés, beleértve a Relay Premiumot és a Mozilla VPN-t $MONTHLY_PRICE$/hó áron.",
    "description": "DO NOT TRANSLATE \"Relay Premium\" and \"Mozilla VPN\". This string includes a monthly price variable, e.g. $4.99",
    "placeholders": {
      "monthly_price": {
        "content": "$1",
        "example": "$4.99"
      }
    }
  },
  "popupBundlePromoBody_3": {
    "message": "Kapjon egy évnyi Relay Premium telefonmaszkolást és Mozilla VPN-t $MONTHLY_PRICE$/hó áron.",
    "description": "DO NOT TRANSLATE \"Relay Premium\" and \"Mozilla VPN\". This string includes a monthly price variable, e.g. $4.99",
    "placeholders": {
      "monthly_price": {
        "content": "$1",
        "example": "$6.99"
      }
    }
  },
  "popupPasswordManagerRelayHeadline": {
    "message": "Firefox jelszókezelő + Relay",
    "description": "DO NOT TRANSLATE \"Firefox\" and \"Relay\"."
  },
  "popupPasswordManagerRelayBody": {
    "message": "Most már közvetlenül a Firefox jelszókezelőjében is használhatja a Relayt.",
    "description": "DO NOT TRANSLATE \"Relay\" and \"Firefox\"."
  },
  "popupBundlePromoHeadlineFreePlan": {
    "message": "Bemutatjuk: Relay + VPN előfizetési csomag",
    "description": "DO NOT TRANSLATE \"Relay\" and \"VPN\"."
  },
  "popupBundlePromoBodyFreePlan": {
    "message": "Frissítse előfizetését, hogy megkapja a Relay Premiumot és a Mozilla VPN-t $MONTHLY_PRICE$/hó áron. Takarítson meg $SAVINGS$-t.",
    "description": "DO NOT TRANSLATE \"Relay Premium\" and \"Mozilla VPN\". This string includes a monthly price variable, e.g. $4.99. It also includes a savings variable, e.g. 50%",
    "placeholders": {
      "monthly_price": {
        "content": "$1",
        "example": "$4.99"
      },
      "savings": {
        "content": "$2",
        "example": "50%"
      }
    }
  },
  "popupBundlePromoCTA": {
    "message": "VPN + Relay beszerzése",
    "description": "DO NOT TRANSLATE \"VPN\" and \"Relay\""
  },
  "popupPhoneMaskingPromoHeadline": {
    "message": "Bemutatkozik a telefonszám-maszkolás"
  },
  "popupPhoneMaskingPromoBody": {
    "message": "A telefonszám-maszkolás segítségével most létrehozhat egy telefonszámmaszkot, amely segít abban, hogy anélkül fogadjon SMS-eket és hívásokat, hogy felfedné valódi számát."
  },
  "popupPhoneMaskingPromoBodyPremium": {
    "message": "Kapjon SMS-eket és hívásokat anélkül, hogy felfedné valódi számát."
  },
  "popupPhoneMaskingPromoCTA": {
    "message": "Frissítés most"
  },
  "popupPromoNewLabel": {
    "message": "Új!"
  },
  "popupSignBackInHeadline": {
    "message": "Jelentkezzen be újra az álneveivel"
  },
  "popupSignBackInHeadline_mask": {
    "message": "Jelentkezzen be újra az e-mail-maszkjaival"
  },
  "popupSignBackInBody": {
    "message": "Ha új álnevet szeretne létrehozni, amikor a rendszer kéri az e-mail-címét, akkor nyissa meg a helyi menüt (jobb gombbal vagy Control+kattintással) egy e-mail-cím mezőben. Innen azonnal létrehozhat és használhat egy új álnevet."
  },
  "popupSignBackInBody_mask_v2": {
    "message": "Ha új e-mail-maszkot szeretne létrehozni, amikor a rendszer kéri az e-mail-címét, akkor nyissa meg a helyi menüt (jobb gombbal vagy Control+kattintással) egy e-mail-cím mezőben. Innen azonnal létrehozhat és használhat egy új maszkot."
  },
  "pageInputIconSignUpText": {
    "message": "Látogassa meg a Firefox Relay webhelyet a bejelentkezéshez vagy egy fiók létrehozásához.",
    "description": "In the website content icon pop-up, before a user has signed in, we tell them to sign in. DO NOT TRANSLATE \"Firefox Relay\"."
  },
  "pageInputIconSignUpButton": {
    "message": "Ugrás a Firefox Relayhez",
    "description": "In the website content icon pop-up, before a user has signed in, we tell them to sign in. DO NOT TRANSLATE \"Firefox Relay\"."
  },
  "pageInputIconGenerateNewAlias": {
    "message": "Új alias létrehozása"
  },
  "pageInputIconGenerateNewAlias_mask": {
    "message": "Új maszk előállítása"
  },
  "pageInputIconGenerateNewRandomMask": {
    "message": "Új véletlenszerű maszk előállítása"
  },
  "pageInputIconSelectFromYourCurrentEmailMasks": {
    "message": "Válasszon a jelenlegi e-mail-maszkjai közül",
    "description": "In the website content icon pop-up, users can re-use masks they've already created. This label is displayed when this is the only list visible."
  },
  "pageInputIconAdditionalEmailMasks": {
    "message": "További e-mail-maszkok",
    "description": "In the website content icon pop-up, users can re-use masks they've already created."
  },
  "pageInputIconPreviouslyUsedMask": {
    "message": "Korábban ezen a weboldalon használt",
    "description": "In the website content icon pop-up, users can select specific masks they've created on the current website."
  },
  "pageInputIconGetUnlimitedAliases": {
    "message": "Szerezzen korlátlan számú álnevet"
  },
  "pageInputIconGetUnlimitedAliases_mask": {
    "message": "Szerezzen korlátlan számú maszkot"
  },
  "pageInputIconJoinPremiumWaitlist": {
    "message": "Csatlakozzon a Premium várólistához",
    "description": "For some free users (based on geographic region), Firefox Relay premium is not avialable yet. We instead prompt users to join our waitlist to be notified when it is available."
  },
  "pageInputIconUseExistingAliasFromTheSite": {
    "message": "Meglévő álnév használata erről a webhelyről…"
  },
  "pageInputIconUseExistingAliasFromTheSite_mask": {
    "message": "Meglévő maszk használata erről a webhelyről…"
  },
  "pageInputIconRecentAliases": {
    "message": "Legutóbbi álnevek"
  },
  "pageInputIconRecentAliases_mask": {
    "message": "Legújabb maszkok"
  },
  "pageInputIconInsertPhoneMask": {
    "message": "Telefonszámmaszk használata"
  },
  "pageInputIconMaxAliasesError": {
    "message": "Már létrehozta a maximális számú álnevet",
    "description": "Tells the user they have already created the max number of aliases."
  },
  "pageInputIconMaxAliasesError_mask": {
    "message": "Már létrehozta a maximális számú maszkot",
    "description": "Tells the user they have already created the max number of masks."
  },
  "pageFillRelayAddressLimit": {
    "message": "Elérte az álnevek korlátját."
  },
  "pageFillRelayAddressLimit_mask": {
    "message": "Elérte a maszkok korlátját."
  },
  "pageNoMasksRemaining": {
    "message": "Nincs több ingyenes e-mail-maszkja.",
    "description": "Error message that appears when a free tier user uses all of their masks."
  },
  "profilePageInvalidAliasCharactersError": {
    "message": "A karakterek nem megengedettek: $CHARACTERS$",
    "description": "Error message that appears when the user tries to use special characters when labelling an mask.",
    "placeholders": {
      "characters": {
        "content": "$1",
        "example": "; )"
      }
    }
  },
  "profilePageDefaulAliasLabelText": {
    "message": "Fióknév hozzáadása",
    "description": "On the user's profile page, this text appears for a mask when it doesn't have a label."
  },
  "close": {
    "message": "Bezárás"
  },
  "popupDataCollectionHeadline": {
    "message": "Új funkciók engedélyezése"
  },
  "popupDataCollectionBody": {
    "message": "Engedélyezheti a Relay számára, hogy nem kötelező adatokat gyűjtsön, amely lehetővé teszik számunkra, hogy szinkronizáljuk a webhelyekhez létrehozott és használt álnévcímkéit az eszközei között.",
    "description": "DO NOT TRANSLATE \"Relay\"."
  },
  "popupDataCollectionBody_mask": {
    "message": "Engedélyezheti a Relay számára, hogy nem kötelező adatokat gyűjtsön, ami lehetővé teszik számunkra, hogy szinkronizáljuk a webhelyekhez létrehozott és használt maszkcímkéit az eszközei között.",
    "description": "DO NOT TRANSLATE \"Relay\"."
  },
  "popupDataCollectionButtonLearnMore": {
    "message": "További tudnivalók"
  },
  "popupDataCollectionButtonDecline": {
    "message": "Elutasítás"
  },
  "popupDataCollectionButtonAllow": {
    "message": "Engedélyezés"
  },
  "popupPrivacyNoticeUpdateHeadline": {
    "message": "Adatvédelmi nyilatkozat frissítése"
  },
  "popupPrivacyNoticeUpdateBody": {
    "message": "A Firefox Relay megbízhatóságának javítása érdekében, arra az esetre, ha egy e-mailt nem sikerül kézbesíteni, az e-mailt ideiglenesen a kiszolgálóinkon tároljuk, amíg az kézbesítésre nem kerül. Soha nem tartjuk meg három napnál tovább.",
    "description": "DO NOT TRANSLATE \"Firefox Relay\"."
  },
  "popupPrivacyNoticeUpdateButtonLearnMore": {
    "message": "Adatvédelmi nyilatkozat megtekintése"
  },
  "popupPrivacyNoticeUpdateButtonDismiss": {
    "message": "Eltüntetés"
  }
}
