{
  "extensionDescription_v1": {
    "message": "Firefox Relay maakt het gemakkelijk om e-mailmaskers te maken die naar uw echte Postvak IN worden doorgestuurd.",
    "description": "Shortened description of the extension. Must remain under 132 characters. DO NOT TRANSLATE \"Firefox Relay\"."
  },
  "extensionDescription_mask": {
    "message": "Firefox Relay maakt het gemakkelijk om e-mailmaskers te maken die naar uw echte Postvak IN worden doorgestuurd.",
    "description": "Shortened description of the extension. Must remain under 132 characters. DO NOT TRANSLATE \"Firefox Relay\"."
  },
  "extensionDescriptionStore": {
    "message": "Firefox Relay helpt u uw echte e-mailadres te beschermen – het adres dat het nauwst verband houdt met uw online-identiteit. U kunt er unieke, willekeurige maskers mee aanmaken, die u kunt gebruiken om u in te schrijven bij accounts, apps of nieuwsbrieven, en stuurt berichten door naar uw echte adres. Als u ontdekt dat een account u ongewenste berichten of spam stuurt, kunt u het masker blokkeren en verstuurt dit geen berichten meer naar uw Postvak IN. Als u een account niet meer wilt gebruiken, kunt u het masker verwijderen.",
    "description": "Shortened description of the extension. Must remain under 132 characters. DO NOT TRANSLATE \"Firefox Relay\"."
  },
  "labelRelayPremium": {
    "message": "Firefox Relay Premium",
    "description": "Alt text for the premium Relay logo. DO NOT TRANSLATE \"Firefox Relay Premium\"."
  },
  "firstRunP": {
    "message": "U hebt de Firefox Relay-add-on met succes geïnstalleerd. Meld u aan bij Relay met uw Firefox-account om aan de slag te gaan.",
    "description": "First sentence on the first run page after installing the add-on. DO NOT TRANSLATE \"Firefox Relay\", \"Relay\", or \"Firefox\"."
  },
  "firstRunCollectDataLabel": {
    "message": "Mozilla toestaan gegevens te verzamelen over hoe u deze extensie gebruikt.",
    "description": "On the first run page after installing the add-on, we show a toggle and ask the user if the add-on can send interaction data to Mozilla. DO NOT TRANSLATE \"Mozilla\"."
  },
  "allowDataCollection": {
    "message": "Gegevensverzameling toestaan",
    "description": "The label on the toggle that ALLOWS sending interaction data to Mozilla."
  },
  "disableDataCollection": {
    "message": "Gegevensverzameling uitschakelen",
    "description": "The label on the toggle that DISABLES sending interaction data to Mozilla."
  },
  "firstRunPrefP": {
    "message": "Door interactiegegevens te verzamelen wanneer u bijvoorbeeld op het Relay-pictogram in uw werkbalk klikt of een nieuw masker maakt, kunnen we leren wat goed werkt en waar we kunnen verbeteren. U kunt dit altijd uitschakelen in het paneel Instellingen.",
    "description": "On the first run page after installing the add-on, we tell the user how interaction data helps Mozilla. DO NOT TRANSLATE \"Relay\"."
  },
  "firstRunPrefP_mask": {
    "message": "Door interactiegegevens te verzamelen wanneer u bijvoorbeeld op het Relay-pictogram in uw werkbalk klikt of een nieuw masker maakt, kunnen we leren wat goed werkt en waar we kunnen verbeteren. U kunt dit altijd uitschakelen in het paneel Instellingen.",
    "description": "On the first run page after installing the add-on, we tell the user how interaction data helps Mozilla. DO NOT TRANSLATE \"Relay\"."
  },
  "firstRunSignInButton": {
    "message": "Inschrijven / Aanmelden"
  },
  "popupSettingsTitle": {
    "message": "Instellingen"
  },
  "popupSettingsReturn": {
    "message": "Terug naar hoofdpaneel"
  },
  "popupSettingsShowIcon": {
    "message": "Relay-pictogram tonen in e-mailvelden op websites",
    "description": "In the settings panel, we display a toggle so the user can enable or disable the Relay icon in websites. DO NOT TRANSLATE \"Relay\"."
  },
  "popupSettingsCollectData": {
    "message": "Mozilla toestaan interactiegegevens te verzamelen",
    "description": "The label on the toggle that ENABLES sending interaction data to Mozilla. DO NOT TRANSLATE \"Mozilla\"."
  },
  "popupSettingsLeaveFeedback": {
    "message": "Feedback achterlaten"
  },
  "popupSettingsPrivacy": {
    "message": "Privacy"
  },
  "popupSettingsTermsOfService": {
    "message": "Servicevoorwaarden"
  },
  "popupSettingsReportIssue": {
    "message": "Probleem melden"
  },
  "popupSettingsSubmitReport": {
    "message": "Rapport verzenden"
  },
  "popupReportIssueSiteLabelHeadline": {
    "message": "Ik heb problemen met deze website"
  },
  "popupReportIssueSituationHeadline": {
    "message": "Probleemsituatie"
  },
  "popupReportIssueCaseOne": {
    "message": "E-mailmasker werd niet geaccepteerd door de website"
  },
  "popupReportIssueCaseTwo": {
    "message": "Relay-add-on veroorzaakte een visueel probleem met de website",
    "description": "DO NOT TRANSLATE \"Relay\"."
  },
  "popupReportIssueCaseThree": {
    "message": "Ik heb geen e-mailbericht van deze website ontvangen dat ik verwachtte"
  },
  "popupReportIssueCaseOther": {
    "message": "Overig"
  },
  "popupReportIssueCaseOtherDetails": {
    "message": "Geef details"
  },
  "popupReportIssueSuccessHeadline": {
    "message": "Rapport verzonden!"
  },
  "popupReportIssueSuccessBody": {
    "message": "Bedankt voor uw hulp bij het verbeteren van Firefox Relay!",
    "description": "DO NOT TRANSLATE \"Firefox Relay\"."
  },
  "popupReportIssueSuccessContinue": {
    "message": "Doorgaan"
  },
  "popupSignUpPanelWelcome": {
    "message": "Welkom"
  },
  "popupSignUpPanelIntro": {
    "message": "Ga aan de slag door u aan te melden bij Relay met uw Firefox-account.",
    "description": "In the pop-up panel, before the user has signed in, we invite to them sign in. DO NOT TRANSLATE \"Relay\", OR \"Firefox\"."
  },
  "popupSignUpPanelContinue": {
    "message": "Doorgaan"
  },
  "popupRemainingAliases_2": {
    "message": "Resterende maskers: $REMAINING$",
    "description": "Tells the user how many more aliases they can make.",
    "placeholders": {
      "remaining": {
        "content": "$1"
      }
    }
  },
  "popupRemainingAliases_2_mask": {
    "message": "Resterende maskers: $REMAINING$",
    "description": "Tells the user how many more masks they can make.",
    "placeholders": {
      "remaining": {
        "content": "$1"
      }
    }
  },
  "popupRemainingFreeMasks": {
    "message": "Resterende gratis maskers: $REMAINING$",
    "description": "Tells the user how many more free masks they can make.",
    "placeholders": {
      "remaining": {
        "content": "$1"
      }
    }
  },
  "popupRecentlyUsedMasks": {
    "message": "Recent gebruikte e-mailmaskers",
    "description": "Label for list of most recently used masks."
  },
  "popupGetUnlimitedAliases": {
    "message": "Onbeperkt maskers verkrijgen"
  },
  "popupGetUnlimitedAliases_mask": {
    "message": "Onbeperkt maskers verkrijgen"
  },
  "popupUnlimitedAliases": {
    "message": "Aangemaakte maskers: $COUNT$",
    "description": "Tells the premium user how many aliases they have created.",
    "placeholders": {
      "count": {
        "content": "$1"
      }
    }
  },
  "popupUnlimitedAliases_mask": {
    "message": "Aangemaakte maskers: $COUNT$",
    "description": "Tells the premium user how many masks they have created.",
    "placeholders": {
      "count": {
        "content": "$1"
      }
    }
  },
  "popupOnboardingShowPrevious": {
    "message": "Vorig paneel tonen"
  },
  "popupOnboardingShowNext": {
    "message": "Naar het volgende paneel"
  },
  "ManageAllAliases": {
    "message": "Al uw maskers beheren"
  },
  "ManageAllAliases_mask": {
    "message": "Al uw maskers beheren"
  },
  "labelManage": {
    "message": "Beheren"
  },
  "labelSearch": {
    "message": "Zoeken"
  },
  "labelFromThisWebsite": {
    "message": "Van deze website",
    "description": "In the pop-up panel, the use can view masks only created or used on a certain website."
  },
  "labelAllEmailMasks": {
    "message": "Alle e-mailmaskers",
    "description": "In the pop-up panel, the use can view all masks they've created."
  },
  "popupOnboardingMaxAliasesPanelHeadline": {
    "message": "Gefeliciteerd!"
  },
  "popupOnboardingMaxAliasesPanelBody": {
    "message": "U bent een intensieve gebruiker van Firefox Relay!",
    "description": "In the pop-up panel, when a free user has hit their mask limit, we tell them they're a power-user. DO NOT TRANSLATE \"Firefox Relay\"."
  },
  "popupRegisterDomainHeadline": {
    "message": "Een aangepast domein verkrijgen voor Relay-e-mailmaskers",
    "description": "DO NOT TRANSLATE \"Relay\"."
  },
  "popupRegisterDomainHeadline_mask": {
    "message": "Een aangepast subdomein verkrijgen voor Relay-e-mailmaskers",
    "description": "DO NOT TRANSLATE \"Relay\"."
  },
  "popupRegisterDomainButton": {
    "message": "E-mailsubdomein registreren"
  },
  "popupRegisterDomainButton_mask": {
    "message": "E-mailsubdomein registreren"
  },
  "popupAliasesUsed": {
    "message": "Gebruikte e-mailmaskers"
  },
  "popupAliasesUsed_mask": {
    "message": "Gebruikte e-mailmaskers"
  },
  "popupEmailsBlocked": {
    "message": "E-mailberichten geblokkeerd"
  },
  "popupEmailsForwarded": {
    "message": "E-mailberichten doorgestuurd"
  },
  "popupEmailTrackersRemoved": {
    "message": "E-mailtrackers verwijderd"
  },
  "popupUpgradeToPremiumBanner": {
    "message": "Upgrade naar Relay Premium voor meer bescherming!",
    "description": "DO NOT TRANSLATE \"Relay Premium\"."
  },
  "popupEducationalComponent1Headline": {
    "message": "Een wereldwijd beschermingshulpmiddel"
  },
  "popupEducationalComponent1Body": {
    "message": "Relay kan u helpen uw e-mail te beschermen, waar u ook bent.",
    "description": "DO NOT TRANSLATE \"Relay\"."
  },
  "popupAttachmentSizeIncreaseHeadline": {
    "message": "Verbeterde bijlagegrootte"
  },
  "popupAttachmentSizeIncreaseBody": {
    "message": "Firefox Relay kan nu e-mailberichten tot 25 MB doorsturen, inclusief bijlagen.",
    "description": "DO NOT TRANSLATE \"Firefox Relay\"."
  },
  "popupEndOfIntroPricingHeadline": {
    "message": "Onze introductieprijsaanbieding loopt binnenkort af!"
  },
  "popupEndOfIntroPricingBody": {
    "message": "Abonneer u vóór 27 september op Relay Premium en geniet van onbeperkt maskeren tegen onze introductieprijs voor een maandabonnement.",
    "description": "DO NOT TRANSLATE \"Relay Premium\"."
  },
  "popupEndOfIntroPricingCTA": {
    "message": "Nu upgraden"
  },
  "popupEndOfIntroPricingCountdownDays": {
    "message": "Dagen",
    "description": "This label displayed on top of a large number representing the number of DAYS of the remaining time that the introductory pricing offer is still valid. Please abbreviate if the word exceeds 5 characters."
  },
  "popupEndOfIntroPricingCountdownHours": {
    "message": "Uren",
    "description": "This label displayed on top of a large number representing the number of HOURS of the remaining time that the introductory pricing offer is still valid. Please abbreviate if the word exceeds 5 characters."
  },
  "popupEndOfIntroPricingCountdownMinutes": {
    "message": "Min.",
    "description": "This label displayed on top of a large number representing the number of MINUTES of the remaining time that the introductory pricing offer is still valid. There's not much room for this, hence the abbreviation."
  },
  "popupEndOfIntroPricingCountdownSeconds": {
    "message": "Sec.",
    "description": "This label displayed on top of a large number representing the number of SECONDS of the remaining time that the introductory pricing offer is still valid. There's not much room for this, hence the abbreviation."
  },
  "popupCriticalEmailForwardingHeadline": {
    "message": "Doorsturen van kritieke e-mailberichten"
  },
  "popupCriticalEmailForwardingBody": {
    "message": "Met Relay Premium kunt u instellen dat u alleen kritieke e-mailberichten op een alias ontvangt. U ontvangt berichten zoals ontvangstbewijzen, maar geen marketingberichten.",
    "description": "DO NOT TRANSLATE \"Relay Premium\"."
  },
  "popupCriticalEmailForwardingBody_mask": {
    "message": "Met Relay Premium kunt u instellen dat u alleen kritieke e-mailberichten op een masker ontvangt. U ontvangt berichten zoals ontvangstbewijzen, maar geen marketingberichten.",
    "description": "DO NOT TRANSLATE \"Relay Premium\"."
  },
  "popupBlockPromotionalEmailsHeadline_2": {
    "message": "Reclameberichten blokkeren"
  },
  "popupBlockPromotionalEmailsBody": {
    "message": "Schakel Reclameberichten blokkeren in voor een masker om te voorkomen dat marketingberichten uw Postvak IN bereiken."
  },
  "popupBlockPromotionalEmailsBody_mask": {
    "message": "Schakel Reclameberichten blokkeren in voor een masker om te voorkomen dat marketingberichten uw Postvak IN bereiken."
  },
  "popupBlockPromotionalEmailsBodyNonPremium": {
    "message": "Met Relay Premium kunt uw voorkomen dat reclameberichten uw Postvak IN bereiken, terwijl u nog steeds e-mailberichten zoals ontvangstbevestigingen of verzendinformatie ontvangt.",
    "description": "DO NOT TRANSLATE \"Relay Premium\"."
  },
  "popupBundlePromoHeadline_2": {
    "message": "Voeg Mozilla VPN toe met $SAVINGS$ korting.",
    "description": "DO NOT TRANSLATE \"Mozilla VPN\". This string includes a savings variable, e.g. 50%",
    "placeholders": {
      "savings": {
        "content": "$1",
        "example": "50%"
      }
    }
  },
  "popupBundlePromoHeadline_3": {
    "message": "Voeg Mozilla VPN toe voor $SAVINGS$ korting.",
    "description": "DO NOT TRANSLATE \"Mozilla VPN\". This string includes a savings variable, e.g. 50%",
    "placeholders": {
      "savings": {
        "content": "$1",
        "example": "40%"
      }
    }
  },
  "popupBundlePromoBody_2": {
    "message": "Jaarabonnement met Relay Premium + Mozilla VPN voor $MONTHLY_PRICE$/maand.",
    "description": "DO NOT TRANSLATE \"Relay Premium\" and \"Mozilla VPN\". This string includes a monthly price variable, e.g. $4.99",
    "placeholders": {
      "monthly_price": {
        "content": "$1",
        "example": "$4.99"
      }
    }
  },
  "popupBundlePromoBody_3": {
    "message": "Ontvang een jaar lang Relay Premium-telefoonmaskering plus Mozilla VPN voor $MONTHLY_PRICE$/maand.",
    "description": "DO NOT TRANSLATE \"Relay Premium\" and \"Mozilla VPN\". This string includes a monthly price variable, e.g. $4.99",
    "placeholders": {
      "monthly_price": {
        "content": "$1",
        "example": "$6.99"
      }
    }
  },
  "popupPasswordManagerRelayHeadline": {
    "message": "Firefox-wachtwoordenbeheerder + Relay",
    "description": "DO NOT TRANSLATE \"Firefox\" and \"Relay\"."
  },
  "popupPasswordManagerRelayBody": {
    "message": "U kunt nu Relay rechtstreeks in uw Firefox-wachtwoordenbeheerder gebruiken.",
    "description": "DO NOT TRANSLATE \"Relay\" and \"Firefox\"."
  },
  "popupBundlePromoHeadlineFreePlan": {
    "message": "Nieuw: abonnement voor Relay + VPN",
    "description": "DO NOT TRANSLATE \"Relay\" and \"VPN\"."
  },
  "popupBundlePromoBodyFreePlan": {
    "message": "Upgrade uw abonnement om zowel Relay Premium als Mozilla VPN te ontvangen voor $MONTHLY_PRICE$/maand. Bespaar $SAVINGS$!",
    "description": "DO NOT TRANSLATE \"Relay Premium\" and \"Mozilla VPN\". This string includes a monthly price variable, e.g. $4.99. It also includes a savings variable, e.g. 50%",
    "placeholders": {
      "monthly_price": {
        "content": "$1",
        "example": "$4.99"
      },
      "savings": {
        "content": "$2",
        "example": "50%"
      }
    }
  },
  "popupBundlePromoCTA": {
    "message": "VPN + Relay downloaden",
    "description": "DO NOT TRANSLATE \"VPN\" and \"Relay\""
  },
  "popupPhoneMaskingPromoHeadline": {
    "message": "Nieuw: telefoonnummermaskering"
  },
  "popupPhoneMaskingPromoBody": {
    "message": "Met telefoonnummermaskering kunt u nu een telefoonnummermasker aanmaken dat u helpt sms’jes en oproepen te ontvangen zonder uw echte nummer prijs te geven."
  },
  "popupPhoneMaskingPromoBodyPremium": {
    "message": "Ontvang sms’jes en oproepen zonder uw echte nummer te onthullen."
  },
  "popupPhoneMaskingPromoCTA": {
    "message": "Nu upgraden"
  },
  "popupPromoNewLabel": {
    "message": "Nieuw!"
  },
  "popupSignBackInHeadline": {
    "message": "Opnieuw aanmelden met uw maskers"
  },
  "popupSignBackInHeadline_mask": {
    "message": "Opnieuw aanmelden met uw e-mailmaskers"
  },
  "popupSignBackInBody": {
    "message": "Open het contextmenu (rechtermuisknop of control-klik) om een nieuw masker aan te maken als u wordt gevraagd om uw e-mailadres. Hiervandaan kunt u direct een nieuw masker aanmaken en gebruiken."
  },
  "popupSignBackInBody_mask_v2": {
    "message": "Open om een nieuw e-mailmasker aan te maken als om uw e-mailadres wordt gevraagd het contextmenu (rechtermuisknop of control-klik) in een e-mailveld. Daarvandaan kunt u direct een nieuw masker aanmaken en gebruiken."
  },
  "pageInputIconSignUpText": {
    "message": "Bezoek de Firefox Relay-website om u aan te melden of een account aan te maken.",
    "description": "In the website content icon pop-up, before a user has signed in, we tell them to sign in. DO NOT TRANSLATE \"Firefox Relay\"."
  },
  "pageInputIconSignUpButton": {
    "message": "Naar Firefox Relay",
    "description": "In the website content icon pop-up, before a user has signed in, we tell them to sign in. DO NOT TRANSLATE \"Firefox Relay\"."
  },
  "pageInputIconGenerateNewAlias": {
    "message": "Nieuw masker aanmaken"
  },
  "pageInputIconGenerateNewAlias_mask": {
    "message": "Nieuw masker aanmaken"
  },
  "pageInputIconGenerateNewRandomMask": {
    "message": "Willekeurig nieuw masker aanmaken"
  },
  "pageInputIconSelectFromYourCurrentEmailMasks": {
    "message": "Selecteren uit uw huidige e-mailmaskers",
    "description": "In the website content icon pop-up, users can re-use masks they've already created. This label is displayed when this is the only list visible."
  },
  "pageInputIconAdditionalEmailMasks": {
    "message": "Extra e-mailmaskers",
    "description": "In the website content icon pop-up, users can re-use masks they've already created."
  },
  "pageInputIconPreviouslyUsedMask": {
    "message": "Eerder gebruikt op deze website",
    "description": "In the website content icon pop-up, users can select specific masks they've created on the current website."
  },
  "pageInputIconGetUnlimitedAliases": {
    "message": "Onbeperkt maskers verkrijgen"
  },
  "pageInputIconGetUnlimitedAliases_mask": {
    "message": "Onbeperkt maskers verkrijgen"
  },
  "pageInputIconJoinPremiumWaitlist": {
    "message": "Op de wachtlijst voor Premium plaatsen",
    "description": "For some free users (based on geographic region), Firefox Relay premium is not avialable yet. We instead prompt users to join our waitlist to be notified when it is available."
  },
  "pageInputIconUseExistingAliasFromTheSite": {
    "message": "Een bestaand masker van deze website gebruiken…"
  },
  "pageInputIconUseExistingAliasFromTheSite_mask": {
    "message": "Een bestaand masker van deze website gebruiken…"
  },
  "pageInputIconRecentAliases": {
    "message": "Recente maskers"
  },
  "pageInputIconRecentAliases_mask": {
    "message": "Recente maskers"
  },
  "pageInputIconInsertPhoneMask": {
    "message": "Telefoonnummermasker gebruiken"
  },
  "pageInputIconMaxAliasesError": {
    "message": "U hebt het maximale aantal maskers al aangemaakt",
    "description": "Tells the user they have already created the max number of aliases."
  },
  "pageInputIconMaxAliasesError_mask": {
    "message": "U hebt het maximale aantal maskers al aangemaakt",
    "description": "Tells the user they have already created the max number of masks."
  },
  "pageFillRelayAddressLimit": {
    "message": "U hebt de maskerlimiet bereikt."
  },
  "pageFillRelayAddressLimit_mask": {
    "message": "U hebt de maskerlimiet bereikt."
  },
  "pageNoMasksRemaining": {
    "message": "U hebt geen gratis e-mailmaskers meer.",
    "description": "Error message that appears when a free tier user uses all of their masks."
  },
  "profilePageInvalidAliasCharactersError": {
    "message": "Teken(s) niet toegestaan: $CHARACTERS$",
    "description": "Error message that appears when the user tries to use special characters when labelling an mask.",
    "placeholders": {
      "characters": {
        "content": "$1",
        "example": "; )"
      }
    }
  },
  "profilePageDefaulAliasLabelText": {
    "message": "Accountnaam toevoegen",
    "description": "On the user's profile page, this text appears for a mask when it doesn't have a label."
  },
  "close": {
    "message": "Sluiten"
  },
  "popupDataCollectionHeadline": {
    "message": "Nieuwe functies inschakelen"
  },
  "popupDataCollectionBody": {
    "message": "U kunt Relay toestaan om optionele gegevens te verzamelen, waarmee we uw maskerlabels op al uw apparaten kunnen synchroniseren met de websites waarop ze zijn gemaakt en gebruikt.",
    "description": "DO NOT TRANSLATE \"Relay\"."
  },
  "popupDataCollectionBody_mask": {
    "message": "U kunt Relay toestaan om optionele gegevens te verzamelen, waarmee we uw maskerlabels op al uw apparaten kunnen synchroniseren met de websites waarop ze zijn gemaakt en gebruikt.",
    "description": "DO NOT TRANSLATE \"Relay\"."
  },
  "popupDataCollectionButtonLearnMore": {
    "message": "Meer info"
  },
  "popupDataCollectionButtonDecline": {
    "message": "Weigeren"
  },
  "popupDataCollectionButtonAllow": {
    "message": "Toestaan"
  },
  "popupPrivacyNoticeUpdateHeadline": {
    "message": "Update privacyverklaring"
  },
  "popupPrivacyNoticeUpdateBody": {
    "message": "Om de betrouwbaarheid van Firefox Relay te verbeteren in het geval dat een e-mailbericht niet kan worden afgeleverd, bewaren we het e-mailbericht tijdelijk op onze servers totdat het is afgeleverd. We bewaren het nooit langer dan drie dagen.",
    "description": "DO NOT TRANSLATE \"Firefox Relay\"."
  },
  "popupPrivacyNoticeUpdateButtonLearnMore": {
    "message": "Privacyverklaring bekijken"
  },
  "popupPrivacyNoticeUpdateButtonDismiss": {
    "message": "Sluiten"
  }
}
