{
  "extensionDescription_v1": {
    "message": "Firefox Relay erleichtert Ihnen das Erstellen von Alias-E-Mail-Adressen, die an Ihren richtigen Posteingang weitergeleitet werden.",
    "description": "Shortened description of the extension. Must remain under 132 characters. DO NOT TRANSLATE \"Firefox Relay\"."
  },
  "extensionDescription_mask": {
    "message": "Firefox Relay macht es einfach, E-Mail-Masken zu erstellen, die E-Mails an Ihren echten Posteingang weiterleiten.",
    "description": "Shortened description of the extension. Must remain under 132 characters. DO NOT TRANSLATE \"Firefox Relay\"."
  },
  "extensionDescriptionStore": {
    "message": "Firefox Relay hilft Ihnen, Ihre echte E-Mail-Adresse zu schützen – diejenige, die am engsten mit Ihrer Online-Identität verbunden ist. Damit können Sie eindeutige, zufällige E-Mail-Masken generieren, die Sie verwenden können, um sich für Konten, Apps oder Newsletter anzumelden; Nachrichten werden an Ihre echte Adresse weitergeleitet. Wenn Sie feststellen, dass ein Konto unerwünschte E-Mails oder Spam sendet, können Sie die E-Mail-Maske blockieren, damit keine weiteren E-Mails an Ihren Posteingang gesendet werden. Sobald Sie kein Konto mehr möchten, können Sie die E-Mail-Maske löschen.",
    "description": "Shortened description of the extension. Must remain under 132 characters. DO NOT TRANSLATE \"Firefox Relay\"."
  },
  "labelRelayPremium": {
    "message": "Firefox Relay Premium",
    "description": "Alt text for the premium Relay logo. DO NOT TRANSLATE \"Firefox Relay Premium\"."
  },
  "firstRunP": {
    "message": "Sie haben das Firefox-Relay-Add-on erfolgreich installiert. Melden Sie sich zunächst mit Ihrem Firefox-Konto bei Relay an.",
    "description": "First sentence on the first run page after installing the add-on. DO NOT TRANSLATE \"Firefox Relay\", \"Relay\", or \"Firefox\"."
  },
  "firstRunCollectDataLabel": {
    "message": "Mozilla erlauben, Informationen darüber zu sammeln, wie Sie diese Erweiterung verwenden.",
    "description": "On the first run page after installing the add-on, we show a toggle and ask the user if the add-on can send interaction data to Mozilla. DO NOT TRANSLATE \"Mozilla\"."
  },
  "allowDataCollection": {
    "message": "Datensammlung aktivieren",
    "description": "The label on the toggle that ALLOWS sending interaction data to Mozilla."
  },
  "disableDataCollection": {
    "message": "Datensammlung deaktivieren",
    "description": "The label on the toggle that DISABLES sending interaction data to Mozilla."
  },
  "firstRunPrefP": {
    "message": "Das Sammeln von Interaktionsdaten, wenn Sie beispielsweise auf das Relay-Symbol in Ihrer Symbolleiste klicken oder eine neue Alias-Adresse erstellen, hilft uns zu verstehen, was gut funktioniert und wo wir uns verbessern können. Sie können dies jederzeit in den Einstellungen deaktivieren.",
    "description": "On the first run page after installing the add-on, we tell the user how interaction data helps Mozilla. DO NOT TRANSLATE \"Relay\"."
  },
  "firstRunPrefP_mask": {
    "message": "Das Sammeln von Interaktionsdaten, wenn Sie beispielsweise auf das Relay-Symbol in Ihrer Symbolleiste klicken oder eine neue Maske erstellen, hilft uns zu verstehen, was gut funktioniert und wo wir uns verbessern können. Sie können dies jederzeit in der Einstellungsansicht deaktivieren.",
    "description": "On the first run page after installing the add-on, we tell the user how interaction data helps Mozilla. DO NOT TRANSLATE \"Relay\"."
  },
  "firstRunSignInButton": {
    "message": "Registrieren / Anmelden"
  },
  "popupSettingsTitle": {
    "message": "Einstellungen"
  },
  "popupSettingsReturn": {
    "message": "Zurück zur Hauptansicht"
  },
  "popupSettingsShowIcon": {
    "message": "Relay-Symbol in E-Mail-Adressfeldern auf Websites anzeigen",
    "description": "In the settings panel, we display a toggle so the user can enable or disable the Relay icon in websites. DO NOT TRANSLATE \"Relay\"."
  },
  "popupSettingsCollectData": {
    "message": "Mozilla erlauben, Interaktionsdaten zu erheben",
    "description": "The label on the toggle that ENABLES sending interaction data to Mozilla. DO NOT TRANSLATE \"Mozilla\"."
  },
  "popupSettingsLeaveFeedback": {
    "message": "Feedback senden"
  },
  "popupSettingsPrivacy": {
    "message": "Datenschutz"
  },
  "popupSettingsTermsOfService": {
    "message": "Nutzungsbedingungen"
  },
  "popupSettingsReportIssue": {
    "message": "Problem melden"
  },
  "popupSettingsSubmitReport": {
    "message": "Bericht absenden"
  },
  "popupReportIssueSiteLabelHeadline": {
    "message": "Ich habe Probleme mit dieser Website"
  },
  "popupReportIssueSituationHeadline": {
    "message": "Problembeschreibung"
  },
  "popupReportIssueCaseOne": {
    "message": "Die E-Mail-Maske wurde von der Website nicht akzeptiert"
  },
  "popupReportIssueCaseTwo": {
    "message": "Das Relay-Add-on verursachte ein Problem bei der Darstellung der Website",
    "description": "DO NOT TRANSLATE \"Relay\"."
  },
  "popupReportIssueCaseThree": {
    "message": "Ich habe keine E-Mail von dieser Website erhalten, die ich erwartet hatte"
  },
  "popupReportIssueCaseOther": {
    "message": "Sonstiges"
  },
  "popupReportIssueCaseOtherDetails": {
    "message": "Bitte geben Sie weitere Details an"
  },
  "popupReportIssueSuccessHeadline": {
    "message": "Bericht gesendet!"
  },
  "popupReportIssueSuccessBody": {
    "message": "Vielen Dank für Ihre Hilfe bei der Verbesserung von Firefox Relay!",
    "description": "DO NOT TRANSLATE \"Firefox Relay\"."
  },
  "popupReportIssueSuccessContinue": {
    "message": "Weiter"
  },
  "popupSignUpPanelWelcome": {
    "message": "Willkommen"
  },
  "popupSignUpPanelIntro": {
    "message": "Melden Sie sich zunächst mit Ihrem Firefox-Konto bei Relay an.",
    "description": "In the pop-up panel, before the user has signed in, we invite to them sign in. DO NOT TRANSLATE \"Relay\", OR \"Firefox\"."
  },
  "popupSignUpPanelContinue": {
    "message": "Weiter"
  },
  "popupRemainingAliases_2": {
    "message": "Verbleibende Alias-Adressen: $REMAINING$",
    "description": "Tells the user how many more aliases they can make.",
    "placeholders": {
      "remaining": {
        "content": "$1"
      }
    }
  },
  "popupRemainingAliases_2_mask": {
    "message": "Verbleibende Masken: $REMAINING$",
    "description": "Tells the user how many more masks they can make.",
    "placeholders": {
      "remaining": {
        "content": "$1"
      }
    }
  },
  "popupRemainingFreeMasks": {
    "message": "Verbleibende kostenlose E-Mail-Masken:  $REMAINING$",
    "description": "Tells the user how many more free masks they can make.",
    "placeholders": {
      "remaining": {
        "content": "$1"
      }
    }
  },
  "popupRecentlyUsedMasks": {
    "message": "Kürzlich verwendete E-Mail-Masken",
    "description": "Label for list of most recently used masks."
  },
  "popupGetUnlimitedAliases": {
    "message": "Unbegrenzt viele Alias-Adressen erhalten"
  },
  "popupGetUnlimitedAliases_mask": {
    "message": "Unbegrenzt viele E-Mail-Masken erhalten"
  },
  "popupUnlimitedAliases": {
    "message": "Erstellte Alias-Adressen: $COUNT$",
    "description": "Tells the premium user how many aliases they have created.",
    "placeholders": {
      "count": {
        "content": "$1"
      }
    }
  },
  "popupUnlimitedAliases_mask": {
    "message": "Erstellte Masken: $COUNT$",
    "description": "Tells the premium user how many masks they have created.",
    "placeholders": {
      "count": {
        "content": "$1"
      }
    }
  },
  "popupOnboardingShowPrevious": {
    "message": "Vorherige Ansicht anzeigen"
  },
  "popupOnboardingShowNext": {
    "message": "Zur nächsten Ansicht gehen"
  },
  "ManageAllAliases": {
    "message": "Alle Alias-E-Mail-Adressen verwalten"
  },
  "ManageAllAliases_mask": {
    "message": "Alle Masken verwalten"
  },
  "labelManage": {
    "message": "Verwalten"
  },
  "labelSearch": {
    "message": "Suchen"
  },
  "labelFromThisWebsite": {
    "message": "Von dieser Website",
    "description": "In the pop-up panel, the use can view masks only created or used on a certain website."
  },
  "labelAllEmailMasks": {
    "message": "Alle E-Mail-Masken",
    "description": "In the pop-up panel, the use can view all masks they've created."
  },
  "popupOnboardingMaxAliasesPanelHeadline": {
    "message": "Perfekt!"
  },
  "popupOnboardingMaxAliasesPanelBody": {
    "message": "Sie sind ein Firefox-Relay-Power-User!",
    "description": "In the pop-up panel, when a free user has hit their mask limit, we tell them they're a power-user. DO NOT TRANSLATE \"Firefox Relay\"."
  },
  "popupRegisterDomainHeadline": {
    "message": "Holen Sie sich eine benutzerdefinierte Domain für Alias-E-Mail-Adressen bei Relay",
    "description": "DO NOT TRANSLATE \"Relay\"."
  },
  "popupRegisterDomainHeadline_mask": {
    "message": "Eine benutzerdefinierte Subdomain für Relay-E-Mail-Masken erhalten",
    "description": "DO NOT TRANSLATE \"Relay\"."
  },
  "popupRegisterDomainButton": {
    "message": "E-Mail-Domain registrieren"
  },
  "popupRegisterDomainButton_mask": {
    "message": "E-Mail-Subdomain registrieren"
  },
  "popupAliasesUsed": {
    "message": "Verwendete Alias-E-Mail-Adressen"
  },
  "popupAliasesUsed_mask": {
    "message": "Verwendete E-Mail-Masken"
  },
  "popupEmailsBlocked": {
    "message": "Blockierte E-Mails"
  },
  "popupEmailsForwarded": {
    "message": "Weitergeleitete E-Mails"
  },
  "popupEmailTrackersRemoved": {
    "message": "Entfernte E-Mail-Tracker"
  },
  "popupUpgradeToPremiumBanner": {
    "message": "Holen Sie sich Relay Premium, was noch mehr Schutz bietet!",
    "description": "DO NOT TRANSLATE \"Relay Premium\"."
  },
  "popupEducationalComponent1Headline": {
    "message": "Ein Werkzeug für weltweiten Schutz"
  },
  "popupEducationalComponent1Body": {
    "message": "Relay kann Ihnen dabei helfen, Ihre E-Mail-Adresse zu schützen, egal wo Sie sich befinden.",
    "description": "DO NOT TRANSLATE \"Relay\"."
  },
  "popupAttachmentSizeIncreaseHeadline": {
    "message": "Erhöhung der Größe von Anhängen"
  },
  "popupAttachmentSizeIncreaseBody": {
    "message": "Firefox Relay kann jetzt E-Mails bis zu einer Größe von 25 MB weiterleiten, einschließlich Anhängen.",
    "description": "DO NOT TRANSLATE \"Firefox Relay\"."
  },
  "popupEndOfIntroPricingHeadline": {
    "message": "Unser Angebot zum Einführungspreis endet bald!"
  },
  "popupEndOfIntroPricingBody": {
    "message": "Holen Sie sich Relay Premium vor dem 27. September und genießen Sie unbegrenzte Masken zu unserem monatlichen Einführungspreis.",
    "description": "DO NOT TRANSLATE \"Relay Premium\"."
  },
  "popupEndOfIntroPricingCTA": {
    "message": "Jetzt upgraden"
  },
  "popupEndOfIntroPricingCountdownDays": {
    "message": "Tage",
    "description": "This label displayed on top of a large number representing the number of DAYS of the remaining time that the introductory pricing offer is still valid. Please abbreviate if the word exceeds 5 characters."
  },
  "popupEndOfIntroPricingCountdownHours": {
    "message": "Stunden",
    "description": "This label displayed on top of a large number representing the number of HOURS of the remaining time that the introductory pricing offer is still valid. Please abbreviate if the word exceeds 5 characters."
  },
  "popupEndOfIntroPricingCountdownMinutes": {
    "message": "Min.",
    "description": "This label displayed on top of a large number representing the number of MINUTES of the remaining time that the introductory pricing offer is still valid. There's not much room for this, hence the abbreviation."
  },
  "popupEndOfIntroPricingCountdownSeconds": {
    "message": "Sek.",
    "description": "This label displayed on top of a large number representing the number of SECONDS of the remaining time that the introductory pricing offer is still valid. There's not much room for this, hence the abbreviation."
  },
  "popupCriticalEmailForwardingHeadline": {
    "message": "Weiterleitung wichtiger E-Mails"
  },
  "popupCriticalEmailForwardingBody": {
    "message": "Mit Relay Premium haben Sie die Möglichkeit, nur wichtige E-Mails zu empfangen, die an eine Alias-E-Mail-Adresse gesendet wurden. Sie erhalten E-Mails wie Quittungen, aber keine Werbe-E-Mails.",
    "description": "DO NOT TRANSLATE \"Relay Premium\"."
  },
  "popupCriticalEmailForwardingBody_mask": {
    "message": "Mit Relay Premium haben Sie die Möglichkeit, nur wichtige E-Mails zu empfangen, die an eine Maske gesendet wurden. Sie erhalten E-Mails wie Quittungen, aber keine Werbe-E-Mails.",
    "description": "DO NOT TRANSLATE \"Relay Premium\"."
  },
  "popupBlockPromotionalEmailsHeadline_2": {
    "message": "Werbe-E-Mails blockieren"
  },
  "popupBlockPromotionalEmailsBody": {
    "message": "Aktivieren Sie bei einer Alias-E-Mail-Adresse die Funktion „Werbe-E-Mails blockieren“, um zu verhindern, dass Werbe-E-Mails Ihren Posteingang erreichen."
  },
  "popupBlockPromotionalEmailsBody_mask": {
    "message": "Aktivieren Sie bei einer Maske die Funktion „Werbe-E-Mails blockieren“, um zu verhindern, dass Werbe-E-Mails Ihren Posteingang erreichen."
  },
  "popupBlockPromotionalEmailsBodyNonPremium": {
    "message": "Mit Relay Premium können Sie verhindern, dass Werbe-E-Mails Ihren Posteingang erreichen, während Sie weiterhin E-Mails wie Quittungen oder Versandinformationen erhalten.",
    "description": "DO NOT TRANSLATE \"Relay Premium\"."
  },
  "popupBundlePromoHeadline_2": {
    "message": "Holen Sie sich auch Mozilla VPN und sparen Sie $SAVINGS$.",
    "description": "DO NOT TRANSLATE \"Mozilla VPN\". This string includes a savings variable, e.g. 50%",
    "placeholders": {
      "savings": {
        "content": "$1",
        "example": "50%"
      }
    }
  },
  "popupBundlePromoHeadline_3": {
    "message": "Holen Sie sich auch Mozilla VPN und sparen Sie $SAVINGS$.",
    "description": "DO NOT TRANSLATE \"Mozilla VPN\". This string includes a savings variable, e.g. 50%",
    "placeholders": {
      "savings": {
        "content": "$1",
        "example": "40%"
      }
    }
  },
  "popupBundlePromoBody_2": {
    "message": "1-Jahres-Plan mit Relay Premium + Mozilla VPN für $MONTHLY_PRICE$/Monat.",
    "description": "DO NOT TRANSLATE \"Relay Premium\" and \"Mozilla VPN\". This string includes a monthly price variable, e.g. $4.99",
    "placeholders": {
      "monthly_price": {
        "content": "$1",
        "example": "$4.99"
      }
    }
  },
  "popupBundlePromoBody_3": {
    "message": "Holen Sie sich Sie ein Jahr Relay Premium mit Telefonmasken plus Mozilla VPN für $MONTHLY_PRICE$/Monat.",
    "description": "DO NOT TRANSLATE \"Relay Premium\" and \"Mozilla VPN\". This string includes a monthly price variable, e.g. $4.99",
    "placeholders": {
      "monthly_price": {
        "content": "$1",
        "example": "$6.99"
      }
    }
  },
  "popupPasswordManagerRelayHeadline": {
    "message": "Firefox-Passwort-Manager + Relay",
    "description": "DO NOT TRANSLATE \"Firefox\" and \"Relay\"."
  },
  "popupPasswordManagerRelayBody": {
    "message": "Jetzt können Sie Relay direkt in Ihrem Firefox-Passwort-Manager verwenden.",
    "description": "DO NOT TRANSLATE \"Relay\" and \"Firefox\"."
  },
  "popupBundlePromoHeadlineFreePlan": {
    "message": "Wir stellen vor: Relay + VPN-Abonnementplan",
    "description": "DO NOT TRANSLATE \"Relay\" and \"VPN\"."
  },
  "popupBundlePromoBodyFreePlan": {
    "message": "Machen Sie ein Upgrade für Ihr Abonnement und holen Sie sich sowohl Relay Premium als auch Mozilla VPN für $MONTHLY_PRICE$/Monat. Sparen Sie $SAVINGS$!",
    "description": "DO NOT TRANSLATE \"Relay Premium\" and \"Mozilla VPN\". This string includes a monthly price variable, e.g. $4.99. It also includes a savings variable, e.g. 50%",
    "placeholders": {
      "monthly_price": {
        "content": "$1",
        "example": "$4.99"
      },
      "savings": {
        "content": "$2",
        "example": "50%"
      }
    }
  },
  "popupBundlePromoCTA": {
    "message": "Holen Sie sich VPN + Relay",
    "description": "DO NOT TRANSLATE \"VPN\" and \"Relay\""
  },
  "popupPhoneMaskingPromoHeadline": {
    "message": "Einführung von Masken für Telefonnummern"
  },
  "popupPhoneMaskingPromoBody": {
    "message": "Mit der Telefonnummern-Maskierung können Sie jetzt eine Telefonnummernmaske erstellen, mit der Sie SMS und Anrufe erhalten können, ohne Ihre echte Nummer preiszugeben."
  },
  "popupPhoneMaskingPromoBodyPremium": {
    "message": "Erhalten Sie SMS und Anrufe, ohne Ihre echte Nummer preiszugeben."
  },
  "popupPhoneMaskingPromoCTA": {
    "message": "Jetzt upgraden"
  },
  "popupPromoNewLabel": {
    "message": "Neu!"
  },
  "popupSignBackInHeadline": {
    "message": "Melden Sie sich mit Ihren Alias-E-Mail-Adressen wieder an"
  },
  "popupSignBackInHeadline_mask": {
    "message": "Melden Sie sich mit Ihren E-Mail-Masken wieder an"
  },
  "popupSignBackInBody": {
    "message": "Um eine neue Alias-E-Mail-Adresse zu erstellen, wenn Sie nach einer E-Mail-Adresse gefragt werden, öffnen Sie das Kontextmenü (Rechtsklick oder Strg + Klick) in einem E-Mail-Adressfeld. Von dort können Sie sofort eine neue Alias-E-Mail-Adresse erstellen und verwenden."
  },
  "popupSignBackInBody_mask_v2": {
    "message": "Um eine neue E-Mail-Maske zu erstellen, wenn Sie nach einer E-Mail-Adresse gefragt werden, öffnen Sie das Kontextmenü (Rechtsklick oder Strg + Klick) in einem E-Mail-Adressfeld. Von dort können Sie sofort eine neue Maske erstellen und verwenden."
  },
  "pageInputIconSignUpText": {
    "message": "Besuchen Sie die Firefox-Relay-Website, um sich anzumelden oder ein Konto zu erstellen.",
    "description": "In the website content icon pop-up, before a user has signed in, we tell them to sign in. DO NOT TRANSLATE \"Firefox Relay\"."
  },
  "pageInputIconSignUpButton": {
    "message": "Firefox Relay besuchen",
    "description": "In the website content icon pop-up, before a user has signed in, we tell them to sign in. DO NOT TRANSLATE \"Firefox Relay\"."
  },
  "pageInputIconGenerateNewAlias": {
    "message": "Neue Alias-Adresse erzeugen"
  },
  "pageInputIconGenerateNewAlias_mask": {
    "message": "Neue Maske erzeugen"
  },
  "pageInputIconGenerateNewRandomMask": {
    "message": "Neue zufällige Maske erzeugen"
  },
  "pageInputIconSelectFromYourCurrentEmailMasks": {
    "message": "Wählen Sie aus Ihren aktuellen E-Mail-Masken",
    "description": "In the website content icon pop-up, users can re-use masks they've already created. This label is displayed when this is the only list visible."
  },
  "pageInputIconAdditionalEmailMasks": {
    "message": "Zusätzliche E-Mail-Masken",
    "description": "In the website content icon pop-up, users can re-use masks they've already created."
  },
  "pageInputIconPreviouslyUsedMask": {
    "message": "Bisher auf dieser Website verwendet",
    "description": "In the website content icon pop-up, users can select specific masks they've created on the current website."
  },
  "pageInputIconGetUnlimitedAliases": {
    "message": "Unbegrenzt viele Alias-Adressen erhalten"
  },
  "pageInputIconGetUnlimitedAliases_mask": {
    "message": "Unbegrenzt viele E-Mail-Masken erhalten"
  },
  "pageInputIconJoinPremiumWaitlist": {
    "message": "Auf Premium-Warteliste eintragen",
    "description": "For some free users (based on geographic region), Firefox Relay premium is not avialable yet. We instead prompt users to join our waitlist to be notified when it is available."
  },
  "pageInputIconUseExistingAliasFromTheSite": {
    "message": "Vorhandene Alias-E-Mail-Adresse von dieser Website verwenden…"
  },
  "pageInputIconUseExistingAliasFromTheSite_mask": {
    "message": "Vorhandene Maske von dieser Website verwenden…"
  },
  "pageInputIconRecentAliases": {
    "message": "Kürzlich verwendete Alias-E-Mail-Adressen"
  },
  "pageInputIconRecentAliases_mask": {
    "message": "Neueste Masken"
  },
  "pageInputIconInsertPhoneMask": {
    "message": "Maske für Handynummern verwenden"
  },
  "pageInputIconMaxAliasesError": {
    "message": "Sie haben bereits die maximale Anzahl von Alias-Adressen erstellt",
    "description": "Tells the user they have already created the max number of aliases."
  },
  "pageInputIconMaxAliasesError_mask": {
    "message": "Sie haben bereits die maximale Anzahl an Masken erstellt",
    "description": "Tells the user they have already created the max number of masks."
  },
  "pageFillRelayAddressLimit": {
    "message": "Sie haben die Grenze für Alias-Adressen erreicht."
  },
  "pageFillRelayAddressLimit_mask": {
    "message": "Sie haben die Grenze für Masken erreicht."
  },
  "pageNoMasksRemaining": {
    "message": "Sie haben keine kostenlosen E-Mail-Masken mehr.",
    "description": "Error message that appears when a free tier user uses all of their masks."
  },
  "profilePageInvalidAliasCharactersError": {
    "message": "Nicht zulässige(s) Zeichen: $CHARACTERS$",
    "description": "Error message that appears when the user tries to use special characters when labelling an mask.",
    "placeholders": {
      "characters": {
        "content": "$1",
        "example": "; )"
      }
    }
  },
  "profilePageDefaulAliasLabelText": {
    "message": "Kontoname hinzufügen",
    "description": "On the user's profile page, this text appears for a mask when it doesn't have a label."
  },
  "close": {
    "message": "Schließen"
  },
  "popupDataCollectionHeadline": {
    "message": "Neue Funktionen aktivieren"
  },
  "popupDataCollectionBody": {
    "message": "Sie können Relay erlauben, optionale Daten zu sammeln, die es uns ermöglichen, Ihre Alias-Beschriftungen über Ihre Geräte hinweg mit den Websites zu synchronisieren, auf denen sie erstellt und verwendet werden.",
    "description": "DO NOT TRANSLATE \"Relay\"."
  },
  "popupDataCollectionBody_mask": {
    "message": "Sie können Relay erlauben, optionale Daten zu sammeln, die es uns ermöglichen, Ihre Masken-Beschriftungen über Ihre Geräte hinweg mit den Websites zu synchronisieren, auf denen sie erstellt und verwendet werden.",
    "description": "DO NOT TRANSLATE \"Relay\"."
  },
  "popupDataCollectionButtonLearnMore": {
    "message": "Weitere Informationen"
  },
  "popupDataCollectionButtonDecline": {
    "message": "Ablehnen"
  },
  "popupDataCollectionButtonAllow": {
    "message": "Erlauben"
  },
  "popupPrivacyNoticeUpdateHeadline": {
    "message": "Aktualisierung des Datenschutzhinweises"
  },
  "popupPrivacyNoticeUpdateBody": {
    "message": "Um die Zuverlässigkeit von Firefox Relay für den Fall zu verbessern, dass eine E-Mail nicht zugestellt werden kann, speichern wir die E-Mail vorübergehend auf unseren Servern, bis sie zugestellt wurde. Wir speichern die E-Mail nie länger als drei Tage.",
    "description": "DO NOT TRANSLATE \"Firefox Relay\"."
  },
  "popupPrivacyNoticeUpdateButtonLearnMore": {
    "message": "Datenschutzhinweis ansehen"
  },
  "popupPrivacyNoticeUpdateButtonDismiss": {
    "message": "Schließen"
  }
}
