# -sed2v2.inp-------------------------------------------------------------
# Configuration script for src/config.h under DJGPP v2.x
# ----------------------------------------------------------------------
#
# Copyright (C) 1993-1997, 1999-2000, 2002-2024 Free Software
# Foundation, Inc.
#
# This file is part of GNU Emacs.
#
# This file is free software; as a special exception, the author gives
# unlimited permission to copy and/or distribute it, with or without
# modifications, as long as this notice is preserved.
#
# This program is distributed in the hope that it will be useful,
# but WITHOUT ANY WARRANTY; without even the implied warranty of
# MERCHANTABILITY or FITNESS FOR A PARTICULAR PURPOSE.
#
# ----------------------------------------------------------------------

/^#define EMACS_CONFIG_H/a\
\
#include <sys/version.h>\
/* In DJGPP v2.x almost everything is already defined in a system header.  */\
#include <sys/config.h>\

/^#undef MSDOS *$/c\
#ifndef MSDOS\
#define MSDOS\
#endif
/^#undef COPYRIGHT *$/s/^.*$/#define COPYRIGHT "Copyright (C) 2024 Free Software Foundation, Inc."/
/^#undef DIRECTORY_SEP *$/s!^.*$!#define DIRECTORY_SEP '/'!
/^#undef DOS_NT *$/s/^.*$/#define DOS_NT/
/^#undef FLOAT_CHECK_DOMAIN *$/s/^.*$/#define FLOAT_CHECK_DOMAIN/
/^#undef HAVE_ALLOCA *$/s/^.*$/#define HAVE_ALLOCA 1/
/^#undef HAVE_SBRK *$/s/^.*$/#define HAVE_SBRK 1/
/^#undef HAVE_SETITIMER *$/s/^.*$/#define HAVE_SETITIMER 1/
/^#undef HAVE_STRUCT_UTIMBUF *$/s/^.*$/#define HAVE_STRUCT_UTIMBUF 1/
/^#undef LOCALTIME_CACHE *$/s/^.*$/#define LOCALTIME_CACHE 1/
/^#undef HAVE_TZSET *$/s/^.*$/#define HAVE_TZSET 1/
/^#undef HAVE_UNEXEC *$/s/^.*$/#define HAVE_UNEXEC 1/
/^#undef HAVE_RINT *$/s/^.*$/#define HAVE_RINT 1/
/^#undef HAVE_C99_STRTOLD *$/s/^.*$/#define HAVE_C99_STRTOLD 1/
/^#undef HAVE_DIFFTIME *$/s/^.*$/#define HAVE_DIFFTIME 1/
/^#undef HAVE_FPATHCONF *$/s/^.*$/#define HAVE_FPATHCONF 1/
/^#undef HAVE_MEMSET *$/s/^.*$/#define HAVE_MEMSET 1/
/^#undef HAVE_MEMCMP *$/s/^.*$/#define HAVE_MEMCMP 1/
/^#undef HAVE_MEMMOVE *$/s/^.*$/#define HAVE_MEMMOVE 1/
/^#undef HAVE_SETPGID *$/s/^.*$/#define HAVE_SETPGID 1/
/^#undef HAVE_SETRLIMIT *$/s/^.*$/#define HAVE_SETRLIMIT 1/
/^#undef HAVE_SIGSETJMP *$/s/^.*$/#define HAVE_SIGSETJMP 1/
/^#undef HAVE_GETRUSAGE *$/s/^.*$/#define HAVE_GETRUSAGE 1/
/^#undef GETTIMEOFDAY_TIMEZONE *$/s/^.*$/#define GETTIMEOFDAY_TIMEZONE struct timezone/
/^#undef HAVE_TM_GMTOFF *$/s/^.*$/#define HAVE_TM_GMTOFF 1/
/^#undef HAVE_STRUCT_TIMEZONE *$/s/^.*$/#define HAVE_STRUCT_TIMEZONE 1/
/^#undef HAVE_SIZE_T *$/s/^.*$/#define HAVE_SIZE_T 1/
/^#undef HAVE_MKSTEMP *$/s/^.*$/#define HAVE_MKSTEMP 1/
/^#undef HAVE_STRNCASECMP *$/s/^.*$/#define HAVE_STRNCASECMP 1/
/^#undef HAVE_STRUCT_TM_TM_ZONE *$/s/^.*$/#define HAVE_STRUCT_TM_TM_ZONE 1/
/^#undef HAVE_SYNC *$/s/^.*$/#define HAVE_SYNC 1/
/^#undef HAVE___BUILTIN_FRAME_ADDRESS *$/s/^.*$/#define HAVE___BUILTIN_FRAME_ADDRESS 1/
/^#undef HAVE___BUILTIN_UNWIND_INIT *$/s/^.*$/#define HAVE___BUILTIN_UNWIND_INIT 1/
/^#undef HAVE_MENUS *$/s/^.*$/#define HAVE_MENUS 1/
/^#undef DATA_START/s/^.*$/#define DATA_START (\&etext + 1)/
/^#undef GC_SETJMP_WORKS/s/^.*$/#define GC_SETJMP_WORKS 1/
/^#undef ORDINARY_LINK/s/^.*$/#define ORDINARY_LINK 1/
/^#undef PACKAGE_BUGREPORT/s/^.*$/#define PACKAGE_BUGREPORT ""/
/^#undef PACKAGE_NAME/s/^.*$/#define PACKAGE_NAME ""/
/^#undef PACKAGE_STRING/s/^.*$/#define PACKAGE_STRING ""/
/^#undef PACKAGE_TARNAME/s/^.*$/#define PACKAGE_TARNAME ""/
/^#undef PACKAGE_VERSION/s/^.*$/#define PACKAGE_VERSION "29.3"/
/^#undef SYSTEM_TYPE/s/^.*$/#define SYSTEM_TYPE "ms-dos"/
/^#undef HAVE_DECL_GETENV/s/^.*$/#define HAVE_DECL_GETENV 1/
/^#undef SYS_SIGLIST_DECLARED/s/^.*$/#define SYS_SIGLIST_DECLARED 1/
/^#undef HAVE_DIRENT_H/s/^.*$/#define HAVE_DIRENT_H 1/

/^#undef BITSIZEOF_PTRDIFF_T *$/s/^.*$/#define BITSIZEOF_PTRDIFF_T 32/
/^#undef BITSIZEOF_SIG_ATOMIC_T *$/s/^.*$/#define BITSIZEOF_SIG_ATOMIC_T 32/
/^#undef BITSIZEOF_SIZE_T *$/s/^.*$/#define BITSIZEOF_SIZE_T 32/
/^#undef BITSIZEOF_WCHAR_T *$/s/^.*$/#define BITSIZEOF_WCHAR_T 16/
/^#undef BITSIZEOF_WINT_T *$/s/^.*$/#define BITSIZEOF_WINT_T 32/
/^#undef HAVE__BOOL/s/^.*$/#define HAVE__BOOL 1/
/^#undef HAVE_LONG_LONG_INT *$/s/^.*$/#define HAVE_LONG_LONG_INT 1/
/^#undef HAVE_SIGNED_SIG_ATOMIC_T *$/s/^.*$/#define HAVE_SIGNED_SIG_ATOMIC_T 1/
/^#undef HAVE_SIGNED_WINT_T *$/s/^.*$/#define HAVE_SIGNED_WINT_T 1/
/^#undef HAVE_UNSIGNED_LONG_LONG_INT *$/s/^.*$/#define HAVE_UNSIGNED_LONG_LONG_INT 1/
/^#undef DEVICE_SEP *$/s/^.*$/#define DEVICE_SEP ':'/
/^#undef IS_DIRECTORY_SEP *$/s,^.*$,#define IS_DIRECTORY_SEP(_c_) ((_c_) == '/' || (_c_) == '\\\\'),
/^#undef IS_DEVICE_SEP *$/s/^.*$/#define IS_DEVICE_SEP(_c_) ((_c_) == ':')/
/^#undef IS_ANY_SEP *$/s/^.*$/#define IS_ANY_SEP(_c_) (IS_DIRECTORY_SEP (_c_) || IS_DEVICE_SEP (_c_))/
/^#undef NEED_MKTIME_INTERNAL *$/s/^.*$/#define NEED_MKTIME_INTERNAL 1/
/^#undef NEED_MKTIME_WORKING *$/s/^.*$/#define NEED_MKTIME_WORKING 1/
/^#undef INTERNAL_TERMINAL *$/s,^.*$,#define INTERNAL_TERMINAL "pc|bios|IBM PC with color display::co#80:li#25:Co#16:pa#256:km:ms:cm=<CM>:cl=<CL>:ce=<CE>::se=</SO>:so=<SO>:us=<UL>:ue=</UL>:md=<BD>:mh=<DIM>:mb=<BL>:mr=<RV>:me=<NV>::AB=<BG %d>:AF=<FG %d>:op=<DefC>:",
/^#undef NULL_DEVICE *$/s/^.*$/#define NULL_DEVICE "nul"/
/^#undef SEPCHAR *$/s/^.*$/#define SEPCHAR '\;'/
/^#undef USER_FULL_NAME *$/s/^.*$/#define USER_FULL_NAME (getenv ("NAME"))/
/^# *undef _GNU_SOURCE *$/s/^.*$/#define _GNU_SOURCE 1/
/^#undef inline/s/^.*$/#define inline __inline__/
/^#undef my_strftime/s/^.*$/#define my_strftime nstrftime/
/^#undef restrict/s/^.*$/#define restrict __restrict/

/^#undef GNU_MALLOC *$/s/^.*$/#define GNU_MALLOC 1/
/^#undef REL_ALLOC *$/s/^.*$/#define REL_ALLOC 1/

s/^#undef STACK_DIRECTION *$/#define STACK_DIRECTION -1/
s/^#undef EMACS_CONFIGURATION *$/#define EMACS_CONFIGURATION "i386-pc-msdosdjgpp"/
s/^#undef EMACS_CONFIG_OPTIONS *$/#define EMACS_CONFIG_OPTIONS "msdos"/
s/^#undef EMACS_CONFIG_FEATURES *$/#define EMACS_CONFIG_FEATURES ""/
s|^#undef FLEXIBLE_ARRAY_MEMBER *$|#define FLEXIBLE_ARRAY_MEMBER /**/|
s/^#undef PROTOTYPES *$/#define PROTOTYPES 1/
s/^#undef POINTER_TYPE *$/#define POINTER_TYPE void/
/^#undef HAVE_INTTYPES_H/c\
#if __DJGPP__ > 2 || __DJGPP_MINOR__ > 3\
#define HAVE_INTTYPES_H 1\
#else\
#undef HAVE_INTTYPES_H\
#endif
s/^#undef HAVE_STDBOOL_H/#define HAVE_STDBOOL_H 1/
/^#undef HAVE_STDINT_H/c\
#if __DJGPP__ > 2 || __DJGPP_MINOR__ > 3\
#define HAVE_STDINT_H 1\
#else\
#undef HAVE_STDINT_H\
#endif
s/^#undef HAVE_C_VARARRAYS *$/#define HAVE_C_VARARRAYS 1/
s/^#undef HAVE_DECL_ALIGNED_ALLOC *$/#define HAVE_DECL_ALIGNED_ALLOC 0/
s/^#undef HAVE_DECL_CLEARERR_UNLOCKED *$/#define HAVE_DECL_CLEARERR_UNLOCKED 0/
s/^#undef HAVE_DECL_FEOF_UNLOCKED *$/#define HAVE_DECL_FEOF_UNLOCKED 0/
s/^#undef HAVE_DECL_FERROR_UNLOCKED *$/#define HAVE_DECL_FERROR_UNLOCKED 0/
s/^#undef HAVE_DECL_FFLUSH_UNLOCKED *$/#define HAVE_DECL_FFLUSH_UNLOCKED 0/
s/^#undef HAVE_DECL_FGETS_UNLOCKED *$/#define HAVE_DECL_FGETS_UNLOCKED 0/
s/^#undef HAVE_DECL_FPUTC_UNLOCKED *$/#define HAVE_DECL_FPUTC_UNLOCKED 0/
s/^#undef HAVE_DECL_FPUTS_UNLOCKED *$/#define HAVE_DECL_FPUTS_UNLOCKED 0/
s/^#undef HAVE_DECL_FREAD_UNLOCKED *$/#define HAVE_DECL_FREAD_UNLOCKED 0/
s/^#undef HAVE_DECL_FWRITE_UNLOCKED *$/#define HAVE_DECL_FWRITE_UNLOCKED 0/
s/^#undef HAVE_DECL_GETCHAR_UNLOCKED *$/#define HAVE_DECL_GETCHAR_UNLOCKED 0/
s/^#undef HAVE_DECL_GETC_UNLOCKED *$/#define HAVE_DECL_GETC_UNLOCKED 0/
s/^#undef HAVE_DECL_PUTCHAR_UNLOCKED *$/#define HAVE_DECL_PUTCHAR_UNLOCKED 0/
s/^#undef HAVE_DECL_PUTC_UNLOCKED *$/#define HAVE_DECL_PUTC_UNLOCKED 0/
s/^#undef HAVE_DECL_STRTOLL *$/#define HAVE_DECL_STRTOLL 1/
s/^#undef HAVE_DECL_STRTOIMAX *$/#define HAVE_DECL_STRTOIMAX 1/
s/^#undef HAVE_STRTOLL *$/#define HAVE_STRTOLL 1/
s/^#undef HAVE_STRTOULL *$/#define HAVE_STRTOULL 1/
/^#undef HAVE_STRUCT_DIRENT_D_TYPE *$/c\
#if __DJGPP__ + (__DJGPP_MINOR__ >= 5) >= 3\
#define HAVE_STRUCT_DIRENT_D_TYPE 1/\
#else\
#undef HAVE_STRUCT_DIRENT_D_TYPE\
#endif
s/^#undef HAVE_STRUCT_ATTRIBUTE_ALIGNED *$/#define HAVE_STRUCT_ATTRIBUTE_ALIGNED 1/
s/^#undef HAVE_PUTENV *$/#define HAVE_PUTENV 1/
/^#undef HAVE_SIGSET_T *$/s/^.*$/#define HAVE_SIGSET_T 1/
/^#undef HAVE_SNPRINTF/c\
#if __DJGPP__ > 2 || __DJGPP_MINOR__ > 3\
#define HAVE_SNPRINTF 1\
#else\
#undef HAVE_SNPRINTF\
#include <sys/types.h>\
extern int snprintf (char *__restrict, size_t, const char *__restrict, ...);\
#endif
/^#include <conf_post.h>/i\
/* From libc/file.h, needed by lib/fpending.c.  */\
#define _IOERR  000200

# Comment out any remaining undef directives, because some of them
# might be defined in sys/config.h we include at the top of config.h.
/^#undef BSTRING/s|#undef|# undef|
/^#undef .*$/s|^.*$|/* & */|
