<?xml version="1.0" standalone="no"?>
<!DOCTYPE svg PUBLIC "-//W3C//DTD SVG 20010904//EN"
 "http://www.w3.org/TR/2001/REC-SVG-20010904/DTD/svg10.dtd">
<svg version="1.0" xmlns="http://www.w3.org/2000/svg"
 width="700.000000pt" height="700.000000pt" viewBox="0 0 700.000000 700.000000"
 preserveAspectRatio="xMidYMid meet">
<metadata>
Created by potrace 1.14, written by Peter Selinger 2001-2017
</metadata>
<g transform="translate(0.000000,700.000000) scale(0.100000,-0.100000)"
fill="#000000" stroke="none">
<path d="M3457 6564 c-1 -1 -58 -4 -127 -8 -158 -8 -310 -28 -470 -61 -117
-25 -331 -85 -375 -105 -11 -5 -31 -12 -45 -16 -14 -3 -43 -15 -65 -25 -22 -9
-78 -34 -125 -54 -548 -236 -1056 -686 -1378 -1223 -180 -299 -324 -675 -381
-997 -6 -33 -13 -69 -15 -80 -2 -11 -7 -49 -11 -85 -4 -36 -9 -72 -10 -81 -21
-107 -21 -506 0 -669 2 -19 7 -60 11 -90 4 -30 8 -67 8 -82 1 -16 4 -28 8 -28
5 0 8 -13 8 -28 0 -16 6 -49 13 -73 8 -25 12 -55 10 -68 -2 -12 1 -20 6 -17 5
3 9 -6 10 -19 4 -56 6 -65 11 -65 7 0 9 -10 13 -54 1 -13 4 -22 6 -20 2 2 21
-44 41 -104 63 -181 71 -202 106 -273 19 -38 34 -73 34 -78 0 -5 7 -14 15 -21
9 -7 13 -15 11 -18 -3 -2 6 -24 20 -48 14 -24 23 -48 19 -54 -4 -6 -1 -9 7 -8
7 2 12 -3 11 -9 -2 -7 2 -13 7 -13 6 0 15 -11 19 -24 5 -13 27 -50 47 -82 21
-32 37 -62 36 -66 -1 -5 3 -8 8 -8 6 0 10 -6 10 -14 0 -8 7 -17 16 -20 9 -4
14 -13 10 -22 -3 -8 -2 -12 4 -9 9 6 14 -8 11 -27 0 -5 5 -7 12 -5 6 1 11 -4
10 -10 -2 -7 3 -13 11 -13 7 0 19 -13 26 -30 7 -16 15 -30 19 -30 12 0 86
-103 83 -115 -2 -5 0 -7 4 -3 9 9 46 -31 39 -43 -3 -4 0 -11 6 -15 8 -5 10 -2
5 7 -5 8 10 -4 31 -26 22 -22 39 -42 38 -45 -1 -3 9 -15 22 -27 13 -12 23 -19
23 -16 0 4 6 -2 14 -13 10 -13 11 -23 4 -31 -7 -9 -7 -13 0 -13 6 0 12 5 14
12 3 7 33 -16 71 -52 36 -36 80 -76 98 -90 17 -14 41 -33 52 -43 12 -10 34
-26 50 -35 15 -9 25 -22 23 -28 -2 -6 3 -11 12 -10 9 0 16 -5 14 -12 -1 -8 2
-11 8 -7 7 4 21 -2 33 -13 12 -11 47 -36 78 -55 31 -20 64 -43 73 -52 9 -9 16
-14 16 -11 0 4 19 -6 43 -21 23 -15 83 -49 132 -75 50 -26 89 -51 88 -56 -1
-5 9 -8 22 -7 13 2 29 -3 36 -11 6 -8 18 -14 26 -14 8 0 12 -4 8 -9 -3 -5 0
-13 6 -17 8 -5 9 -3 4 6 -6 10 -1 11 21 6 16 -4 31 -12 32 -17 2 -5 13 -9 23
-9 11 0 18 -4 15 -9 -4 -5 2 -8 11 -7 9 2 28 -3 42 -11 15 -7 32 -13 39 -13 7
0 11 -3 9 -7 -3 -5 9 -9 26 -10 17 -1 34 -7 37 -14 4 -6 10 -10 14 -10 29 4
46 -1 40 -11 -4 -6 -3 -8 3 -5 11 7 122 -20 139 -34 6 -5 13 -7 15 -4 3 2 23
-1 45 -7 21 -6 42 -11 47 -10 4 1 7 -3 7 -9 0 -5 4 -8 9 -5 13 8 112 -14 130
-28 11 -8 15 -8 18 2 3 6 10 9 16 5 14 -9 29 -12 77 -17 157 -16 186 -20 192
-30 6 -8 8 -8 8 1 0 12 17 12 37 0 6 -4 14 -3 18 3 4 6 11 7 18 3 6 -4 29 -7
52 -7 22 -1 46 -5 54 -10 10 -6 12 -6 7 2 -9 15 19 16 46 1 11 -6 18 -7 14 -1
-3 6 27 9 77 10 45 0 105 3 132 5 105 12 140 11 137 -2 -1 -7 2 -10 8 -6 6 3
8 10 5 15 -3 4 9 10 25 12 17 3 30 0 30 -6 0 -8 3 -8 8 0 9 15 73 24 65 10 -4
-6 1 -5 10 3 10 8 20 11 24 8 3 -4 12 -2 19 4 8 6 21 9 29 5 8 -3 15 -1 15 5
0 5 6 9 13 7 6 -1 25 1 41 6 20 5 32 3 37 -6 7 -10 9 -8 9 5 0 12 6 17 18 15
9 -1 22 1 28 4 13 8 61 20 91 22 11 0 19 5 15 10 -3 5 5 7 16 4 12 -4 22 -2
22 3 0 5 3 8 8 7 7 -1 23 4 70 23 18 7 22 6 16 -3 -4 -7 2 -5 13 4 11 10 24
18 30 18 6 0 44 13 84 30 40 16 75 28 77 25 2 -2 11 3 19 11 8 8 19 12 24 9 5
-4 9 -2 9 4 0 5 10 13 23 16 34 11 230 108 246 123 7 7 20 11 27 8 8 -3 13 0
11 7 -1 7 4 11 11 10 6 -2 12 1 12 7 0 5 7 7 15 3 10 -3 15 0 13 8 -2 9 5 14
18 13 12 0 20 4 18 10 -5 13 45 38 58 30 5 -3 7 0 6 8 -2 7 5 12 14 12 10 -1
16 2 15 6 -3 12 200 159 209 152 4 -4 4 -2 1 4 -7 12 41 51 56 46 4 -1 7 5 7
13 0 8 4 15 8 15 5 0 34 25 65 55 32 30 57 52 57 50 0 -3 9 4 20 15 11 11 20
24 20 29 0 10 30 25 43 22 5 -1 6 3 2 8 -8 14 74 96 94 94 9 -1 11 0 4 3 -16
7 5 44 25 44 7 0 11 4 7 9 -3 5 5 17 17 25 12 9 18 16 13 16 -5 0 5 14 23 30
18 17 30 30 25 30 -4 1 2 9 14 19 12 10 20 21 17 24 -3 2 7 14 21 25 14 11 26
22 25 24 -3 9 13 37 19 33 4 -2 8 2 8 9 0 11 40 75 54 86 4 3 17 24 29 47 12
24 27 40 33 36 6 -3 7 -1 3 5 -4 6 5 30 19 52 14 23 30 52 35 65 5 14 14 25
20 25 6 0 8 5 5 10 -3 6 -1 10 5 10 6 0 9 4 6 9 -3 5 1 14 9 21 8 7 12 16 9
21 -3 5 0 9 5 9 6 0 10 3 9 8 -4 14 14 52 24 52 6 0 9 3 5 6 -9 10 14 64 26
57 6 -3 7 -1 3 6 -4 6 -2 18 4 26 7 8 9 15 5 15 -4 0 -3 6 2 12 6 7 18 36 28
65 10 29 23 49 28 46 5 -3 6 3 3 14 -7 22 2 55 13 49 4 -3 7 3 8 12 1 9 3 24
5 32 11 41 40 137 45 150 7 18 9 25 16 65 3 17 8 40 11 53 6 22 9 37 22 97 3
17 9 34 11 38 3 5 7 30 9 55 2 26 5 56 8 68 4 19 12 101 22 218 6 75 6 339 -1
431 -21 313 -94 627 -216 938 -30 76 -151 320 -195 394 -87 147 -242 361 -341
473 -138 156 -287 293 -468 429 -281 210 -557 355 -877 460 -124 40 -327 92
-418 106 -25 4 -54 9 -65 11 -11 2 -47 7 -80 10 -33 4 -63 8 -66 10 -8 5 -366
22 -372 18z"/>
<path d="M616 2367 c3 -10 9 -15 12 -12 3 3 0 11 -7 18 -10 9 -11 8 -5 -6z"/>
<path d="M6193 1965 c0 -8 4 -12 9 -9 5 3 6 10 3 15 -9 13 -12 11 -12 -6z"/>
<path d="M814 1938 c-4 -7 -4 -10 1 -6 4 4 15 2 24 -5 14 -11 14 -10 2 6 -16
20 -18 21 -27 5z"/>
<path d="M873 1845 c0 -8 4 -12 9 -9 5 3 6 10 3 15 -9 13 -12 11 -12 -6z"/>
<path d="M895 1820 c-3 -5 -1 -10 4 -10 6 0 11 5 11 10 0 6 -2 10 -4 10 -3 0
-8 -4 -11 -10z"/>
<path d="M6095 1820 c3 -5 8 -10 11 -10 2 0 4 5 4 10 0 6 -5 10 -11 10 -5 0
-7 -4 -4 -10z"/>
<path d="M936 1753 c-6 -14 -5 -15 5 -6 7 7 10 15 7 18 -3 3 -9 -2 -12 -12z"/>
<path d="M1180 1446 c0 -2 8 -10 18 -17 15 -13 16 -12 3 4 -13 16 -21 21 -21
13z"/>
<path d="M1220 1406 c0 -2 8 -10 18 -17 15 -13 16 -12 3 4 -13 16 -21 21 -21
13z"/>
<path d="M1295 1280 c-3 -5 -1 -10 4 -10 6 0 11 5 11 10 0 6 -2 10 -4 10 -3 0
-8 -4 -11 -10z"/>
<path d="M1385 1240 c-3 -6 1 -7 9 -4 18 7 21 14 7 14 -6 0 -13 -4 -16 -10z"/>
<path d="M1375 1201 c-3 -5 -2 -12 3 -15 5 -3 9 1 9 9 0 17 -3 19 -12 6z"/>
<path d="M1415 1180 c3 -5 8 -10 11 -10 2 0 4 5 4 10 0 6 -5 10 -11 10 -5 0
-7 -4 -4 -10z"/>
<path d="M5599 1173 c-13 -16 -12 -17 4 -4 16 13 21 21 13 21 -2 0 -10 -8 -17
-17z"/>
<path d="M5556 1167 c3 -10 9 -15 12 -12 3 3 0 11 -7 18 -10 9 -11 8 -5 -6z"/>
<path d="M5535 1140 c-3 -5 -1 -10 4 -10 6 0 11 5 11 10 0 6 -2 10 -4 10 -3 0
-8 -4 -11 -10z"/>
<path d="M5495 1100 c-3 -5 -1 -10 4 -10 6 0 11 5 11 10 0 6 -2 10 -4 10 -3 0
-8 -4 -11 -10z"/>
<path d="M1610 1060 c0 -5 5 -10 11 -10 5 0 7 5 4 10 -3 6 -8 10 -11 10 -2 0
-4 -4 -4 -10z"/>
<path d="M5355 1009 c-4 -6 -5 -12 -2 -15 2 -3 7 2 10 11 7 17 1 20 -8 4z"/>
<path d="M5313 995 c0 -8 4 -12 9 -9 4 3 8 9 8 15 0 5 -4 9 -8 9 -5 0 -9 -7
-9 -15z"/>
<path d="M1750 899 c0 -5 5 -7 10 -4 6 3 10 8 10 11 0 2 -4 4 -10 4 -5 0 -10
-5 -10 -11z"/>
<path d="M1810 859 c0 -5 5 -7 10 -4 6 3 10 8 10 11 0 2 -4 4 -10 4 -5 0 -10
-5 -10 -11z"/>
<path d="M1895 800 c-3 -5 -1 -10 4 -10 6 0 11 5 11 10 0 6 -2 10 -4 10 -3 0
-8 -4 -11 -10z"/>
<path d="M1990 800 c0 -5 5 -10 11 -10 5 0 7 5 4 10 -3 6 -8 10 -11 10 -2 0
-4 -4 -4 -10z"/>
<path d="M4975 780 c3 -5 8 -10 11 -10 2 0 4 5 4 10 0 6 -5 10 -11 10 -5 0 -7
-4 -4 -10z"/>
<path d="M2079 713 c-13 -16 -12 -17 4 -4 16 13 21 21 13 21 -2 0 -10 -8 -17
-17z"/>
<path d="M4830 720 c0 -5 5 -10 11 -10 5 0 7 5 4 10 -3 6 -8 10 -11 10 -2 0
-4 -4 -4 -10z"/>
<path d="M4876 713 c-6 -14 -5 -15 5 -6 7 7 10 15 7 18 -3 3 -9 -2 -12 -12z"/>
<path d="M4940 726 c0 -2 8 -10 18 -17 15 -13 16 -12 3 4 -13 16 -21 21 -21
13z"/>
<path d="M4775 660 c-3 -5 -1 -10 4 -10 6 0 11 5 11 10 0 6 -2 10 -4 10 -3 0
-8 -4 -11 -10z"/>
<path d="M4835 649 c-4 -6 -5 -12 -2 -15 2 -3 7 2 10 11 7 17 1 20 -8 4z"/>
<path d="M2335 620 c3 -5 8 -10 11 -10 2 0 4 5 4 10 0 6 -5 10 -11 10 -5 0 -7
-4 -4 -10z"/>
<path d="M4671 607 c-8 -10 -7 -14 2 -14 8 0 14 6 14 14 0 7 -1 13 -2 13 -2 0
-8 -6 -14 -13z"/>
<path d="M2307 599 c7 -7 15 -10 18 -7 3 3 -2 9 -12 12 -14 6 -15 5 -6 -5z"/>
<path d="M4555 600 c-3 -5 -1 -10 4 -10 6 0 11 5 11 10 0 6 -2 10 -4 10 -3 0
-8 -4 -11 -10z"/>
<path d="M2575 540 c-3 -5 -1 -10 4 -10 6 0 11 5 11 10 0 6 -2 10 -4 10 -3 0
-8 -4 -11 -10z"/>
<path d="M2660 526 c0 -2 8 -10 18 -17 15 -13 16 -12 3 4 -13 16 -21 21 -21
13z"/>
<path d="M4393 515 c0 -8 4 -12 9 -9 5 3 6 10 3 15 -9 13 -12 11 -12 -6z"/>
<path d="M4170 460 c0 -5 5 -10 11 -10 5 0 7 5 4 10 -3 6 -8 10 -11 10 -2 0
-4 -4 -4 -10z"/>
<path d="M2710 456 c0 -2 8 -10 18 -17 15 -13 16 -12 3 4 -13 16 -21 21 -21
13z"/>
<path d="M3995 440 c-3 -5 -1 -10 4 -10 6 0 11 5 11 10 0 6 -2 10 -4 10 -3 0
-8 -4 -11 -10z"/>
<path d="M3610 419 c0 -5 5 -7 10 -4 6 3 10 8 10 11 0 2 -4 4 -10 4 -5 0 -10
-5 -10 -11z"/>
<path d="M4165 420 c-3 -6 1 -7 9 -4 18 7 21 14 7 14 -6 0 -13 -4 -16 -10z"/>
<path d="M2915 409 c-4 -6 -5 -12 -2 -15 2 -3 7 2 10 11 7 17 1 20 -8 4z"/>
<path d="M2956 407 c3 -10 9 -15 12 -12 3 3 0 11 -7 18 -10 9 -11 8 -5 -6z"/>
<path d="M2995 411 c-3 -5 -2 -12 3 -15 5 -3 9 1 9 9 0 17 -3 19 -12 6z"/>
<path d="M3990 402 c0 -5 7 -9 15 -9 8 0 12 4 9 9 -3 4 -9 8 -15 8 -5 0 -9 -4
-9 -8z"/>
</g>
</svg>
