1 10 20
100 200 125
201 210 89
900 1000 174
1 1 1
10 10 7
777 777 34
1001 2000 182
3001 4000 238
1 999999 525
1000 2000 182
6000 7000 262
80000 90000 333
70001 80000 351
100001 200000 383
70001 800001 509
500001 600001 470
600001 777777 509
500001 666666 509
111 8000 262
98787 200000 383
6766 888999 525
7373 9999 260
111 33333 308
11 12 15
10004 10005 30
666 888 179
8989 8999 185
999999 1 525
2000 1001 182
89000 88001 333
7000 6001 262
999999 999001 396
4000 1001 238
50000 30001 324
100000 2001 351
402 401 20
401 400 28
70000 69001 299
88787 222 351
100020 111 351
898898 3 525
141414 555 354
787 33 171
777 666 171
3 2 8
99 98 26
100000 100000 129
1 1000 179
1001 2000 182
2001 3000 217
3001 4000 238
4001 5000 215
5001 6000 236
6001 7000 262
7001 8000 252
8001 9000 247
9001 10000 260
10001 11000 268
11001 12000 250
12001 13000 263
13001 14000 276
14001 15000 271
15001 16000 271
16001 17000 266
17001 18000 279
18001 19000 261
19001 20000 274
100001 101000 341
101001 102000 310
102001 103000 310
103001 104000 248
104001 105000 310
105001 106000 341
106001 107000 354
107001 108000 292
108001 109000 279
109001 110000 310
1000 1 179
2000 1001 182
3000 2001 217
4000 3001 238
5000 4001 215
6000 5001 236
7000 6001 262
8000 7001 252
9000 8001 247
10000 9001 260
11000 10001 268
12000 11001 250
13000 12001 263
14000 13001 276
15000 14001 271
16000 15001 271
17000 16001 266
18000 17001 279
19000 18001 261
20000 19001 274
101000 100001 341
102000 101001 310
103000 102001 310
104000 103001 248
105000 104001 310
106000 105001 341
107000 106001 354
108000 107001 292
109000 108001 279
110000 109001 310
100 200 125
303 403 144
503 403 142
550 753 171
7333 7322 164
222 222 71
113807 680055 509
481621 780384 509
44597 192441 383
643685 750603 504
935002 298496 525
515513 255834 470
36588 434990 449
763203 911202 525
13225 423041 449
180962 585013 470
525639 743844 509
639209 286406 509
270086 41970 443
806298 480525 509
782491 669358 504
251838 826703 509
970402 855365 507
69065 385860 443
416436 687554 509
660704 394737 509
903681 335646 525
770506 394903 509
645677 589810 509
352543 504111 449
295230 935882 525
37218 253931 443
90269 757203 509
328777 914911 525
491427 14575 449
861309 19458 525
158505 616921 470
438520 54732 449
260200 786058 509
767869 606002 509
140445 504526 449
124294 913710 525
655009 746694 504
346313 647345 509
485510 776698 509
465874 538192 470
110924 734370 509
284998 397334 441
450973 405042 449
650773 882859 525
467833 936566 525
373729 89329 443
414460 179783 449
763215 188736 509
769629 630800 504
220997 925265 525
