{
  "board": {
    "design_settings": {
      "defaults": {
        "board_outline_line_width": 0.049999999999999996,
        "copper_line_width": 0.19999999999999998,
        "copper_text_italic": false,
        "copper_text_size_h": 1.5,
        "copper_text_size_v": 1.5,
        "copper_text_thickness": 0.3,
        "copper_text_upright": false,
        "courtyard_line_width": 0.049999999999999996,
        "dimension_precision": 4,
        "dimension_units": 3,
        "dimensions": {
          "arrow_length": 1270000,
          "extension_offset": 500000,
          "keep_text_aligned": true,
          "suppress_zeroes": false,
          "text_position": 0,
          "units_format": 1
        },
        "fab_line_width": 0.049999999999999996,
        "fab_text_italic": false,
        "fab_text_size_h": 0.3,
        "fab_text_size_v": 0.3,
        "fab_text_thickness": 0.049999999999999996,
        "fab_text_upright": false,
        "other_line_width": 0.09999999999999999,
        "other_text_italic": false,
        "other_text_size_h": 1.0,
        "other_text_size_v": 1.0,
        "other_text_thickness": 0.15,
        "other_text_upright": false,
        "pads": {
          "drill": 1.0,
          "height": 1.7,
          "width": 1.7
        },
        "silk_line_width": 0.12,
        "silk_text_italic": false,
        "silk_text_size_h": 0.7999999999999999,
        "silk_text_size_v": 0.7999999999999999,
        "silk_text_thickness": 0.12,
        "silk_text_upright": false,
        "zones": {
          "45_degree_only": true,
          "min_clearance": 0.508
        }
      },
      "diff_pair_dimensions": [
        {
          "gap": 0.0,
          "via_gap": 0.0,
          "width": 0.0
        },
        {
          "gap": 0.17,
          "via_gap": 0.0,
          "width": 0.32
        },
        {
          "gap": 1.4,
          "via_gap": 0.0,
          "width": 0.42
        }
      ],
      "drc_exclusions": [
        "courtyards_overlap|134300001|50800001|48a7323e-6d18-410d-91a9-1742c8c610be|14e7a54d-e50b-42a1-84ab-8f7b37c9db17",
        "courtyards_overlap|137849999|53340001|14e7a54d-e50b-42a1-84ab-8f7b37c9db17|48a7323e-6d18-410d-91a9-1742c8c610be",
        "silk_over_copper|100150000|55450000|7ce40272-4cec-4780-a5ed-f4200b63d335|bea81a98-57a0-4acc-9fab-752e8c7d26aa",
        "silk_over_copper|100150000|55450000|7d870565-dd98-48e5-bd81-ef282790cdaf|7899a164-8393-461c-a983-461d991cfd20",
        "silk_over_copper|100150000|57950000|7ce40272-4cec-4780-a5ed-f4200b63d335|bea81a98-57a0-4acc-9fab-752e8c7d26aa",
        "silk_over_copper|100150000|60350000|f3d0b2e8-ec8d-4490-8189-4d1cc4e06c6f|5288a6dc-6bd4-4efd-acfe-b114a89ba391",
        "silk_over_copper|100150000|62850000|f3d0b2e8-ec8d-4490-8189-4d1cc4e06c6f|5288a6dc-6bd4-4efd-acfe-b114a89ba391",
        "silk_over_copper|100850000|55450000|7ce40272-4cec-4780-a5ed-f4200b63d335|fd173567-5261-47c8-8760-578fb593c9ff",
        "silk_over_copper|100850000|55450000|7d870565-dd98-48e5-bd81-ef282790cdaf|b68a4485-e223-4e59-a5b7-66a97b00d6ee",
        "silk_over_copper|100850000|57950000|7ce40272-4cec-4780-a5ed-f4200b63d335|fd173567-5261-47c8-8760-578fb593c9ff",
        "silk_over_copper|100850000|60350000|56f46cf9-7a71-4200-86ae-3eb219d00932|c1d4ae6b-5156-4062-9aa5-6e3640715975",
        "silk_over_copper|100850000|60350000|f3d0b2e8-ec8d-4490-8189-4d1cc4e06c6f|f4682b8c-64ec-4fe2-bbe0-88736407ba63",
        "silk_over_copper|100850000|60350000|f9ccdc54-683b-4675-8201-b83ed94af4ec|0bceda9c-34e4-42ee-9304-ec8f5ba93fab",
        "silk_over_copper|100850000|62850000|f3d0b2e8-ec8d-4490-8189-4d1cc4e06c6f|f4682b8c-64ec-4fe2-bbe0-88736407ba63",
        "silk_over_copper|102350000|57900000|9f16d6a3-3d1c-4af1-aa17-8ac4658787be|c0c175b9-6acf-4d3c-99a2-1ec80ae05002",
        "silk_over_copper|102350000|60400000|9f16d6a3-3d1c-4af1-aa17-8ac4658787be|c0c175b9-6acf-4d3c-99a2-1ec80ae05002",
        "silk_over_copper|112997000|95765000|18ec581e-7a9c-4f6f-b36b-9360a34e96bf|0f473db9-c98a-46e4-b1ad-49a7b844415f",
        "silk_over_copper|112997000|95765000|18ec581e-7a9c-4f6f-b36b-9360a34e96bf|448485dc-f878-4246-ad31-9d40d90e2d87",
        "silk_over_copper|113155001|95800000|18ec581e-7a9c-4f6f-b36b-9360a34e96bf|1c19a2f1-4da4-43fc-aed4-9c0c241a5a24",
        "silk_over_copper|113255000|96000000|18ec581e-7a9c-4f6f-b36b-9360a34e96bf|1c19a2f1-4da4-43fc-aed4-9c0c241a5a24",
        "silk_over_copper|119923001|66400000|216ace9b-54e3-4a7d-ab70-3abe294dd59f|b034be26-89b2-49d4-9bdd-292b5f8ab198",
        "silk_over_copper|119923001|66400000|8723af7c-9f68-4d42-ae30-0fc8eec6c91a|18efbea9-3a18-4c43-9082-17b06c30a32f",
        "silk_over_copper|119923001|70400000|64bc78c0-d029-4457-80c8-1965439c4c63|9cdfa3f5-c29a-40e9-911c-ddf7c068e4ec",
        "silk_over_copper|119923001|70400000|fc7d448f-3484-4b75-a644-5742247e0398|2794faa9-76fc-4748-844a-b75017d60578",
        "silk_over_copper|120023000|66600000|8723af7c-9f68-4d42-ae30-0fc8eec6c91a|18efbea9-3a18-4c43-9082-17b06c30a32f",
        "silk_over_copper|120023000|70600000|fc7d448f-3484-4b75-a644-5742247e0398|2794faa9-76fc-4748-844a-b75017d60578",
        "silk_over_copper|122345001|95800000|18ec581e-7a9c-4f6f-b36b-9360a34e96bf|2c74e8b3-009e-452a-8ec8-141aba0470a5",
        "silk_over_copper|122445000|96000000|18ec581e-7a9c-4f6f-b36b-9360a34e96bf|2c74e8b3-009e-452a-8ec8-141aba0470a5",
        "silk_over_copper|122577000|95765000|18ec581e-7a9c-4f6f-b36b-9360a34e96bf|e8ca11db-8af3-4784-876b-ad27c2891875",
        "silk_over_copper|124677001|66400000|82ccf9d4-3433-4749-8f54-bf3b0d2665ed|3112172f-bc27-4a8d-a1a3-2b7599542015",
        "silk_over_copper|124677001|66400000|b27711d1-a6bb-44f6-b5a8-5d19aedccefa|d34af38f-cb0a-4b94-953e-031ad0c85446",
        "silk_over_copper|124677001|70400000|10fe6d09-53c2-4c31-8b45-fea68297269b|86ac201e-8561-4731-ac6a-0a070a0bf42d",
        "silk_over_copper|124677001|70400000|ce1f3692-07ec-4e6b-8b66-5394787fe4f0|2c082849-b0c2-40b0-8e8c-0872ad9aae84",
        "silk_over_copper|124777000|70600000|10fe6d09-53c2-4c31-8b45-fea68297269b|86ac201e-8561-4731-ac6a-0a070a0bf42d",
        "silk_over_copper|127790001|49800000|b9725f30-b6ee-47f3-be3a-08bf107c1adf|2bfb17b2-b665-4b5c-bc79-9ff3d28f667f",
        "silk_over_copper|127790001|49800000|b9725f30-b6ee-47f3-be3a-08bf107c1adf|ce9f5e49-4e87-4bef-b198-32461597b481",
        "silk_over_copper|127790001|49800000|b9725f30-b6ee-47f3-be3a-08bf107c1adf|e9234d44-0446-47bb-827a-f870f4799e6e",
        "silk_over_copper|127890000|52000000|b9725f30-b6ee-47f3-be3a-08bf107c1adf|e9234d44-0446-47bb-827a-f870f4799e6e",
        "silk_overlap|100137258|54722500|003c6329-ca1a-459c-8bb7-0b2a993b942a|72803a68-beda-4003-a971-5f57fa950edf"
      ],
      "meta": {
        "filename": "board_design_settings.json",
        "version": 2
      },
      "rule_severities": {
        "annular_width": "error",
        "clearance": "error",
        "copper_edge_clearance": "error",
        "courtyards_overlap": "error",
        "diff_pair_gap_out_of_range": "error",
        "diff_pair_uncoupled_length_too_long": "error",
        "drill_out_of_range": "error",
        "duplicate_footprints": "warning",
        "extra_footprint": "warning",
        "footprint_type_mismatch": "error",
        "hole_clearance": "error",
        "hole_near_hole": "error",
        "invalid_outline": "error",
        "item_on_disabled_layer": "error",
        "items_not_allowed": "error",
        "length_out_of_range": "error",
        "malformed_courtyard": "error",
        "microvia_drill_out_of_range": "error",
        "missing_courtyard": "ignore",
        "missing_footprint": "warning",
        "net_conflict": "warning",
        "npth_inside_courtyard": "ignore",
        "padstack": "error",
        "pth_inside_courtyard": "ignore",
        "shorting_items": "error",
        "silk_over_copper": "warning",
        "silk_overlap": "warning",
        "skew_out_of_range": "error",
        "through_hole_pad_without_hole": "error",
        "too_many_vias": "error",
        "track_dangling": "warning",
        "track_width": "error",
        "tracks_crossing": "error",
        "unconnected_items": "error",
        "unresolved_variable": "error",
        "via_dangling": "warning",
        "zone_has_empty_net": "error",
        "zones_intersect": "error"
      },
      "rule_severitieslegacy_courtyards_overlap": true,
      "rule_severitieslegacy_no_courtyard_defined": false,
      "rules": {
        "allow_blind_buried_vias": false,
        "allow_microvias": true,
        "max_error": 0.005,
        "min_clearance": 0.09999999999999999,
        "min_copper_edge_clearance": 0.024999999999999998,
        "min_hole_clearance": 0.25,
        "min_hole_to_hole": 0.25,
        "min_microvia_diameter": 0.254,
        "min_microvia_drill": 0.09999999999999999,
        "min_silk_clearance": 0.15,
        "min_through_hole_diameter": 0.19999999999999998,
        "min_track_width": 0.09999999999999999,
        "min_via_annular_width": 0.15,
        "min_via_diameter": 0.3,
        "use_height_for_length_calcs": true
      },
      "track_widths": [
        0.0,
        0.1,
        0.154,
        0.2,
        0.25,
        0.3,
        0.4,
        0.5,
        0.6,
        0.8,
        1.0
      ],
      "via_dimensions": [
        {
          "diameter": 0.0,
          "drill": 0.0
        },
        {
          "diameter": 0.3,
          "drill": 0.15
        },
        {
          "diameter": 0.5,
          "drill": 0.2
        },
        {
          "diameter": 0.55,
          "drill": 0.25
        },
        {
          "diameter": 0.6,
          "drill": 0.3
        },
        {
          "diameter": 0.7,
          "drill": 0.4
        }
      ],
      "zones_allow_external_fillets": true,
      "zones_use_no_outline": true
    },
    "layer_presets": []
  },
  "boards": [],
  "cvpcb": {
    "equivalence_files": []
  },
  "erc": {
    "erc_exclusions": [],
    "meta": {
      "version": 0
    },
    "pin_map": [
      [
        0,
        0,
        0,
        0,
        0,
        0,
        1,
        0,
        0,
        0,
        0,
        2
      ],
      [
        0,
        2,
        0,
        1,
        0,
        0,
        1,
        0,
        2,
        2,
        2,
        2
      ],
      [
        0,
        0,
        0,
        0,
        0,
        0,
        1,
        0,
        1,
        0,
        1,
        2
      ],
      [
        0,
        1,
        0,
        0,
        0,
        0,
        1,
        1,
        2,
        1,
        1,
        2
      ],
      [
        0,
        0,
        0,
        0,
        0,
        0,
        1,
        0,
        0,
        0,
        0,
        2
      ],
      [
        0,
        0,
        0,
        0,
        0,
        0,
        0,
        0,
        0,
        0,
        0,
        2
      ],
      [
        1,
        1,
        1,
        1,
        1,
        0,
        1,
        1,
        1,
        1,
        1,
        2
      ],
      [
        0,
        0,
        0,
        1,
        0,
        0,
        1,
        0,
        0,
        0,
        0,
        2
      ],
      [
        0,
        2,
        1,
        2,
        0,
        0,
        1,
        0,
        2,
        2,
        2,
        2
      ],
      [
        0,
        2,
        0,
        1,
        0,
        0,
        1,
        0,
        2,
        0,
        0,
        2
      ],
      [
        0,
        2,
        1,
        1,
        0,
        0,
        1,
        0,
        2,
        0,
        0,
        2
      ],
      [
        2,
        2,
        2,
        2,
        2,
        2,
        2,
        2,
        2,
        2,
        2,
        2
      ]
    ],
    "rule_severities": {
      "bus_definition_conflict": "error",
      "bus_entry_needed": "error",
      "bus_label_syntax": "error",
      "bus_to_bus_conflict": "error",
      "bus_to_net_conflict": "error",
      "different_unit_footprint": "error",
      "different_unit_net": "error",
      "duplicate_reference": "error",
      "duplicate_sheet_names": "error",
      "extra_units": "error",
      "global_label_dangling": "warning",
      "hier_label_mismatch": "error",
      "label_dangling": "error",
      "lib_symbol_issues": "warning",
      "multiple_net_names": "warning",
      "net_not_bus_member": "warning",
      "no_connect_connected": "warning",
      "no_connect_dangling": "warning",
      "pin_not_connected": "error",
      "pin_not_driven": "error",
      "pin_to_pin": "warning",
      "power_pin_not_driven": "error",
      "similar_labels": "warning",
      "unannotated": "error",
      "unit_value_mismatch": "error",
      "unresolved_variable": "error",
      "wire_dangling": "error"
    }
  },
  "libraries": {
    "pinned_footprint_libs": [],
    "pinned_symbol_libs": []
  },
  "meta": {
    "filename": "slimevr.kicad_pro",
    "version": 1
  },
  "net_settings": {
    "classes": [
      {
        "bus_width": 12.0,
        "clearance": 0.2,
        "diff_pair_gap": 0.25,
        "diff_pair_via_gap": 0.25,
        "diff_pair_width": 0.2,
        "line_style": 0,
        "microvia_diameter": 0.3,
        "microvia_drill": 0.1,
        "name": "Default",
        "pcb_color": "rgba(0, 0, 0, 0.000)",
        "schematic_color": "rgba(0, 0, 0, 0.000)",
        "track_width": 0.25,
        "via_diameter": 0.8,
        "via_drill": 0.4,
        "wire_width": 6.0
      },
      {
        "bus_width": 12.0,
        "clearance": 0.154,
        "diff_pair_gap": 0.25,
        "diff_pair_via_gap": 0.25,
        "diff_pair_width": 0.2,
        "line_style": 0,
        "microvia_diameter": 0.3,
        "microvia_drill": 0.1,
        "name": "Fine",
        "nets": [],
        "pcb_color": "rgba(0, 0, 0, 0.000)",
        "schematic_color": "rgba(0, 0, 0, 0.000)",
        "track_width": 0.154,
        "via_diameter": 0.6,
        "via_drill": 0.3,
        "wire_width": 6.0
      },
      {
        "bus_width": 12.0,
        "clearance": 0.2,
        "diff_pair_gap": 0.17,
        "diff_pair_via_gap": 0.25,
        "diff_pair_width": 0.32,
        "line_style": 0,
        "microvia_diameter": 0.3,
        "microvia_drill": 0.1,
        "name": "USB",
        "nets": [
          "/USB and  Power/D_R_N",
          "/USB and  Power/D_R_P"
        ],
        "pcb_color": "rgba(0, 0, 0, 0.000)",
        "schematic_color": "rgba(0, 0, 0, 0.000)",
        "track_width": 0.25,
        "via_diameter": 0.6,
        "via_drill": 0.3,
        "wire_width": 6.0
      }
    ],
    "meta": {
      "version": 2
    },
    "net_colors": null
  },
  "pcbnew": {
    "last_paths": {
      "gencad": "",
      "idf": "",
      "netlist": "",
      "specctra_dsn": "",
      "step": "",
      "vrml": ""
    },
    "page_layout_descr_file": ""
  },
  "schematic": {
    "annotate_start_num": 0,
    "drawing": {
      "default_line_thickness": 6.0,
      "default_text_size": 50.0,
      "field_names": [],
      "intersheets_ref_own_page": false,
      "intersheets_ref_prefix": "",
      "intersheets_ref_short": false,
      "intersheets_ref_show": false,
      "intersheets_ref_suffix": "",
      "junction_size_choice": 3,
      "label_size_ratio": 0.25,
      "pin_symbol_size": 0.0,
      "text_offset_ratio": 0.08
    },
    "legacy_lib_dir": "",
    "legacy_lib_list": [],
    "meta": {
      "version": 1
    },
    "net_format_name": "",
    "ngspice": {
      "fix_include_paths": true,
      "fix_passive_vals": false,
      "meta": {
        "version": 0
      },
      "model_mode": 0,
      "workbook_filename": ""
    },
    "page_layout_descr_file": "",
    "plot_directory": "",
    "spice_adjust_passive_values": false,
    "spice_external_command": "spice \"%I\"",
    "subpart_first_id": 65,
    "subpart_id_separator": 0
  },
  "sheets": [
    [
      "c04386e0-b49e-4fff-b380-675af13a62cb",
      ""
    ],
    [
      "00000000-0000-0000-0000-000061ddf5dc",
      "USB and  Power"
    ]
  ],
  "text_variables": {}
}
