(kicad_sch (version 20211123) (generator eeschema)

  (uuid f0e2c85d-f621-4b0d-a56a-afaac7f89ec8)

  (paper "USLetter")

  (title_block
    (title "Wroom32 LED Controller")
    (date "2022-05-11")
    (rev "4.0.0")
    (company "Aaron Williams")
    (comment 1 "Copyright © 2020-2022 by Aaron Williams")
  )

  (lib_symbols
    (symbol "Aaron:SSM2518CPZ" (pin_names (offset 0.254)) (in_bom yes) (on_board yes)
      (property "Reference" "U" (id 0) (at 0 27.94 0)
        (effects (font (size 1.524 1.524)))
      )
      (property "Value" "SSM2518CPZ" (id 1) (at 0 25.4 0)
        (effects (font (size 1.524 1.524)))
      )
      (property "Footprint" "Package_CSP:LFCSP-20-1EP_4x4mm_P0.5mm_EP2.6x2.6mm" (id 2) (at 0 23.495 0)
        (effects (font (size 1.524 1.524)) hide)
      )
      (property "Datasheet" "https://www.analog.com/media/en/technical-documentation/data-sheets/SSM2518.pdf" (id 3) (at -10.16 31.75 0)
        (effects (font (size 1.524 1.524)) hide)
      )
      (property "ki_keywords" "Amplifier" (id 4) (at 0 0 0)
        (effects (font (size 1.27 1.27)) hide)
      )
      (property "ki_description" "2 Channel Class D I2S amplifier SMD" (id 5) (at 0 0 0)
        (effects (font (size 1.27 1.27)) hide)
      )
      (property "ki_fp_filters" "CB_16_3_ADI" (id 6) (at 0 0 0)
        (effects (font (size 1.27 1.27)) hide)
      )
      (symbol "SSM2518CPZ_0_1"
        (rectangle (start -15.24 22.86) (end 15.24 -25.4)
          (stroke (width 0) (type default) (color 0 0 0 0))
          (fill (type background))
        )
      )
      (symbol "SSM2518CPZ_1_1"
        (pin output line (at 22.86 17.78 180) (length 7.62)
          (name "OUTL+" (effects (font (size 1.4986 1.4986))))
          (number "1" (effects (font (size 1.4986 1.4986))))
        )
        (pin input line (at -22.86 -2.54 0) (length 7.62)
          (name "SDATA" (effects (font (size 1.4986 1.4986))))
          (number "10" (effects (font (size 1.4986 1.4986))))
        )
        (pin input line (at -22.86 5.08 0) (length 7.62)
          (name "SAMOD" (effects (font (size 1.4986 1.4986))))
          (number "11" (effects (font (size 1.4986 1.4986))))
        )
        (pin power_in line (at -22.86 -12.7 0) (length 7.62)
          (name "DVDD" (effects (font (size 1.4986 1.4986))))
          (number "12" (effects (font (size 1.4986 1.4986))))
        )
        (pin input line (at -22.86 17.78 0) (length 7.62)
          (name "~{SD}" (effects (font (size 1.4986 1.4986))))
          (number "13" (effects (font (size 1.4986 1.4986))))
        )
        (pin output line (at 22.86 10.16 180) (length 7.62)
          (name "OUTR-" (effects (font (size 1.4986 1.4986))))
          (number "14" (effects (font (size 1.4986 1.4986))))
        )
        (pin output line (at 22.86 12.7 180) (length 7.62)
          (name "OUTR+" (effects (font (size 1.4986 1.4986))))
          (number "15" (effects (font (size 1.4986 1.4986))))
        )
        (pin power_in line (at -22.86 -15.24 0) (length 7.62)
          (name "PVDD" (effects (font (size 1.4986 1.4986))))
          (number "16" (effects (font (size 1.4986 1.4986))))
        )
        (pin power_in line (at -22.86 -20.32 0) (length 7.62) hide
          (name "GND" (effects (font (size 1.4986 1.4986))))
          (number "17" (effects (font (size 1.4986 1.4986))))
        )
        (pin power_in line (at -22.86 -20.32 0) (length 7.62) hide
          (name "GND" (effects (font (size 1.4986 1.4986))))
          (number "18" (effects (font (size 1.4986 1.4986))))
        )
        (pin power_in line (at -22.86 -20.32 0) (length 7.62) hide
          (name "GND" (effects (font (size 1.4986 1.4986))))
          (number "19" (effects (font (size 1.4986 1.4986))))
        )
        (pin output line (at 22.86 15.24 180) (length 7.62)
          (name "OUTL-" (effects (font (size 1.4986 1.4986))))
          (number "2" (effects (font (size 1.4986 1.4986))))
        )
        (pin power_in line (at -22.86 -15.24 0) (length 7.62) hide
          (name "PVDD" (effects (font (size 1.4986 1.4986))))
          (number "20" (effects (font (size 1.4986 1.4986))))
        )
        (pin power_in line (at -22.86 -20.32 0) (length 7.62) hide
          (name "GND" (effects (font (size 1.4986 1.4986))))
          (number "21" (effects (font (size 1.4986 1.4986))))
        )
        (pin input line (at -22.86 15.24 0) (length 7.62)
          (name "ADDR" (effects (font (size 1.4986 1.4986))))
          (number "3" (effects (font (size 1.4986 1.4986))))
        )
        (pin bidirectional line (at 22.86 5.08 180) (length 7.62)
          (name "SDA" (effects (font (size 1.4986 1.4986))))
          (number "4" (effects (font (size 1.4986 1.4986))))
        )
        (pin input line (at -22.86 2.54 0) (length 7.62)
          (name "SCL" (effects (font (size 1.4986 1.4986))))
          (number "5" (effects (font (size 1.4986 1.4986))))
        )
        (pin input line (at -22.86 7.62 0) (length 7.62)
          (name "MCLK" (effects (font (size 1.4986 1.4986))))
          (number "6" (effects (font (size 1.4986 1.4986))))
        )
        (pin input line (at -22.86 12.7 0) (length 7.62)
          (name "BCLK" (effects (font (size 1.4986 1.4986))))
          (number "7" (effects (font (size 1.4986 1.4986))))
        )
        (pin power_in line (at -22.86 -20.32 0) (length 7.62)
          (name "GND" (effects (font (size 1.4986 1.4986))))
          (number "8" (effects (font (size 1.4986 1.4986))))
        )
        (pin input line (at -22.86 10.16 0) (length 7.62)
          (name "LRCLK" (effects (font (size 1.4986 1.4986))))
          (number "9" (effects (font (size 1.4986 1.4986))))
        )
      )
    )
    (symbol "Connector_Generic:Conn_01x04" (pin_names (offset 1.016) hide) (in_bom yes) (on_board yes)
      (property "Reference" "J" (id 0) (at 0 5.08 0)
        (effects (font (size 1.27 1.27)))
      )
      (property "Value" "Conn_01x04" (id 1) (at 0 -7.62 0)
        (effects (font (size 1.27 1.27)))
      )
      (property "Footprint" "" (id 2) (at 0 0 0)
        (effects (font (size 1.27 1.27)) hide)
      )
      (property "Datasheet" "~" (id 3) (at 0 0 0)
        (effects (font (size 1.27 1.27)) hide)
      )
      (property "ki_keywords" "connector" (id 4) (at 0 0 0)
        (effects (font (size 1.27 1.27)) hide)
      )
      (property "ki_description" "Generic connector, single row, 01x04, script generated (kicad-library-utils/schlib/autogen/connector/)" (id 5) (at 0 0 0)
        (effects (font (size 1.27 1.27)) hide)
      )
      (property "ki_fp_filters" "Connector*:*_1x??_*" (id 6) (at 0 0 0)
        (effects (font (size 1.27 1.27)) hide)
      )
      (symbol "Conn_01x04_1_1"
        (rectangle (start -1.27 -4.953) (end 0 -5.207)
          (stroke (width 0.1524) (type default) (color 0 0 0 0))
          (fill (type none))
        )
        (rectangle (start -1.27 -2.413) (end 0 -2.667)
          (stroke (width 0.1524) (type default) (color 0 0 0 0))
          (fill (type none))
        )
        (rectangle (start -1.27 0.127) (end 0 -0.127)
          (stroke (width 0.1524) (type default) (color 0 0 0 0))
          (fill (type none))
        )
        (rectangle (start -1.27 2.667) (end 0 2.413)
          (stroke (width 0.1524) (type default) (color 0 0 0 0))
          (fill (type none))
        )
        (rectangle (start -1.27 3.81) (end 1.27 -6.35)
          (stroke (width 0.254) (type default) (color 0 0 0 0))
          (fill (type background))
        )
        (pin passive line (at -5.08 2.54 0) (length 3.81)
          (name "Pin_1" (effects (font (size 1.27 1.27))))
          (number "1" (effects (font (size 1.27 1.27))))
        )
        (pin passive line (at -5.08 0 0) (length 3.81)
          (name "Pin_2" (effects (font (size 1.27 1.27))))
          (number "2" (effects (font (size 1.27 1.27))))
        )
        (pin passive line (at -5.08 -2.54 0) (length 3.81)
          (name "Pin_3" (effects (font (size 1.27 1.27))))
          (number "3" (effects (font (size 1.27 1.27))))
        )
        (pin passive line (at -5.08 -5.08 0) (length 3.81)
          (name "Pin_4" (effects (font (size 1.27 1.27))))
          (number "4" (effects (font (size 1.27 1.27))))
        )
      )
    )
    (symbol "Device:C" (pin_numbers hide) (pin_names (offset 0.254)) (in_bom yes) (on_board yes)
      (property "Reference" "C" (id 0) (at 0.635 2.54 0)
        (effects (font (size 1.27 1.27)) (justify left))
      )
      (property "Value" "C" (id 1) (at 0.635 -2.54 0)
        (effects (font (size 1.27 1.27)) (justify left))
      )
      (property "Footprint" "" (id 2) (at 0.9652 -3.81 0)
        (effects (font (size 1.27 1.27)) hide)
      )
      (property "Datasheet" "~" (id 3) (at 0 0 0)
        (effects (font (size 1.27 1.27)) hide)
      )
      (property "ki_keywords" "cap capacitor" (id 4) (at 0 0 0)
        (effects (font (size 1.27 1.27)) hide)
      )
      (property "ki_description" "Unpolarized capacitor" (id 5) (at 0 0 0)
        (effects (font (size 1.27 1.27)) hide)
      )
      (property "ki_fp_filters" "C_*" (id 6) (at 0 0 0)
        (effects (font (size 1.27 1.27)) hide)
      )
      (symbol "C_0_1"
        (polyline
          (pts
            (xy -2.032 -0.762)
            (xy 2.032 -0.762)
          )
          (stroke (width 0.508) (type default) (color 0 0 0 0))
          (fill (type none))
        )
        (polyline
          (pts
            (xy -2.032 0.762)
            (xy 2.032 0.762)
          )
          (stroke (width 0.508) (type default) (color 0 0 0 0))
          (fill (type none))
        )
      )
      (symbol "C_1_1"
        (pin passive line (at 0 3.81 270) (length 2.794)
          (name "~" (effects (font (size 1.27 1.27))))
          (number "1" (effects (font (size 1.27 1.27))))
        )
        (pin passive line (at 0 -3.81 90) (length 2.794)
          (name "~" (effects (font (size 1.27 1.27))))
          (number "2" (effects (font (size 1.27 1.27))))
        )
      )
    )
    (symbol "Device:R" (pin_numbers hide) (pin_names (offset 0)) (in_bom yes) (on_board yes)
      (property "Reference" "R" (id 0) (at 2.032 0 90)
        (effects (font (size 1.27 1.27)))
      )
      (property "Value" "R" (id 1) (at 0 0 90)
        (effects (font (size 1.27 1.27)))
      )
      (property "Footprint" "" (id 2) (at -1.778 0 90)
        (effects (font (size 1.27 1.27)) hide)
      )
      (property "Datasheet" "~" (id 3) (at 0 0 0)
        (effects (font (size 1.27 1.27)) hide)
      )
      (property "ki_keywords" "R res resistor" (id 4) (at 0 0 0)
        (effects (font (size 1.27 1.27)) hide)
      )
      (property "ki_description" "Resistor" (id 5) (at 0 0 0)
        (effects (font (size 1.27 1.27)) hide)
      )
      (property "ki_fp_filters" "R_*" (id 6) (at 0 0 0)
        (effects (font (size 1.27 1.27)) hide)
      )
      (symbol "R_0_1"
        (rectangle (start -1.016 -2.54) (end 1.016 2.54)
          (stroke (width 0.254) (type default) (color 0 0 0 0))
          (fill (type none))
        )
      )
      (symbol "R_1_1"
        (pin passive line (at 0 3.81 270) (length 1.27)
          (name "~" (effects (font (size 1.27 1.27))))
          (number "1" (effects (font (size 1.27 1.27))))
        )
        (pin passive line (at 0 -3.81 90) (length 1.27)
          (name "~" (effects (font (size 1.27 1.27))))
          (number "2" (effects (font (size 1.27 1.27))))
        )
      )
    )
    (symbol "Switch:SW_Push" (pin_numbers hide) (pin_names (offset 1.016) hide) (in_bom yes) (on_board yes)
      (property "Reference" "SW" (id 0) (at 1.27 2.54 0)
        (effects (font (size 1.27 1.27)) (justify left))
      )
      (property "Value" "SW_Push" (id 1) (at 0 -1.524 0)
        (effects (font (size 1.27 1.27)))
      )
      (property "Footprint" "" (id 2) (at 0 5.08 0)
        (effects (font (size 1.27 1.27)) hide)
      )
      (property "Datasheet" "~" (id 3) (at 0 5.08 0)
        (effects (font (size 1.27 1.27)) hide)
      )
      (property "ki_keywords" "switch normally-open pushbutton push-button" (id 4) (at 0 0 0)
        (effects (font (size 1.27 1.27)) hide)
      )
      (property "ki_description" "Push button switch, generic, two pins" (id 5) (at 0 0 0)
        (effects (font (size 1.27 1.27)) hide)
      )
      (symbol "SW_Push_0_1"
        (circle (center -2.032 0) (radius 0.508)
          (stroke (width 0) (type default) (color 0 0 0 0))
          (fill (type none))
        )
        (polyline
          (pts
            (xy 0 1.27)
            (xy 0 3.048)
          )
          (stroke (width 0) (type default) (color 0 0 0 0))
          (fill (type none))
        )
        (polyline
          (pts
            (xy 2.54 1.27)
            (xy -2.54 1.27)
          )
          (stroke (width 0) (type default) (color 0 0 0 0))
          (fill (type none))
        )
        (circle (center 2.032 0) (radius 0.508)
          (stroke (width 0) (type default) (color 0 0 0 0))
          (fill (type none))
        )
        (pin passive line (at -5.08 0 0) (length 2.54)
          (name "1" (effects (font (size 1.27 1.27))))
          (number "1" (effects (font (size 1.27 1.27))))
        )
        (pin passive line (at 5.08 0 180) (length 2.54)
          (name "2" (effects (font (size 1.27 1.27))))
          (number "2" (effects (font (size 1.27 1.27))))
        )
      )
    )
    (symbol "Transistor_FET:BSS138" (pin_names hide) (in_bom yes) (on_board yes)
      (property "Reference" "Q" (id 0) (at 5.08 1.905 0)
        (effects (font (size 1.27 1.27)) (justify left))
      )
      (property "Value" "BSS138" (id 1) (at 5.08 0 0)
        (effects (font (size 1.27 1.27)) (justify left))
      )
      (property "Footprint" "Package_TO_SOT_SMD:SOT-23" (id 2) (at 5.08 -1.905 0)
        (effects (font (size 1.27 1.27) italic) (justify left) hide)
      )
      (property "Datasheet" "https://www.onsemi.com/pub/Collateral/BSS138-D.PDF" (id 3) (at 0 0 0)
        (effects (font (size 1.27 1.27)) (justify left) hide)
      )
      (property "ki_keywords" "N-Channel MOSFET" (id 4) (at 0 0 0)
        (effects (font (size 1.27 1.27)) hide)
      )
      (property "ki_description" "50V Vds, 0.22A Id, N-Channel MOSFET, SOT-23" (id 5) (at 0 0 0)
        (effects (font (size 1.27 1.27)) hide)
      )
      (property "ki_fp_filters" "SOT?23*" (id 6) (at 0 0 0)
        (effects (font (size 1.27 1.27)) hide)
      )
      (symbol "BSS138_0_1"
        (polyline
          (pts
            (xy 0.254 0)
            (xy -2.54 0)
          )
          (stroke (width 0) (type default) (color 0 0 0 0))
          (fill (type none))
        )
        (polyline
          (pts
            (xy 0.254 1.905)
            (xy 0.254 -1.905)
          )
          (stroke (width 0.254) (type default) (color 0 0 0 0))
          (fill (type none))
        )
        (polyline
          (pts
            (xy 0.762 -1.27)
            (xy 0.762 -2.286)
          )
          (stroke (width 0.254) (type default) (color 0 0 0 0))
          (fill (type none))
        )
        (polyline
          (pts
            (xy 0.762 0.508)
            (xy 0.762 -0.508)
          )
          (stroke (width 0.254) (type default) (color 0 0 0 0))
          (fill (type none))
        )
        (polyline
          (pts
            (xy 0.762 2.286)
            (xy 0.762 1.27)
          )
          (stroke (width 0.254) (type default) (color 0 0 0 0))
          (fill (type none))
        )
        (polyline
          (pts
            (xy 2.54 2.54)
            (xy 2.54 1.778)
          )
          (stroke (width 0) (type default) (color 0 0 0 0))
          (fill (type none))
        )
        (polyline
          (pts
            (xy 2.54 -2.54)
            (xy 2.54 0)
            (xy 0.762 0)
          )
          (stroke (width 0) (type default) (color 0 0 0 0))
          (fill (type none))
        )
        (polyline
          (pts
            (xy 0.762 -1.778)
            (xy 3.302 -1.778)
            (xy 3.302 1.778)
            (xy 0.762 1.778)
          )
          (stroke (width 0) (type default) (color 0 0 0 0))
          (fill (type none))
        )
        (polyline
          (pts
            (xy 1.016 0)
            (xy 2.032 0.381)
            (xy 2.032 -0.381)
            (xy 1.016 0)
          )
          (stroke (width 0) (type default) (color 0 0 0 0))
          (fill (type outline))
        )
        (polyline
          (pts
            (xy 2.794 0.508)
            (xy 2.921 0.381)
            (xy 3.683 0.381)
            (xy 3.81 0.254)
          )
          (stroke (width 0) (type default) (color 0 0 0 0))
          (fill (type none))
        )
        (polyline
          (pts
            (xy 3.302 0.381)
            (xy 2.921 -0.254)
            (xy 3.683 -0.254)
            (xy 3.302 0.381)
          )
          (stroke (width 0) (type default) (color 0 0 0 0))
          (fill (type none))
        )
        (circle (center 1.651 0) (radius 2.794)
          (stroke (width 0.254) (type default) (color 0 0 0 0))
          (fill (type none))
        )
        (circle (center 2.54 -1.778) (radius 0.254)
          (stroke (width 0) (type default) (color 0 0 0 0))
          (fill (type outline))
        )
        (circle (center 2.54 1.778) (radius 0.254)
          (stroke (width 0) (type default) (color 0 0 0 0))
          (fill (type outline))
        )
      )
      (symbol "BSS138_1_1"
        (pin input line (at -5.08 0 0) (length 2.54)
          (name "G" (effects (font (size 1.27 1.27))))
          (number "1" (effects (font (size 1.27 1.27))))
        )
        (pin passive line (at 2.54 -5.08 90) (length 2.54)
          (name "S" (effects (font (size 1.27 1.27))))
          (number "2" (effects (font (size 1.27 1.27))))
        )
        (pin passive line (at 2.54 5.08 270) (length 2.54)
          (name "D" (effects (font (size 1.27 1.27))))
          (number "3" (effects (font (size 1.27 1.27))))
        )
      )
    )
    (symbol "led-controller-wrover32-rescue:Micro_SD_Card-Connector" (pin_names (offset 1.016)) (in_bom yes) (on_board yes)
      (property "Reference" "J" (id 0) (at -16.51 15.24 0)
        (effects (font (size 1.27 1.27)))
      )
      (property "Value" "Micro_SD_Card-Connector" (id 1) (at 16.51 15.24 0)
        (effects (font (size 1.27 1.27)) (justify right))
      )
      (property "Footprint" "" (id 2) (at 29.21 7.62 0)
        (effects (font (size 1.27 1.27)) hide)
      )
      (property "Datasheet" "" (id 3) (at 0 0 0)
        (effects (font (size 1.27 1.27)) hide)
      )
      (property "ki_fp_filters" "microSD*" (id 4) (at 0 0 0)
        (effects (font (size 1.27 1.27)) hide)
      )
      (symbol "Micro_SD_Card-Connector_0_1"
        (rectangle (start -7.62 -9.525) (end -5.08 -10.795)
          (stroke (width 0) (type default) (color 0 0 0 0))
          (fill (type outline))
        )
        (rectangle (start -7.62 -6.985) (end -5.08 -8.255)
          (stroke (width 0) (type default) (color 0 0 0 0))
          (fill (type outline))
        )
        (rectangle (start -7.62 -4.445) (end -5.08 -5.715)
          (stroke (width 0) (type default) (color 0 0 0 0))
          (fill (type outline))
        )
        (rectangle (start -7.62 -1.905) (end -5.08 -3.175)
          (stroke (width 0) (type default) (color 0 0 0 0))
          (fill (type outline))
        )
        (rectangle (start -7.62 0.635) (end -5.08 -0.635)
          (stroke (width 0) (type default) (color 0 0 0 0))
          (fill (type outline))
        )
        (rectangle (start -7.62 3.175) (end -5.08 1.905)
          (stroke (width 0) (type default) (color 0 0 0 0))
          (fill (type outline))
        )
        (rectangle (start -7.62 5.715) (end -5.08 4.445)
          (stroke (width 0) (type default) (color 0 0 0 0))
          (fill (type outline))
        )
        (rectangle (start -7.62 8.255) (end -5.08 6.985)
          (stroke (width 0) (type default) (color 0 0 0 0))
          (fill (type outline))
        )
        (polyline
          (pts
            (xy 16.51 12.7)
            (xy 16.51 13.97)
            (xy -19.05 13.97)
            (xy -19.05 -16.51)
            (xy 16.51 -16.51)
            (xy 16.51 -11.43)
          )
          (stroke (width 0.254) (type default) (color 0 0 0 0))
          (fill (type none))
        )
        (polyline
          (pts
            (xy -8.89 -11.43)
            (xy -8.89 8.89)
            (xy -1.27 8.89)
            (xy 2.54 12.7)
            (xy 3.81 12.7)
            (xy 3.81 11.43)
            (xy 6.35 11.43)
            (xy 7.62 12.7)
            (xy 20.32 12.7)
            (xy 20.32 -11.43)
            (xy -8.89 -11.43)
          )
          (stroke (width 0.254) (type default) (color 0 0 0 0))
          (fill (type background))
        )
      )
      (symbol "Micro_SD_Card-Connector_1_1"
        (pin bidirectional line (at -22.86 7.62 0) (length 3.81)
          (name "DAT2" (effects (font (size 1.27 1.27))))
          (number "1" (effects (font (size 1.27 1.27))))
        )
        (pin bidirectional line (at -22.86 5.08 0) (length 3.81)
          (name "DAT3/CD" (effects (font (size 1.27 1.27))))
          (number "2" (effects (font (size 1.27 1.27))))
        )
        (pin input line (at -22.86 2.54 0) (length 3.81)
          (name "CMD" (effects (font (size 1.27 1.27))))
          (number "3" (effects (font (size 1.27 1.27))))
        )
        (pin power_in line (at -22.86 0 0) (length 3.81)
          (name "VDD" (effects (font (size 1.27 1.27))))
          (number "4" (effects (font (size 1.27 1.27))))
        )
        (pin input line (at -22.86 -2.54 0) (length 3.81)
          (name "CLK" (effects (font (size 1.27 1.27))))
          (number "5" (effects (font (size 1.27 1.27))))
        )
        (pin power_in line (at -22.86 -5.08 0) (length 3.81)
          (name "VSS" (effects (font (size 1.27 1.27))))
          (number "6" (effects (font (size 1.27 1.27))))
        )
        (pin input line (at -22.86 -7.62 0) (length 3.81)
          (name "DAT0" (effects (font (size 1.27 1.27))))
          (number "7" (effects (font (size 1.27 1.27))))
        )
        (pin input line (at -22.86 -10.16 0) (length 3.81)
          (name "DAT1" (effects (font (size 1.27 1.27))))
          (number "8" (effects (font (size 1.27 1.27))))
        )
        (pin passive line (at 20.32 -15.24 180) (length 3.81)
          (name "SHIELD" (effects (font (size 1.27 1.27))))
          (number "9" (effects (font (size 1.27 1.27))))
        )
      )
    )
    (symbol "power:+3.3V" (power) (pin_names (offset 0)) (in_bom yes) (on_board yes)
      (property "Reference" "#PWR" (id 0) (at 0 -3.81 0)
        (effects (font (size 1.27 1.27)) hide)
      )
      (property "Value" "+3.3V" (id 1) (at 0 3.556 0)
        (effects (font (size 1.27 1.27)))
      )
      (property "Footprint" "" (id 2) (at 0 0 0)
        (effects (font (size 1.27 1.27)) hide)
      )
      (property "Datasheet" "" (id 3) (at 0 0 0)
        (effects (font (size 1.27 1.27)) hide)
      )
      (property "ki_keywords" "power-flag" (id 4) (at 0 0 0)
        (effects (font (size 1.27 1.27)) hide)
      )
      (property "ki_description" "Power symbol creates a global label with name \"+3.3V\"" (id 5) (at 0 0 0)
        (effects (font (size 1.27 1.27)) hide)
      )
      (symbol "+3.3V_0_1"
        (polyline
          (pts
            (xy -0.762 1.27)
            (xy 0 2.54)
          )
          (stroke (width 0) (type default) (color 0 0 0 0))
          (fill (type none))
        )
        (polyline
          (pts
            (xy 0 0)
            (xy 0 2.54)
          )
          (stroke (width 0) (type default) (color 0 0 0 0))
          (fill (type none))
        )
        (polyline
          (pts
            (xy 0 2.54)
            (xy 0.762 1.27)
          )
          (stroke (width 0) (type default) (color 0 0 0 0))
          (fill (type none))
        )
      )
      (symbol "+3.3V_1_1"
        (pin power_in line (at 0 0 90) (length 0) hide
          (name "+3V3" (effects (font (size 1.27 1.27))))
          (number "1" (effects (font (size 1.27 1.27))))
        )
      )
    )
    (symbol "power:GND" (power) (pin_names (offset 0)) (in_bom yes) (on_board yes)
      (property "Reference" "#PWR" (id 0) (at 0 -6.35 0)
        (effects (font (size 1.27 1.27)) hide)
      )
      (property "Value" "GND" (id 1) (at 0 -3.81 0)
        (effects (font (size 1.27 1.27)))
      )
      (property "Footprint" "" (id 2) (at 0 0 0)
        (effects (font (size 1.27 1.27)) hide)
      )
      (property "Datasheet" "" (id 3) (at 0 0 0)
        (effects (font (size 1.27 1.27)) hide)
      )
      (property "ki_keywords" "power-flag" (id 4) (at 0 0 0)
        (effects (font (size 1.27 1.27)) hide)
      )
      (property "ki_description" "Power symbol creates a global label with name \"GND\" , ground" (id 5) (at 0 0 0)
        (effects (font (size 1.27 1.27)) hide)
      )
      (symbol "GND_0_1"
        (polyline
          (pts
            (xy 0 0)
            (xy 0 -1.27)
            (xy 1.27 -1.27)
            (xy 0 -2.54)
            (xy -1.27 -1.27)
            (xy 0 -1.27)
          )
          (stroke (width 0) (type default) (color 0 0 0 0))
          (fill (type none))
        )
      )
      (symbol "GND_1_1"
        (pin power_in line (at 0 0 270) (length 0) hide
          (name "GND" (effects (font (size 1.27 1.27))))
          (number "1" (effects (font (size 1.27 1.27))))
        )
      )
    )
    (symbol "power:VBUS" (power) (pin_names (offset 0)) (in_bom yes) (on_board yes)
      (property "Reference" "#PWR" (id 0) (at 0 -3.81 0)
        (effects (font (size 1.27 1.27)) hide)
      )
      (property "Value" "VBUS" (id 1) (at 0 3.81 0)
        (effects (font (size 1.27 1.27)))
      )
      (property "Footprint" "" (id 2) (at 0 0 0)
        (effects (font (size 1.27 1.27)) hide)
      )
      (property "Datasheet" "" (id 3) (at 0 0 0)
        (effects (font (size 1.27 1.27)) hide)
      )
      (property "ki_keywords" "power-flag" (id 4) (at 0 0 0)
        (effects (font (size 1.27 1.27)) hide)
      )
      (property "ki_description" "Power symbol creates a global label with name \"VBUS\"" (id 5) (at 0 0 0)
        (effects (font (size 1.27 1.27)) hide)
      )
      (symbol "VBUS_0_1"
        (polyline
          (pts
            (xy -0.762 1.27)
            (xy 0 2.54)
          )
          (stroke (width 0) (type default) (color 0 0 0 0))
          (fill (type none))
        )
        (polyline
          (pts
            (xy 0 0)
            (xy 0 2.54)
          )
          (stroke (width 0) (type default) (color 0 0 0 0))
          (fill (type none))
        )
        (polyline
          (pts
            (xy 0 2.54)
            (xy 0.762 1.27)
          )
          (stroke (width 0) (type default) (color 0 0 0 0))
          (fill (type none))
        )
      )
      (symbol "VBUS_1_1"
        (pin power_in line (at 0 0 90) (length 0) hide
          (name "VBUS" (effects (font (size 1.27 1.27))))
          (number "1" (effects (font (size 1.27 1.27))))
        )
      )
    )
  )

  (junction (at 71.12 40.64) (diameter 0) (color 0 0 0 0)
    (uuid 045b26dc-aa18-4b64-be97-e75e18cb60a4)
  )
  (junction (at 69.85 142.24) (diameter 0) (color 0 0 0 0)
    (uuid 06006b02-1ae1-43fd-990a-433bc1ceedec)
  )
  (junction (at 248.92 54.61) (diameter 0) (color 0 0 0 0)
    (uuid 098a72d3-5694-4c70-95cf-d65414c028f9)
  )
  (junction (at 137.16 109.22) (diameter 0) (color 0 0 0 0)
    (uuid 0f5d4208-b195-4b95-8246-1383c10d5f6a)
  )
  (junction (at 248.92 52.07) (diameter 0) (color 0 0 0 0)
    (uuid 1043a4e7-4035-4083-8542-f93857e9b7f0)
  )
  (junction (at 248.92 71.12) (diameter 0) (color 0 0 0 0)
    (uuid 10dae453-2eec-4b82-833b-2ccc64a37d20)
  )
  (junction (at 81.28 149.86) (diameter 0) (color 0 0 0 0)
    (uuid 17171c6e-10e8-474a-98db-d66c823cf123)
  )
  (junction (at 36.83 71.12) (diameter 0) (color 0 0 0 0)
    (uuid 18dcca6d-8f3a-4fb0-8261-b03fc19fd158)
  )
  (junction (at 48.26 81.28) (diameter 0) (color 0 0 0 0)
    (uuid 21084215-0228-49d7-9323-e620d9ed4391)
  )
  (junction (at 60.96 40.64) (diameter 0) (color 0 0 0 0)
    (uuid 2891663a-7deb-4c77-a692-6d51aebbc2e2)
  )
  (junction (at 133.35 132.08) (diameter 0) (color 0 0 0 0)
    (uuid 3021fcab-491c-466a-8f0e-fb1ac8758f9b)
  )
  (junction (at 71.12 48.26) (diameter 0) (color 0 0 0 0)
    (uuid 4189ce6f-6ef7-48b3-816b-cc97542b1e44)
  )
  (junction (at 215.9 63.5) (diameter 0) (color 0 0 0 0)
    (uuid 453b5e41-9a4d-4c75-baf1-e5d0c35b7553)
  )
  (junction (at 81.28 142.24) (diameter 0) (color 0 0 0 0)
    (uuid 545998e9-d8de-41cc-88ca-74e1abd8305f)
  )
  (junction (at 58.42 71.12) (diameter 0) (color 0 0 0 0)
    (uuid 6dd5de7c-7573-4b48-be9c-598e0c4e6195)
  )
  (junction (at 248.92 49.53) (diameter 0) (color 0 0 0 0)
    (uuid cf906759-5534-4a94-bbb6-a1989e8e323c)
  )
  (junction (at 248.92 68.58) (diameter 0) (color 0 0 0 0)
    (uuid d2f82d9c-4a82-441c-ab42-b4b0cbbd586b)
  )
  (junction (at 48.26 71.12) (diameter 0) (color 0 0 0 0)
    (uuid dc4709f0-a44a-4be6-b395-813ff90809c1)
  )
  (junction (at 36.83 81.28) (diameter 0) (color 0 0 0 0)
    (uuid fd853731-fcb0-4cce-9b35-beca838ca475)
  )
  (junction (at 92.71 149.86) (diameter 0) (color 0 0 0 0)
    (uuid ff3fdc3f-c8c1-4c9d-808d-d4eb9d4a846b)
  )

  (wire (pts (xy 182.88 121.92) (xy 194.31 121.92))
    (stroke (width 0) (type default) (color 0 0 0 0))
    (uuid 0ef6267a-9175-4b32-a7f2-fc7c03ed5ad2)
  )
  (wire (pts (xy 248.92 49.53) (xy 248.92 52.07))
    (stroke (width 0) (type default) (color 0 0 0 0))
    (uuid 0f5a5caf-1b62-4548-bb71-9e69e95f32ea)
  )
  (wire (pts (xy 182.88 60.96) (xy 194.31 60.96))
    (stroke (width 0) (type default) (color 0 0 0 0))
    (uuid 18532946-2a6c-4f0e-a3b6-eb4b9423fd29)
  )
  (wire (pts (xy 36.83 81.28) (xy 48.26 81.28))
    (stroke (width 0) (type default) (color 0 0 0 0))
    (uuid 1eab9ed2-274e-408d-a666-7ebbd55a3c78)
  )
  (wire (pts (xy 241.3 49.53) (xy 228.6 49.53))
    (stroke (width 0) (type default) (color 0 0 0 0))
    (uuid 22e85685-7e04-4eee-92c0-7da6fbdb816e)
  )
  (wire (pts (xy 119.38 149.86) (xy 119.38 152.4))
    (stroke (width 0) (type default) (color 0 0 0 0))
    (uuid 24dccc56-9af3-4b98-b79a-8e48c40debc9)
  )
  (wire (pts (xy 194.31 121.92) (xy 196.85 119.38))
    (stroke (width 0) (type default) (color 0 0 0 0))
    (uuid 269df776-d4ba-4506-9934-756af3a3b3e1)
  )
  (wire (pts (xy 196.85 124.46) (xy 203.2 124.46))
    (stroke (width 0) (type default) (color 0 0 0 0))
    (uuid 26d32f5c-d68a-4517-a753-0791ca7a5c55)
  )
  (wire (pts (xy 228.6 71.12) (xy 241.3 71.12))
    (stroke (width 0) (type default) (color 0 0 0 0))
    (uuid 28892cb3-e433-4bdb-8fc4-e2ddd037ae71)
  )
  (wire (pts (xy 124.46 121.92) (xy 137.16 121.92))
    (stroke (width 0) (type default) (color 0 0 0 0))
    (uuid 3010ff66-551f-4a40-a356-3d021e5c86a3)
  )
  (wire (pts (xy 137.16 139.7) (xy 123.19 139.7))
    (stroke (width 0) (type default) (color 0 0 0 0))
    (uuid 3050d5c2-f009-4078-a38f-ac7afc726469)
  )
  (wire (pts (xy 92.71 142.24) (xy 81.28 142.24))
    (stroke (width 0) (type default) (color 0 0 0 0))
    (uuid 32551c9e-891d-4139-a056-04c816e6153b)
  )
  (wire (pts (xy 182.88 124.46) (xy 194.31 124.46))
    (stroke (width 0) (type default) (color 0 0 0 0))
    (uuid 40228dff-14a7-4c0d-851c-2dd7e2c9ba10)
  )
  (wire (pts (xy 137.16 127) (xy 123.19 127))
    (stroke (width 0) (type default) (color 0 0 0 0))
    (uuid 4d190b27-0006-4ab9-89a1-5f1b239625da)
  )
  (wire (pts (xy 133.35 129.54) (xy 133.35 132.08))
    (stroke (width 0) (type default) (color 0 0 0 0))
    (uuid 514a2a0f-766d-408c-99a9-744aa2cdf11e)
  )
  (wire (pts (xy 60.96 40.64) (xy 71.12 40.64))
    (stroke (width 0) (type default) (color 0 0 0 0))
    (uuid 56bce4af-9609-42ab-b7fa-5b69386decc6)
  )
  (wire (pts (xy 194.31 119.38) (xy 196.85 121.92))
    (stroke (width 0) (type default) (color 0 0 0 0))
    (uuid 5754ac9a-f296-4433-9a13-6f3af6e5e018)
  )
  (wire (pts (xy 137.16 132.08) (xy 133.35 132.08))
    (stroke (width 0) (type default) (color 0 0 0 0))
    (uuid 5d1e8740-016d-47cd-be77-a1cd2c04c1e7)
  )
  (wire (pts (xy 228.6 73.66) (xy 241.3 73.66))
    (stroke (width 0) (type default) (color 0 0 0 0))
    (uuid 63751722-67fd-4781-bb25-6bc23c002296)
  )
  (wire (pts (xy 92.71 149.86) (xy 81.28 149.86))
    (stroke (width 0) (type default) (color 0 0 0 0))
    (uuid 66e46258-bad9-46b3-a71e-3ada96099101)
  )
  (wire (pts (xy 119.38 152.4) (xy 137.16 152.4))
    (stroke (width 0) (type default) (color 0 0 0 0))
    (uuid 6c219f37-513c-497b-bc3b-aa9c222dc0c8)
  )
  (wire (pts (xy 248.92 68.58) (xy 248.92 71.12))
    (stroke (width 0) (type default) (color 0 0 0 0))
    (uuid 6fd5c71d-8dcf-458b-b9fe-69ac7aabc050)
  )
  (wire (pts (xy 196.85 127) (xy 203.2 127))
    (stroke (width 0) (type default) (color 0 0 0 0))
    (uuid 705bcbc0-215c-4619-8972-717bc8eccd58)
  )
  (wire (pts (xy 228.6 54.61) (xy 241.3 54.61))
    (stroke (width 0) (type default) (color 0 0 0 0))
    (uuid 725de19b-0360-4f8e-9690-9e830be38a6b)
  )
  (wire (pts (xy 81.28 149.86) (xy 69.85 149.86))
    (stroke (width 0) (type default) (color 0 0 0 0))
    (uuid 7910a24d-d6b1-4c3f-b52f-eac884d67322)
  )
  (wire (pts (xy 194.31 127) (xy 196.85 124.46))
    (stroke (width 0) (type default) (color 0 0 0 0))
    (uuid 7a04e060-7fa6-4120-a309-9a1cd5868f47)
  )
  (wire (pts (xy 36.83 71.12) (xy 48.26 71.12))
    (stroke (width 0) (type default) (color 0 0 0 0))
    (uuid 7a0f5447-a3d7-49b1-9b09-ad7c82cca561)
  )
  (wire (pts (xy 133.35 48.26) (xy 139.7 48.26))
    (stroke (width 0) (type default) (color 0 0 0 0))
    (uuid 7a3bd292-c6d3-4fa8-b9c6-2dd8ad67c26e)
  )
  (wire (pts (xy 58.42 71.12) (xy 64.77 71.12))
    (stroke (width 0) (type default) (color 0 0 0 0))
    (uuid 85edb94d-c438-477d-b523-0f9e434fee67)
  )
  (wire (pts (xy 248.92 54.61) (xy 248.92 68.58))
    (stroke (width 0) (type default) (color 0 0 0 0))
    (uuid 8eb4e5ac-96a1-449c-ae0e-b3c5b91d4362)
  )
  (wire (pts (xy 228.6 68.58) (xy 241.3 68.58))
    (stroke (width 0) (type default) (color 0 0 0 0))
    (uuid 8eb89669-4c94-4fa6-bfb8-29ee439ce7b0)
  )
  (wire (pts (xy 182.88 132.08) (xy 196.85 132.08))
    (stroke (width 0) (type default) (color 0 0 0 0))
    (uuid 8eebbd70-b76d-4059-baf0-1e112b1e80ef)
  )
  (wire (pts (xy 123.19 134.62) (xy 137.16 134.62))
    (stroke (width 0) (type default) (color 0 0 0 0))
    (uuid 9360bc04-29ee-472c-925c-4e469888d155)
  )
  (wire (pts (xy 78.74 35.56) (xy 83.82 35.56))
    (stroke (width 0) (type default) (color 0 0 0 0))
    (uuid 93de4e75-d0b7-4f3c-88e1-5bdaed658ca5)
  )
  (wire (pts (xy 248.92 71.12) (xy 248.92 73.66))
    (stroke (width 0) (type default) (color 0 0 0 0))
    (uuid 967da12d-22b9-46f5-bd72-8d85067c0658)
  )
  (wire (pts (xy 194.31 124.46) (xy 196.85 127))
    (stroke (width 0) (type default) (color 0 0 0 0))
    (uuid 9a324c60-951e-4b6e-9319-2b70ed54bd2f)
  )
  (wire (pts (xy 196.85 121.92) (xy 203.2 121.92))
    (stroke (width 0) (type default) (color 0 0 0 0))
    (uuid 9bb56211-3a6e-44a0-8ec6-518b9ac9600f)
  )
  (wire (pts (xy 81.28 142.24) (xy 69.85 142.24))
    (stroke (width 0) (type default) (color 0 0 0 0))
    (uuid a0dd334b-ff04-4d10-a118-687dd129d56e)
  )
  (wire (pts (xy 182.88 55.88) (xy 194.31 55.88))
    (stroke (width 0) (type default) (color 0 0 0 0))
    (uuid a7c45dff-03de-4e8b-a6b8-c9810bfadc8e)
  )
  (wire (pts (xy 137.16 119.38) (xy 137.16 109.22))
    (stroke (width 0) (type default) (color 0 0 0 0))
    (uuid ad551312-0f2e-457f-9d8a-89436dbc2e13)
  )
  (wire (pts (xy 196.85 119.38) (xy 203.2 119.38))
    (stroke (width 0) (type default) (color 0 0 0 0))
    (uuid add1d1cc-d50c-439c-85bf-f4170ca92531)
  )
  (wire (pts (xy 137.16 124.46) (xy 123.19 124.46))
    (stroke (width 0) (type default) (color 0 0 0 0))
    (uuid b532072d-4d0e-460d-824e-cb54048481df)
  )
  (wire (pts (xy 228.6 52.07) (xy 241.3 52.07))
    (stroke (width 0) (type default) (color 0 0 0 0))
    (uuid b99382e8-fa91-4e48-9a58-991d46a924dd)
  )
  (wire (pts (xy 60.96 48.26) (xy 71.12 48.26))
    (stroke (width 0) (type default) (color 0 0 0 0))
    (uuid be720608-b022-4927-823d-c09bcfb827af)
  )
  (wire (pts (xy 182.88 127) (xy 194.31 127))
    (stroke (width 0) (type default) (color 0 0 0 0))
    (uuid c41ed1a0-a45d-42d4-91b3-b5108a6d1e4e)
  )
  (wire (pts (xy 125.73 149.86) (xy 137.16 149.86))
    (stroke (width 0) (type default) (color 0 0 0 0))
    (uuid c4e2c7e9-c72c-4b88-812b-c8579587bcdc)
  )
  (wire (pts (xy 182.88 119.38) (xy 194.31 119.38))
    (stroke (width 0) (type default) (color 0 0 0 0))
    (uuid caac166f-455a-41db-909c-158ab664bb9e)
  )
  (wire (pts (xy 48.26 71.12) (xy 58.42 71.12))
    (stroke (width 0) (type default) (color 0 0 0 0))
    (uuid cb862090-876d-468a-b79b-225ddf8f5de8)
  )
  (wire (pts (xy 248.92 52.07) (xy 248.92 54.61))
    (stroke (width 0) (type default) (color 0 0 0 0))
    (uuid cc07c89b-8ddf-4048-8162-a92591fab9d3)
  )
  (wire (pts (xy 127 109.22) (xy 137.16 109.22))
    (stroke (width 0) (type default) (color 0 0 0 0))
    (uuid cd2e16dd-caf7-4a53-8334-fb4f126185b3)
  )
  (wire (pts (xy 182.88 66.04) (xy 194.31 66.04))
    (stroke (width 0) (type default) (color 0 0 0 0))
    (uuid cff876fb-2d61-4497-a297-35ad33c19518)
  )
  (wire (pts (xy 182.88 63.5) (xy 215.9 63.5))
    (stroke (width 0) (type default) (color 0 0 0 0))
    (uuid d0b7fc57-5732-4617-a9f1-20f050379ffe)
  )
  (wire (pts (xy 182.88 71.12) (xy 194.31 71.12))
    (stroke (width 0) (type default) (color 0 0 0 0))
    (uuid d0fdfe4d-146e-44f4-81f3-4bc76c970fb6)
  )
  (wire (pts (xy 58.42 81.28) (xy 48.26 81.28))
    (stroke (width 0) (type default) (color 0 0 0 0))
    (uuid d889b1c9-8ccd-4052-ac2c-a3c022a2269c)
  )
  (wire (pts (xy 34.29 40.64) (xy 40.64 40.64))
    (stroke (width 0) (type default) (color 0 0 0 0))
    (uuid de94e5d5-636a-4cc6-89b6-818469bf6cd6)
  )
  (wire (pts (xy 182.88 53.34) (xy 194.31 53.34))
    (stroke (width 0) (type default) (color 0 0 0 0))
    (uuid e40c717b-3d36-4291-b91b-dccffc500cf5)
  )
  (wire (pts (xy 182.88 68.58) (xy 194.31 68.58))
    (stroke (width 0) (type default) (color 0 0 0 0))
    (uuid e5639ba2-3b75-46b4-88bb-38ecea2ae200)
  )
  (wire (pts (xy 50.8 40.64) (xy 60.96 40.64))
    (stroke (width 0) (type default) (color 0 0 0 0))
    (uuid e71f4982-31ed-437c-a17d-9f06b0c1c531)
  )
  (wire (pts (xy 34.29 40.64) (xy 34.29 38.1))
    (stroke (width 0) (type default) (color 0 0 0 0))
    (uuid e74b85da-342b-4878-b9ee-ddc546bb6fef)
  )
  (wire (pts (xy 137.16 129.54) (xy 133.35 129.54))
    (stroke (width 0) (type default) (color 0 0 0 0))
    (uuid ef0d9079-aa1c-4a79-9954-bb7894c6347a)
  )
  (wire (pts (xy 48.26 78.74) (xy 48.26 81.28))
    (stroke (width 0) (type default) (color 0 0 0 0))
    (uuid f0ccdab2-a81c-4e27-ac77-0635c0dd190f)
  )
  (wire (pts (xy 133.35 132.08) (xy 133.35 142.24))
    (stroke (width 0) (type default) (color 0 0 0 0))
    (uuid f2e934fd-9942-4dcd-80a8-3052cedc2be8)
  )
  (wire (pts (xy 182.88 58.42) (xy 207.01 58.42))
    (stroke (width 0) (type default) (color 0 0 0 0))
    (uuid f4ddb64a-9328-4128-985b-59639dae20b2)
  )
  (wire (pts (xy 248.92 45.72) (xy 248.92 49.53))
    (stroke (width 0) (type default) (color 0 0 0 0))
    (uuid f76bdfa1-22d0-419b-986c-8b177cb31818)
  )
  (wire (pts (xy 58.42 78.74) (xy 58.42 81.28))
    (stroke (width 0) (type default) (color 0 0 0 0))
    (uuid ffa57a29-752f-4690-8a3f-8587af25044a)
  )

  (text "Program Button" (at 31.75 44.45 0)
    (effects (font (size 1.27 1.27)) (justify left bottom))
    (uuid 25738d1a-2e56-4863-945f-3dee06b9c0ff)
  )
  (text "Reset button" (at 41.91 63.5 0)
    (effects (font (size 1.27 1.27)) (justify left bottom))
    (uuid eb47fcad-612f-4255-9a4e-d60405641e17)
  )

  (label "I2S1_BCLK" (at 123.19 124.46 0)
    (effects (font (size 1.27 1.27)) (justify left bottom))
    (uuid 002c2148-6a2f-48b3-8b29-f53705578944)
  )
  (label "SPKR_L+" (at 184.15 119.38 0)
    (effects (font (size 1.27 1.27)) (justify left bottom))
    (uuid 0048c84e-1625-44d3-a753-1e6a6d8ebe53)
  )
  (label "SD_D3" (at 182.88 68.58 0)
    (effects (font (size 1.27 1.27)) (justify left bottom))
    (uuid 0619ad71-e103-4991-a831-76307f30dab5)
  )
  (label "SD_CLK" (at 182.88 60.96 0)
    (effects (font (size 1.27 1.27)) (justify left bottom))
    (uuid 1722f1fe-5505-44c5-afb1-94d7376f143a)
  )
  (label "PGM_IO0_DRV" (at 55.88 40.64 0)
    (effects (font (size 1.27 1.27)) (justify left bottom))
    (uuid 1a362d08-3142-4654-8fa6-3cf495449bc3)
  )
  (label "AMP_PWR" (at 127 109.22 0)
    (effects (font (size 1.27 1.27)) (justify left bottom))
    (uuid 1aaf61d9-45f8-4c3c-94d6-6719b7721f8e)
  )
  (label "I2S1_WSEL" (at 123.19 127 0)
    (effects (font (size 1.27 1.27)) (justify left bottom))
    (uuid 1ba24d6e-e25a-44ab-ae0c-091141afcd5b)
  )
  (label "SD_CMD" (at 182.88 66.04 0)
    (effects (font (size 1.27 1.27)) (justify left bottom))
    (uuid 208a8c66-dfeb-4f5b-9d6d-b457be0a75ae)
  )
  (label "SD_D2" (at 182.88 71.12 0)
    (effects (font (size 1.27 1.27)) (justify left bottom))
    (uuid 2cdf6056-a28d-41d2-ab76-2cc0814669cf)
  )
  (label "I2S1_DOUT" (at 123.19 139.7 0)
    (effects (font (size 1.27 1.27)) (justify left bottom))
    (uuid 325c62ed-b82c-4817-b444-cb1df7d3ba6b)
  )
  (label "SD_D1" (at 234.95 49.53 180)
    (effects (font (size 1.27 1.27)) (justify right bottom))
    (uuid 368115e6-39a5-47fb-8f59-621c08c01874)
  )
  (label "SD_D1" (at 182.88 53.34 0)
    (effects (font (size 1.27 1.27)) (justify left bottom))
    (uuid 48d9d800-968a-4546-8cb9-9a3334751889)
  )
  (label "SPKR_R+" (at 184.15 124.46 0)
    (effects (font (size 1.27 1.27)) (justify left bottom))
    (uuid 4b5a08d3-af7e-45bb-9e4c-317e21b7cb5f)
  )
  (label "SD_D3" (at 234.95 71.12 180)
    (effects (font (size 1.27 1.27)) (justify right bottom))
    (uuid 59331606-2ce8-47e1-b176-d09093c7b487)
  )
  (label "SD_CLK" (at 236.22 54.61 180)
    (effects (font (size 1.27 1.27)) (justify right bottom))
    (uuid 5c93ee7e-ec3e-4a59-8de4-b709c3863319)
  )
  (label "SD_D2" (at 234.95 73.66 180)
    (effects (font (size 1.27 1.27)) (justify right bottom))
    (uuid 63afe6ab-dfc7-43ea-94d0-578835c7261e)
  )
  (label "SD_D0" (at 234.95 52.07 180)
    (effects (font (size 1.27 1.27)) (justify right bottom))
    (uuid 65edc8e0-63e8-4c90-9180-f3890c965e53)
  )
  (label "~{RESET}" (at 49.53 71.12 0)
    (effects (font (size 1.27 1.27)) (justify left bottom))
    (uuid 7ed79501-c660-41a7-b960-29a9760f814c)
  )
  (label "SPKR_L-" (at 184.15 121.92 0)
    (effects (font (size 1.27 1.27)) (justify left bottom))
    (uuid af9a1fe5-d4f7-421b-b145-dc3e0448f64a)
  )
  (label "SPKR_R-" (at 184.15 127 0)
    (effects (font (size 1.27 1.27)) (justify left bottom))
    (uuid bc40a994-a295-4915-ac9e-ccd1da71c7ce)
  )
  (label "SD_CMD" (at 236.22 68.58 180)
    (effects (font (size 1.27 1.27)) (justify right bottom))
    (uuid c1fdf11e-616c-455e-ac67-597f3905c489)
  )
  (label "~{INT}" (at 78.74 35.56 0)
    (effects (font (size 1.27 1.27)) (justify left bottom))
    (uuid c6e9acde-f94e-4ef3-8679-7eef52d56a0b)
  )
  (label "SD_D0" (at 182.88 55.88 0)
    (effects (font (size 1.27 1.27)) (justify left bottom))
    (uuid d5808dc0-f433-498c-a83e-240ce7b7888a)
  )
  (label "SDA" (at 193.04 132.08 0)
    (effects (font (size 1.27 1.27)) (justify left bottom))
    (uuid e91895fe-5524-4480-9c45-43cc08dc1c0f)
  )
  (label "SCL" (at 123.19 134.62 0)
    (effects (font (size 1.27 1.27)) (justify left bottom))
    (uuid ebc319b6-5766-4a10-9332-79f3ca0936c7)
  )

  (global_label "SD_D3" (shape bidirectional) (at 194.31 68.58 0) (fields_autoplaced)
    (effects (font (size 1.27 1.27)) (justify left))
    (uuid 093ff53b-c462-41fa-9f75-52e4a8764cf5)
    (property "Intersheet References" "${INTERSHEET_REFS}" (id 0) (at 202.5609 68.5006 0)
      (effects (font (size 1.27 1.27)) (justify left) hide)
    )
  )
  (global_label "~{INT}" (shape output) (at 83.82 35.56 0) (fields_autoplaced)
    (effects (font (size 1.27 1.27)) (justify left))
    (uuid 151db125-b268-491d-9843-ba212ea489cd)
    (property "Intersheet References" "${INTERSHEET_REFS}" (id 0) (at 89.0471 35.4806 0)
      (effects (font (size 1.27 1.27)) (justify left) hide)
    )
  )
  (global_label "SD_CLK" (shape input) (at 194.31 60.96 0) (fields_autoplaced)
    (effects (font (size 1.27 1.27)) (justify left))
    (uuid 2f127be8-1e43-4891-a94d-41f12bbf52d9)
    (property "Intersheet References" "${INTERSHEET_REFS}" (id 0) (at 203.6494 60.8806 0)
      (effects (font (size 1.27 1.27)) (justify left) hide)
    )
  )
  (global_label "SDA" (shape bidirectional) (at 196.85 132.08 0) (fields_autoplaced)
    (effects (font (size 1.27 1.27)) (justify left))
    (uuid 3dd231d9-4c0c-4133-8eaa-10eadae2f3a7)
    (property "Intersheet References" "${INTERSHEET_REFS}" (id 0) (at 202.7423 132.0006 0)
      (effects (font (size 1.27 1.27)) (justify left) hide)
    )
  )
  (global_label "SCL" (shape input) (at 123.19 134.62 180) (fields_autoplaced)
    (effects (font (size 1.27 1.27)) (justify right))
    (uuid 44be325b-8a93-41be-bdee-0a62fb8bc9c1)
    (property "Intersheet References" "${INTERSHEET_REFS}" (id 0) (at 117.3582 134.5406 0)
      (effects (font (size 1.27 1.27)) (justify right) hide)
    )
  )
  (global_label "AMP_PWR" (shape input) (at 127 109.22 180) (fields_autoplaced)
    (effects (font (size 1.27 1.27)) (justify right))
    (uuid 525b6b8f-b384-4eaa-b825-c9190199b028)
    (property "Intersheet References" "${INTERSHEET_REFS}" (id 0) (at 115.9068 109.1406 0)
      (effects (font (size 1.27 1.27)) (justify right) hide)
    )
  )
  (global_label "I2S1_BCLK" (shape input) (at 123.19 124.46 180) (fields_autoplaced)
    (effects (font (size 1.27 1.27)) (justify right))
    (uuid 5e33d9e6-7b3f-44a6-8208-6a454fe463f4)
    (property "Intersheet References" "${INTERSHEET_REFS}" (id 0) (at 110.8268 124.3806 0)
      (effects (font (size 1.27 1.27)) (justify right) hide)
    )
  )
  (global_label "SD_CMD" (shape bidirectional) (at 194.31 66.04 0) (fields_autoplaced)
    (effects (font (size 1.27 1.27)) (justify left))
    (uuid 81630ba7-1092-4f28-b08a-552f9904cbdb)
    (property "Intersheet References" "${INTERSHEET_REFS}" (id 0) (at 204.0728 65.9606 0)
      (effects (font (size 1.27 1.27)) (justify left) hide)
    )
  )
  (global_label "SD_D2" (shape bidirectional) (at 194.31 71.12 0) (fields_autoplaced)
    (effects (font (size 1.27 1.27)) (justify left))
    (uuid 90ebb7c9-17bc-4588-adf9-e63d7069e582)
    (property "Intersheet References" "${INTERSHEET_REFS}" (id 0) (at 202.5609 71.0406 0)
      (effects (font (size 1.27 1.27)) (justify left) hide)
    )
  )
  (global_label "SD_D1" (shape bidirectional) (at 194.31 53.34 0) (fields_autoplaced)
    (effects (font (size 1.27 1.27)) (justify left))
    (uuid a0993daa-1048-4ebf-a8ed-d63df9b47be8)
    (property "Intersheet References" "${INTERSHEET_REFS}" (id 0) (at 202.5609 53.2606 0)
      (effects (font (size 1.27 1.27)) (justify left) hide)
    )
  )
  (global_label "SD_D0" (shape bidirectional) (at 194.31 55.88 0) (fields_autoplaced)
    (effects (font (size 1.27 1.27)) (justify left))
    (uuid b082ede2-9061-4bbb-b91d-9ed5c6ffa2fc)
    (property "Intersheet References" "${INTERSHEET_REFS}" (id 0) (at 202.5609 55.8006 0)
      (effects (font (size 1.27 1.27)) (justify left) hide)
    )
  )
  (global_label "I2S1_WSEL" (shape input) (at 123.19 127 180) (fields_autoplaced)
    (effects (font (size 1.27 1.27)) (justify right))
    (uuid c54d4213-7a13-440f-a505-7e8e5505c9fa)
    (property "Intersheet References" "${INTERSHEET_REFS}" (id 0) (at 110.8268 126.9206 0)
      (effects (font (size 1.27 1.27)) (justify right) hide)
    )
  )
  (global_label "I2S1_DOUT" (shape input) (at 123.19 139.7 180) (fields_autoplaced)
    (effects (font (size 1.27 1.27)) (justify right))
    (uuid d902436e-073d-419c-8fde-c98f9528d2fd)
    (property "Intersheet References" "${INTERSHEET_REFS}" (id 0) (at 110.7663 139.6206 0)
      (effects (font (size 1.27 1.27)) (justify right) hide)
    )
  )
  (global_label "~{RESET}" (shape output) (at 64.77 71.12 0) (fields_autoplaced)
    (effects (font (size 1.27 1.27)) (justify left))
    (uuid da92784c-c005-4a05-a472-4138bc93ff9a)
    (property "Intersheet References" "${INTERSHEET_REFS}" (id 0) (at -78.74 -22.86 0)
      (effects (font (size 1.27 1.27)) hide)
    )
  )

  (symbol (lib_id "Device:C") (at 60.96 44.45 0) (unit 1)
    (in_bom yes) (on_board yes)
    (uuid 00000000-0000-0000-0000-00005dd6f2ff)
    (property "Reference" "C314" (id 0) (at 63.881 43.2816 0)
      (effects (font (size 1.27 1.27)) (justify left))
    )
    (property "Value" "0.1uF" (id 1) (at 63.881 45.593 0)
      (effects (font (size 1.27 1.27)) (justify left))
    )
    (property "Footprint" "Capacitor_SMD:C_0402_1005Metric" (id 2) (at 61.9252 48.26 0)
      (effects (font (size 1.27 1.27)) hide)
    )
    (property "Datasheet" "" (id 3) (at 60.96 44.45 0)
      (effects (font (size 1.27 1.27)) hide)
    )
    (property "SPR" "Digikey" (id 6) (at 60.96 44.45 0)
      (effects (font (size 1.27 1.27)) hide)
    )
    (property "DESC" "" (id 9) (at -25.4 110.49 0)
      (effects (font (size 1.27 1.27)) hide)
    )
    (pin "1" (uuid e8ce16f4-470e-41a6-b2b2-5baf35d4a5ad))
    (pin "2" (uuid 3920722b-298d-4bb7-a862-0231cd11afa6))
  )

  (symbol (lib_id "power:GND") (at 71.12 48.26 0) (unit 1)
    (in_bom yes) (on_board yes)
    (uuid 00000000-0000-0000-0000-00005dd6f994)
    (property "Reference" "#PWR0337" (id 0) (at 71.12 54.61 0)
      (effects (font (size 1.27 1.27)) hide)
    )
    (property "Value" "GND" (id 1) (at 71.247 52.6542 0))
    (property "Footprint" "" (id 2) (at 71.12 48.26 0)
      (effects (font (size 1.27 1.27)) hide)
    )
    (property "Datasheet" "" (id 3) (at 71.12 48.26 0)
      (effects (font (size 1.27 1.27)) hide)
    )
    (pin "1" (uuid 1d249da0-400a-4621-b412-175f0a39c965))
  )

  (symbol (lib_id "power:+3.3V") (at 34.29 38.1 0) (unit 1)
    (in_bom yes) (on_board yes)
    (uuid 00000000-0000-0000-0000-00005dd70267)
    (property "Reference" "#PWR0334" (id 0) (at 34.29 41.91 0)
      (effects (font (size 1.27 1.27)) hide)
    )
    (property "Value" "+3.3V" (id 1) (at 34.671 33.7058 0))
    (property "Footprint" "" (id 2) (at 34.29 38.1 0)
      (effects (font (size 1.27 1.27)) hide)
    )
    (property "Datasheet" "" (id 3) (at 34.29 38.1 0)
      (effects (font (size 1.27 1.27)) hide)
    )
    (pin "1" (uuid 2aba6046-dc53-4282-bde4-bf2ebbf73cf5))
  )

  (symbol (lib_id "power:GND") (at 78.74 45.72 0) (unit 1)
    (in_bom yes) (on_board yes)
    (uuid 00000000-0000-0000-0000-00005dd73fde)
    (property "Reference" "#PWR0335" (id 0) (at 78.74 52.07 0)
      (effects (font (size 1.27 1.27)) hide)
    )
    (property "Value" "GND" (id 1) (at 78.867 50.1142 0))
    (property "Footprint" "" (id 2) (at 78.74 45.72 0)
      (effects (font (size 1.27 1.27)) hide)
    )
    (property "Datasheet" "" (id 3) (at 78.74 45.72 0)
      (effects (font (size 1.27 1.27)) hide)
    )
    (pin "1" (uuid f6624e9d-a497-44c1-9648-4df43f2fe049))
  )

  (symbol (lib_id "power:+3.3V") (at 36.83 63.5 0) (unit 1)
    (in_bom yes) (on_board yes)
    (uuid 00000000-0000-0000-0000-00005ddf9e79)
    (property "Reference" "#PWR0340" (id 0) (at 36.83 67.31 0)
      (effects (font (size 1.27 1.27)) hide)
    )
    (property "Value" "+3.3V" (id 1) (at 37.211 59.1058 0))
    (property "Footprint" "" (id 2) (at 36.83 63.5 0)
      (effects (font (size 1.27 1.27)) hide)
    )
    (property "Datasheet" "" (id 3) (at 36.83 63.5 0)
      (effects (font (size 1.27 1.27)) hide)
    )
    (pin "1" (uuid dfca780e-f70f-41e3-9f8a-8a8ee45d570b))
  )

  (symbol (lib_id "Device:C") (at 48.26 74.93 0) (unit 1)
    (in_bom yes) (on_board yes)
    (uuid 00000000-0000-0000-0000-00005ddf9e8f)
    (property "Reference" "C316" (id 0) (at 51.181 73.7616 0)
      (effects (font (size 1.27 1.27)) (justify left))
    )
    (property "Value" "1uF" (id 1) (at 51.181 76.073 0)
      (effects (font (size 1.27 1.27)) (justify left))
    )
    (property "Footprint" "Capacitor_SMD:C_0402_1005Metric" (id 2) (at 49.2252 78.74 0)
      (effects (font (size 1.27 1.27)) hide)
    )
    (property "Datasheet" "" (id 3) (at 48.26 74.93 0)
      (effects (font (size 1.27 1.27)) hide)
    )
    (property "DESC" "" (id 9) (at -49.53 172.72 0)
      (effects (font (size 1.27 1.27)) hide)
    )
    (pin "1" (uuid 6a4ac4ba-02eb-488c-9696-c16d31f63d86))
    (pin "2" (uuid 3f173e7e-2ce9-419e-989d-0bde5ba86865))
  )

  (symbol (lib_id "power:GND") (at 36.83 81.28 0) (unit 1)
    (in_bom yes) (on_board yes)
    (uuid 00000000-0000-0000-0000-00005ddf9e95)
    (property "Reference" "#PWR0343" (id 0) (at 36.83 87.63 0)
      (effects (font (size 1.27 1.27)) hide)
    )
    (property "Value" "GND" (id 1) (at 36.957 85.6742 0))
    (property "Footprint" "" (id 2) (at 36.83 81.28 0)
      (effects (font (size 1.27 1.27)) hide)
    )
    (property "Datasheet" "" (id 3) (at 36.83 81.28 0)
      (effects (font (size 1.27 1.27)) hide)
    )
    (pin "1" (uuid e56def5e-0a13-41d6-ac79-12e5ed512a38))
  )

  (symbol (lib_id "Transistor_FET:BSS138") (at 76.2 40.64 0) (unit 1)
    (in_bom yes) (on_board yes)
    (uuid 00000000-0000-0000-0000-00005ec189c0)
    (property "Reference" "Q303" (id 0) (at 84.8868 40.64 90))
    (property "Value" "BSS138" (id 1) (at 82.5754 40.64 90))
    (property "Footprint" "Package_TO_SOT_SMD:SOT-23" (id 2) (at 81.28 42.545 0)
      (effects (font (size 1.27 1.27) italic) (justify left) hide)
    )
    (property "Datasheet" "https://www.fairchildsemi.com/datasheets/BS/BSS138.pdf" (id 3) (at 76.2 40.64 0)
      (effects (font (size 1.27 1.27)) (justify left) hide)
    )
    (property "MFR" "ON Semiconductor" (id 4) (at 76.2 40.64 0)
      (effects (font (size 1.27 1.27)) hide)
    )
    (property "MPN" "BSS138" (id 5) (at 76.2 40.64 0)
      (effects (font (size 1.27 1.27)) hide)
    )
    (property "SPR" "Digikey" (id 6) (at 76.2 40.64 0)
      (effects (font (size 1.27 1.27)) hide)
    )
    (property "SPN" "BSS138CT-ND" (id 7) (at 76.2 40.64 0)
      (effects (font (size 1.27 1.27)) hide)
    )
    (property "SPURL" "https://www.digikey.com/product-detail/en/on-semiconductor/BSS138/BSS138CT-ND/244294" (id 8) (at 76.2 40.64 0)
      (effects (font (size 1.27 1.27)) hide)
    )
    (property "DESC" "N-Channel 50V 220mA (Ta) 360mW (Ta) Surface Mount SOT-23-3" (id 9) (at -54.61 102.87 0)
      (effects (font (size 1.27 1.27)) hide)
    )
    (pin "1" (uuid 1f50495f-f8a1-4431-a948-7658973f2894))
    (pin "2" (uuid e006d65a-0918-4b03-8b94-7e40af6656fc))
    (pin "3" (uuid b8bd8e84-9854-44a8-ab0b-ae393b912d44))
  )

  (symbol (lib_id "power:GND") (at 110.49 160.02 0) (unit 1)
    (in_bom yes) (on_board yes)
    (uuid 00119666-d199-41ce-9d13-83f110ddf7c7)
    (property "Reference" "#PWR0352" (id 0) (at 110.49 166.37 0)
      (effects (font (size 1.27 1.27)) hide)
    )
    (property "Value" "GND" (id 1) (at 110.617 164.4142 0))
    (property "Footprint" "" (id 2) (at 110.49 160.02 0)
      (effects (font (size 1.27 1.27)) hide)
    )
    (property "Datasheet" "" (id 3) (at 110.49 160.02 0)
      (effects (font (size 1.27 1.27)) hide)
    )
    (pin "1" (uuid a30a2f6c-f97b-4f9b-8add-95e2c0c0743b))
  )

  (symbol (lib_id "Device:R") (at 245.11 49.53 90) (unit 1)
    (in_bom yes) (on_board yes)
    (uuid 06e33022-49fa-4bc7-b12f-fcafdaa551d5)
    (property "Reference" "R302" (id 0) (at 238.76 48.26 90))
    (property "Value" "10K" (id 1) (at 245.11 49.53 90))
    (property "Footprint" "Resistor_SMD:R_0402_1005Metric" (id 2) (at 245.11 51.308 90)
      (effects (font (size 1.27 1.27)) hide)
    )
    (property "Datasheet" "" (id 3) (at 245.11 49.53 0)
      (effects (font (size 1.27 1.27)) hide)
    )
    (property "Tolerance" "5%" (id 4) (at 245.11 49.53 90)
      (effects (font (size 1.27 1.27)) hide)
    )
    (property "MFR" "" (id 5) (at 288.29 76.2 0)
      (effects (font (size 1.27 1.27)) hide)
    )
    (property "MPN" "" (id 6) (at 288.29 76.2 0)
      (effects (font (size 1.27 1.27)) hide)
    )
    (property "SPR" "Digikey" (id 7) (at 288.29 76.2 0)
      (effects (font (size 1.27 1.27)) hide)
    )
    (property "SPN" "541-2979-1-ND" (id 8) (at 288.29 76.2 0)
      (effects (font (size 1.27 1.27)) hide)
    )
    (property "SPURL" "https://www.digikey.com/products/en?keywords=541-2979-1-ND" (id 9) (at 288.29 76.2 0)
      (effects (font (size 1.27 1.27)) hide)
    )
    (property "DESC" "" (id 10) (at 271.78 74.93 0)
      (effects (font (size 1.27 1.27)) hide)
    )
    (pin "1" (uuid 44a318a2-c71e-4f20-888a-3bd0fa30adf2))
    (pin "2" (uuid fd4e62e1-b71e-454f-a651-93c9236e9f31))
  )

  (symbol (lib_id "power:+3.3V") (at 124.46 121.92 0) (unit 1)
    (in_bom yes) (on_board yes)
    (uuid 07b2e876-695f-4e58-a1ee-3b18d7839989)
    (property "Reference" "#PWR0344" (id 0) (at 124.46 125.73 0)
      (effects (font (size 1.27 1.27)) hide)
    )
    (property "Value" "+3.3V" (id 1) (at 124.841 117.5258 0))
    (property "Footprint" "" (id 2) (at 124.46 121.92 0)
      (effects (font (size 1.27 1.27)) hide)
    )
    (property "Datasheet" "" (id 3) (at 124.46 121.92 0)
      (effects (font (size 1.27 1.27)) hide)
    )
    (pin "1" (uuid 85526231-29ef-4bdb-814e-76722293b6f8))
  )

  (symbol (lib_id "power:+3.3V") (at 248.92 45.72 0) (unit 1)
    (in_bom yes) (on_board yes)
    (uuid 1d56f7bc-c3f1-441c-aa0c-086888b1fa99)
    (property "Reference" "#PWR0336" (id 0) (at 248.92 49.53 0)
      (effects (font (size 1.27 1.27)) hide)
    )
    (property "Value" "+3.3V" (id 1) (at 249.301 41.3258 0))
    (property "Footprint" "" (id 2) (at 248.92 45.72 0)
      (effects (font (size 1.27 1.27)) hide)
    )
    (property "Datasheet" "" (id 3) (at 248.92 45.72 0)
      (effects (font (size 1.27 1.27)) hide)
    )
    (pin "1" (uuid 1c1f708f-2494-44cc-9aed-509bea154dfe))
  )

  (symbol (lib_id "Device:C") (at 69.85 146.05 0) (unit 1)
    (in_bom yes) (on_board yes)
    (uuid 27efcecf-99a4-4035-9cbd-beef0155e967)
    (property "Reference" "C318" (id 0) (at 72.771 144.8816 0)
      (effects (font (size 1.27 1.27)) (justify left))
    )
    (property "Value" "0.1uF" (id 1) (at 72.771 147.193 0)
      (effects (font (size 1.27 1.27)) (justify left))
    )
    (property "Footprint" "Capacitor_SMD:C_0402_1005Metric" (id 2) (at 70.8152 149.86 0)
      (effects (font (size 1.27 1.27)) hide)
    )
    (property "Datasheet" "" (id 3) (at 69.85 146.05 0)
      (effects (font (size 1.27 1.27)) hide)
    )
    (property "MFR" "" (id 4) (at -53.34 213.36 0)
      (effects (font (size 1.27 1.27)) hide)
    )
    (property "MPN" "" (id 5) (at -53.34 213.36 0)
      (effects (font (size 1.27 1.27)) hide)
    )
    (property "SPR" "Digikey" (id 6) (at -53.34 213.36 0)
      (effects (font (size 1.27 1.27)) hide)
    )
    (property "SPN" "" (id 7) (at -53.34 213.36 0)
      (effects (font (size 1.27 1.27)) hide)
    )
    (property "SPURL" "" (id 8) (at -53.34 213.36 0)
      (effects (font (size 1.27 1.27)) hide)
    )
    (property "DESC" "" (id 9) (at -53.34 213.36 0)
      (effects (font (size 1.27 1.27)) hide)
    )
    (pin "1" (uuid c1fac272-6122-4879-a8e9-47e262dad1dd))
    (pin "2" (uuid 6ce7f3ac-aedf-45db-9e8e-9a2e6eb6343c))
  )

  (symbol (lib_id "Connector_Generic:Conn_01x04") (at 208.28 121.92 0) (unit 1)
    (in_bom yes) (on_board yes) (fields_autoplaced)
    (uuid 2c6ed2a4-c8c1-43de-81ee-bde482603901)
    (property "Reference" "J304" (id 0) (at 210.82 121.9199 0)
      (effects (font (size 1.27 1.27)) (justify left))
    )
    (property "Value" "Speaker" (id 1) (at 210.82 124.4599 0)
      (effects (font (size 1.27 1.27)) (justify left))
    )
    (property "Footprint" "Connector_Molex:Molex_PicoBlade_53047-0410_1x04_P1.25mm_Vertical" (id 2) (at 208.28 121.92 0)
      (effects (font (size 1.27 1.27)) hide)
    )
    (property "Datasheet" "~" (id 3) (at 208.28 121.92 0)
      (effects (font (size 1.27 1.27)) hide)
    )
    (pin "1" (uuid f0c56004-b80e-49db-84fa-29398bd10cb2))
    (pin "2" (uuid bb435e31-c5bc-4969-ab84-df8da1ddd8b2))
    (pin "3" (uuid 96ccc397-bc27-4abd-804a-ca1428d41b54))
    (pin "4" (uuid 9b22a03f-75ad-4a77-8ed6-53e44527d917))
  )

  (symbol (lib_id "Device:R") (at 245.11 71.12 90) (unit 1)
    (in_bom yes) (on_board yes)
    (uuid 2f72bcbf-c072-433a-9805-55169244a0a6)
    (property "Reference" "R306" (id 0) (at 238.76 69.85 90))
    (property "Value" "10K" (id 1) (at 245.11 71.12 90))
    (property "Footprint" "Resistor_SMD:R_0402_1005Metric" (id 2) (at 245.11 72.898 90)
      (effects (font (size 1.27 1.27)) hide)
    )
    (property "Datasheet" "" (id 3) (at 245.11 71.12 0)
      (effects (font (size 1.27 1.27)) hide)
    )
    (property "Tolerance" "5%" (id 4) (at 245.11 71.12 90)
      (effects (font (size 1.27 1.27)) hide)
    )
    (property "MFR" "" (id 5) (at 288.29 97.79 0)
      (effects (font (size 1.27 1.27)) hide)
    )
    (property "MPN" "" (id 6) (at 288.29 97.79 0)
      (effects (font (size 1.27 1.27)) hide)
    )
    (property "SPR" "Digikey" (id 7) (at 288.29 97.79 0)
      (effects (font (size 1.27 1.27)) hide)
    )
    (property "SPN" "541-2979-1-ND" (id 8) (at 288.29 97.79 0)
      (effects (font (size 1.27 1.27)) hide)
    )
    (property "SPURL" "https://www.digikey.com/products/en?keywords=541-2979-1-ND" (id 9) (at 288.29 97.79 0)
      (effects (font (size 1.27 1.27)) hide)
    )
    (property "DESC" "" (id 10) (at 271.78 96.52 0)
      (effects (font (size 1.27 1.27)) hide)
    )
    (pin "1" (uuid a7380d2a-1505-4262-b873-cb3304b7e003))
    (pin "2" (uuid 727e3894-65cf-45f2-9bb1-56e8d7d45626))
  )

  (symbol (lib_id "Device:R") (at 245.11 54.61 90) (unit 1)
    (in_bom yes) (on_board yes)
    (uuid 3357355a-63f2-47ef-96ba-f0edb08a5d77)
    (property "Reference" "R304" (id 0) (at 238.76 53.34 90))
    (property "Value" "10K" (id 1) (at 245.11 54.61 90))
    (property "Footprint" "Resistor_SMD:R_0402_1005Metric" (id 2) (at 245.11 56.388 90)
      (effects (font (size 1.27 1.27)) hide)
    )
    (property "Datasheet" "" (id 3) (at 245.11 54.61 0)
      (effects (font (size 1.27 1.27)) hide)
    )
    (property "Tolerance" "5%" (id 4) (at 245.11 54.61 90)
      (effects (font (size 1.27 1.27)) hide)
    )
    (property "MFR" "" (id 5) (at 288.29 81.28 0)
      (effects (font (size 1.27 1.27)) hide)
    )
    (property "MPN" "" (id 6) (at 288.29 81.28 0)
      (effects (font (size 1.27 1.27)) hide)
    )
    (property "SPR" "Digikey" (id 7) (at 288.29 81.28 0)
      (effects (font (size 1.27 1.27)) hide)
    )
    (property "SPN" "541-2979-1-ND" (id 8) (at 288.29 81.28 0)
      (effects (font (size 1.27 1.27)) hide)
    )
    (property "SPURL" "https://www.digikey.com/products/en?keywords=541-2979-1-ND" (id 9) (at 288.29 81.28 0)
      (effects (font (size 1.27 1.27)) hide)
    )
    (property "DESC" "" (id 10) (at 271.78 80.01 0)
      (effects (font (size 1.27 1.27)) hide)
    )
    (pin "1" (uuid d56e1cf7-e528-4314-a5e0-e3a174f15526))
    (pin "2" (uuid dff238a9-2b39-409c-aedd-2fdd9e34ddd5))
  )

  (symbol (lib_id "Device:R") (at 245.11 73.66 90) (unit 1)
    (in_bom yes) (on_board yes)
    (uuid 4124cf47-b950-4dc7-aa66-bc084077c68c)
    (property "Reference" "R307" (id 0) (at 238.76 72.39 90))
    (property "Value" "10K" (id 1) (at 245.11 73.66 90))
    (property "Footprint" "Resistor_SMD:R_0402_1005Metric" (id 2) (at 245.11 75.438 90)
      (effects (font (size 1.27 1.27)) hide)
    )
    (property "Datasheet" "" (id 3) (at 245.11 73.66 0)
      (effects (font (size 1.27 1.27)) hide)
    )
    (property "Tolerance" "5%" (id 4) (at 245.11 73.66 90)
      (effects (font (size 1.27 1.27)) hide)
    )
    (property "MFR" "" (id 5) (at 288.29 100.33 0)
      (effects (font (size 1.27 1.27)) hide)
    )
    (property "MPN" "" (id 6) (at 288.29 100.33 0)
      (effects (font (size 1.27 1.27)) hide)
    )
    (property "SPR" "Digikey" (id 7) (at 288.29 100.33 0)
      (effects (font (size 1.27 1.27)) hide)
    )
    (property "SPN" "541-2979-1-ND" (id 8) (at 288.29 100.33 0)
      (effects (font (size 1.27 1.27)) hide)
    )
    (property "SPURL" "https://www.digikey.com/products/en?keywords=541-2979-1-ND" (id 9) (at 288.29 100.33 0)
      (effects (font (size 1.27 1.27)) hide)
    )
    (property "DESC" "" (id 10) (at 271.78 99.06 0)
      (effects (font (size 1.27 1.27)) hide)
    )
    (pin "1" (uuid 321b9e2c-d548-472e-88fd-82f1cb8dc6cf))
    (pin "2" (uuid 84b7dbb4-c0ca-405e-bf64-330c76d5c24a))
  )

  (symbol (lib_id "Device:R") (at 137.16 105.41 0) (unit 1)
    (in_bom yes) (on_board yes)
    (uuid 737a72d4-64db-4bcb-b4ef-75a58b263d94)
    (property "Reference" "R301" (id 0) (at 132.08 104.14 0))
    (property "Value" "10K" (id 1) (at 137.16 105.41 90))
    (property "Footprint" "Resistor_SMD:R_0402_1005Metric" (id 2) (at 135.382 105.41 90)
      (effects (font (size 1.27 1.27)) hide)
    )
    (property "Datasheet" "" (id 3) (at 137.16 105.41 0)
      (effects (font (size 1.27 1.27)) hide)
    )
    (property "Tolerance" "5%" (id 4) (at 137.16 105.41 90)
      (effects (font (size 1.27 1.27)) hide)
    )
    (property "MFR" "" (id 5) (at 110.49 148.59 0)
      (effects (font (size 1.27 1.27)) hide)
    )
    (property "MPN" "" (id 6) (at 110.49 148.59 0)
      (effects (font (size 1.27 1.27)) hide)
    )
    (property "SPR" "Digikey" (id 7) (at 110.49 148.59 0)
      (effects (font (size 1.27 1.27)) hide)
    )
    (property "SPN" "541-2979-1-ND" (id 8) (at 110.49 148.59 0)
      (effects (font (size 1.27 1.27)) hide)
    )
    (property "SPURL" "https://www.digikey.com/products/en?keywords=541-2979-1-ND" (id 9) (at 110.49 148.59 0)
      (effects (font (size 1.27 1.27)) hide)
    )
    (property "DESC" "" (id 10) (at 111.76 132.08 0)
      (effects (font (size 1.27 1.27)) hide)
    )
    (pin "1" (uuid d9eed2ea-1be1-492a-96b6-eca66b1c26a9))
    (pin "2" (uuid d9e16cd4-cb78-4b8d-a4e0-e62900d2467f))
  )

  (symbol (lib_id "Device:R") (at 36.83 67.31 0) (unit 1)
    (in_bom yes) (on_board yes)
    (uuid 78528348-750c-4498-9331-f19b1b530835)
    (property "Reference" "R309" (id 0) (at 31.75 66.04 0))
    (property "Value" "10K" (id 1) (at 36.83 67.31 90))
    (property "Footprint" "Resistor_SMD:R_0402_1005Metric" (id 2) (at 35.052 67.31 90)
      (effects (font (size 1.27 1.27)) hide)
    )
    (property "Datasheet" "" (id 3) (at 36.83 67.31 0)
      (effects (font (size 1.27 1.27)) hide)
    )
    (property "Tolerance" "5%" (id 4) (at 36.83 67.31 90)
      (effects (font (size 1.27 1.27)) hide)
    )
    (property "MFR" "" (id 5) (at 10.16 110.49 0)
      (effects (font (size 1.27 1.27)) hide)
    )
    (property "MPN" "" (id 6) (at 10.16 110.49 0)
      (effects (font (size 1.27 1.27)) hide)
    )
    (property "SPR" "Digikey" (id 7) (at 10.16 110.49 0)
      (effects (font (size 1.27 1.27)) hide)
    )
    (property "SPN" "541-2979-1-ND" (id 8) (at 10.16 110.49 0)
      (effects (font (size 1.27 1.27)) hide)
    )
    (property "SPURL" "https://www.digikey.com/products/en?keywords=541-2979-1-ND" (id 9) (at 10.16 110.49 0)
      (effects (font (size 1.27 1.27)) hide)
    )
    (property "DESC" "" (id 10) (at 11.43 93.98 0)
      (effects (font (size 1.27 1.27)) hide)
    )
    (pin "1" (uuid f8d0b6d7-251f-4032-92c2-4fa379ed8b92))
    (pin "2" (uuid 71b193f6-aa9e-4c3b-8b65-7e06c1c320b8))
  )

  (symbol (lib_id "Device:C") (at 81.28 146.05 0) (unit 1)
    (in_bom yes) (on_board yes)
    (uuid 7be7469c-7e93-42d3-8052-75b69f94222e)
    (property "Reference" "C301" (id 0) (at 84.201 144.8816 0)
      (effects (font (size 1.27 1.27)) (justify left))
    )
    (property "Value" "10uF" (id 1) (at 84.201 147.193 0)
      (effects (font (size 1.27 1.27)) (justify left))
    )
    (property "Footprint" "Capacitor_SMD:C_0603_1608Metric" (id 2) (at 82.2452 149.86 0)
      (effects (font (size 1.27 1.27)) hide)
    )
    (property "Datasheet" "" (id 3) (at 81.28 146.05 0)
      (effects (font (size 1.27 1.27)) hide)
    )
    (property "MFR" "" (id 4) (at -31.75 213.36 0)
      (effects (font (size 1.27 1.27)) hide)
    )
    (property "MPN" "" (id 5) (at -31.75 213.36 0)
      (effects (font (size 1.27 1.27)) hide)
    )
    (property "SPR" "" (id 6) (at -31.75 213.36 0)
      (effects (font (size 1.27 1.27)) hide)
    )
    (property "SPN" "" (id 7) (at -31.75 213.36 0)
      (effects (font (size 1.27 1.27)) hide)
    )
    (property "SPURL" "" (id 8) (at -31.75 213.36 0)
      (effects (font (size 1.27 1.27)) hide)
    )
    (property "DESC" "" (id 9) (at -31.75 213.36 0)
      (effects (font (size 1.27 1.27)) hide)
    )
    (pin "1" (uuid 207afad8-c051-47d9-8ef6-142e00561bbd))
    (pin "2" (uuid 90a5c3f1-eed7-4954-aa44-2afe9aa27a78))
  )

  (symbol (lib_id "Device:R") (at 71.12 44.45 180) (unit 1)
    (in_bom yes) (on_board yes)
    (uuid 7d735474-b8e7-44d4-b525-05bd37459d72)
    (property "Reference" "R308" (id 0) (at 74.93 45.72 0))
    (property "Value" "10K" (id 1) (at 71.12 44.45 90))
    (property "Footprint" "Resistor_SMD:R_0402_1005Metric" (id 2) (at 72.898 44.45 90)
      (effects (font (size 1.27 1.27)) hide)
    )
    (property "Datasheet" "" (id 3) (at 71.12 44.45 0)
      (effects (font (size 1.27 1.27)) hide)
    )
    (property "Tolerance" "5%" (id 4) (at 71.12 44.45 90)
      (effects (font (size 1.27 1.27)) hide)
    )
    (property "MFR" "" (id 5) (at 97.79 1.27 0)
      (effects (font (size 1.27 1.27)) hide)
    )
    (property "MPN" "" (id 6) (at 97.79 1.27 0)
      (effects (font (size 1.27 1.27)) hide)
    )
    (property "SPR" "Digikey" (id 7) (at 97.79 1.27 0)
      (effects (font (size 1.27 1.27)) hide)
    )
    (property "SPN" "541-2979-1-ND" (id 8) (at 97.79 1.27 0)
      (effects (font (size 1.27 1.27)) hide)
    )
    (property "SPURL" "https://www.digikey.com/products/en?keywords=541-2979-1-ND" (id 9) (at 97.79 1.27 0)
      (effects (font (size 1.27 1.27)) hide)
    )
    (property "DESC" "" (id 10) (at 96.52 17.78 0)
      (effects (font (size 1.27 1.27)) hide)
    )
    (pin "1" (uuid 8a61a884-e3af-4e5b-88b7-c0c39337d1ef))
    (pin "2" (uuid 5a3b94f7-7711-4060-b84b-721cc9389448))
  )

  (symbol (lib_id "Switch:SW_Push") (at 45.72 40.64 0) (unit 1)
    (in_bom yes) (on_board yes) (fields_autoplaced)
    (uuid 8d46c617-9faf-4d73-ac3d-409be2d1a40d)
    (property "Reference" "SW301" (id 0) (at 45.72 33.02 0))
    (property "Value" "KMR2" (id 1) (at 45.72 35.56 0))
    (property "Footprint" "Button_Switch_SMD:SW_Push_1P1T_NO_CK_KMR2" (id 2) (at 45.72 35.56 0)
      (effects (font (size 1.27 1.27)) hide)
    )
    (property "Datasheet" "~" (id 3) (at 45.72 35.56 0)
      (effects (font (size 1.27 1.27)) hide)
    )
    (pin "1" (uuid 8475a699-bafd-4cff-b031-34fce47b7e47))
    (pin "2" (uuid 56141a08-97b5-48be-a12d-f2fdbc4462d5))
  )

  (symbol (lib_id "Device:R") (at 245.11 68.58 90) (unit 1)
    (in_bom yes) (on_board yes)
    (uuid 97681b3a-e916-4350-be09-43344e29625a)
    (property "Reference" "R305" (id 0) (at 238.76 67.31 90))
    (property "Value" "10K" (id 1) (at 245.11 68.58 90))
    (property "Footprint" "Resistor_SMD:R_0402_1005Metric" (id 2) (at 245.11 70.358 90)
      (effects (font (size 1.27 1.27)) hide)
    )
    (property "Datasheet" "" (id 3) (at 245.11 68.58 0)
      (effects (font (size 1.27 1.27)) hide)
    )
    (property "Tolerance" "5%" (id 4) (at 245.11 68.58 90)
      (effects (font (size 1.27 1.27)) hide)
    )
    (property "MFR" "" (id 5) (at 288.29 95.25 0)
      (effects (font (size 1.27 1.27)) hide)
    )
    (property "MPN" "" (id 6) (at 288.29 95.25 0)
      (effects (font (size 1.27 1.27)) hide)
    )
    (property "SPR" "Digikey" (id 7) (at 288.29 95.25 0)
      (effects (font (size 1.27 1.27)) hide)
    )
    (property "SPN" "541-2979-1-ND" (id 8) (at 288.29 95.25 0)
      (effects (font (size 1.27 1.27)) hide)
    )
    (property "SPURL" "https://www.digikey.com/products/en?keywords=541-2979-1-ND" (id 9) (at 288.29 95.25 0)
      (effects (font (size 1.27 1.27)) hide)
    )
    (property "DESC" "" (id 10) (at 271.78 93.98 0)
      (effects (font (size 1.27 1.27)) hide)
    )
    (pin "1" (uuid 2c7252a5-5b22-4b58-b9e7-259d710edf52))
    (pin "2" (uuid 319f9aa8-7c27-4cd4-b5fe-4a160f570165))
  )

  (symbol (lib_id "power:VBUS") (at 69.85 142.24 0) (unit 1)
    (in_bom yes) (on_board yes)
    (uuid 9810b159-5137-42dd-a957-8d7cae99dbf3)
    (property "Reference" "#PWR0345" (id 0) (at 69.85 146.05 0)
      (effects (font (size 1.27 1.27)) hide)
    )
    (property "Value" "VBUS" (id 1) (at 70.231 137.8458 0))
    (property "Footprint" "" (id 2) (at 69.85 142.24 0)
      (effects (font (size 1.27 1.27)) hide)
    )
    (property "Datasheet" "" (id 3) (at 69.85 142.24 0)
      (effects (font (size 1.27 1.27)) hide)
    )
    (pin "1" (uuid 26584f17-27b1-49f0-b7e2-0040a79ceac7))
  )

  (symbol (lib_id "Device:C") (at 58.42 74.93 0) (unit 1)
    (in_bom yes) (on_board yes)
    (uuid 9c780d9c-e08c-4681-b5f7-af3112243c27)
    (property "Reference" "C303" (id 0) (at 59.69 72.39 0)
      (effects (font (size 1.27 1.27)) (justify left))
    )
    (property "Value" "0.1uF" (id 1) (at 59.69 77.47 0)
      (effects (font (size 1.27 1.27)) (justify left))
    )
    (property "Footprint" "Capacitor_SMD:C_0402_1005Metric" (id 2) (at 59.3852 78.74 0)
      (effects (font (size 1.27 1.27)) hide)
    )
    (property "Datasheet" "" (id 3) (at 58.42 74.93 0)
      (effects (font (size 1.27 1.27)) hide)
    )
    (property "SPR" "Digikey" (id 6) (at 58.42 74.93 0)
      (effects (font (size 1.27 1.27)) hide)
    )
    (property "DESC" "" (id 9) (at -27.94 140.97 0)
      (effects (font (size 1.27 1.27)) hide)
    )
    (pin "1" (uuid 42e01be6-7048-4a75-8a9e-69f4592276d3))
    (pin "2" (uuid b1d0f807-170f-402e-b7a8-4258a73187c1))
  )

  (symbol (lib_id "Switch:SW_Push") (at 36.83 76.2 90) (unit 1)
    (in_bom yes) (on_board yes) (fields_autoplaced)
    (uuid 9eaa1dfa-3678-496a-8f88-2c0562040983)
    (property "Reference" "SW302" (id 0) (at 38.1 74.9299 90)
      (effects (font (size 1.27 1.27)) (justify right))
    )
    (property "Value" "KMR2" (id 1) (at 38.1 77.4699 90)
      (effects (font (size 1.27 1.27)) (justify right))
    )
    (property "Footprint" "Button_Switch_SMD:SW_Push_1P1T_NO_CK_KMR2" (id 2) (at 31.75 76.2 0)
      (effects (font (size 1.27 1.27)) hide)
    )
    (property "Datasheet" "~" (id 3) (at 31.75 76.2 0)
      (effects (font (size 1.27 1.27)) hide)
    )
    (pin "1" (uuid 11543f3f-d7dc-4e50-9864-df9fe481e020))
    (pin "2" (uuid 8adc46c7-4ef8-48e6-98d2-3fa51e28a0e0))
  )

  (symbol (lib_id "power:+3.3V") (at 215.9 63.5 0) (mirror y) (unit 1)
    (in_bom yes) (on_board yes)
    (uuid aabcb466-e8fd-4bf6-87ac-d497657b66d1)
    (property "Reference" "#PWR0341" (id 0) (at 215.9 67.31 0)
      (effects (font (size 1.27 1.27)) hide)
    )
    (property "Value" "+3.3V" (id 1) (at 215.519 59.1058 0))
    (property "Footprint" "" (id 2) (at 215.9 63.5 0)
      (effects (font (size 1.27 1.27)) hide)
    )
    (property "Datasheet" "" (id 3) (at 215.9 63.5 0)
      (effects (font (size 1.27 1.27)) hide)
    )
    (pin "1" (uuid 966b5d08-53b9-4d7f-ad62-8568c1335e3b))
  )

  (symbol (lib_id "power:GND") (at 133.35 142.24 0) (unit 1)
    (in_bom yes) (on_board yes)
    (uuid afa936c5-f413-4937-a9dd-6e748f833d53)
    (property "Reference" "#PWR0347" (id 0) (at 133.35 148.59 0)
      (effects (font (size 1.27 1.27)) hide)
    )
    (property "Value" "GND" (id 1) (at 133.477 146.6342 0))
    (property "Footprint" "" (id 2) (at 133.35 142.24 0)
      (effects (font (size 1.27 1.27)) hide)
    )
    (property "Datasheet" "" (id 3) (at 133.35 142.24 0)
      (effects (font (size 1.27 1.27)) hide)
    )
    (pin "1" (uuid afd6e4e3-728a-490a-bdeb-602d9cc998de))
  )

  (symbol (lib_id "power:GND") (at 215.9 71.12 0) (mirror y) (unit 1)
    (in_bom yes) (on_board yes)
    (uuid afb86121-caab-4be3-bd8a-f6c82f59ca9e)
    (property "Reference" "#PWR0342" (id 0) (at 215.9 77.47 0)
      (effects (font (size 1.27 1.27)) hide)
    )
    (property "Value" "GND" (id 1) (at 215.773 75.5142 0))
    (property "Footprint" "" (id 2) (at 215.9 71.12 0)
      (effects (font (size 1.27 1.27)) hide)
    )
    (property "Datasheet" "" (id 3) (at 215.9 71.12 0)
      (effects (font (size 1.27 1.27)) hide)
    )
    (pin "1" (uuid 04ec24fa-cf6c-4a80-81de-64baea270447))
  )

  (symbol (lib_id "Device:R") (at 245.11 52.07 90) (unit 1)
    (in_bom yes) (on_board yes)
    (uuid b61d024c-7e7a-4377-9666-52e6ba53f24c)
    (property "Reference" "R303" (id 0) (at 238.76 50.8 90))
    (property "Value" "10K" (id 1) (at 245.11 52.07 90))
    (property "Footprint" "Resistor_SMD:R_0402_1005Metric" (id 2) (at 245.11 53.848 90)
      (effects (font (size 1.27 1.27)) hide)
    )
    (property "Datasheet" "" (id 3) (at 245.11 52.07 0)
      (effects (font (size 1.27 1.27)) hide)
    )
    (property "Tolerance" "5%" (id 4) (at 245.11 52.07 90)
      (effects (font (size 1.27 1.27)) hide)
    )
    (property "MFR" "" (id 5) (at 288.29 78.74 0)
      (effects (font (size 1.27 1.27)) hide)
    )
    (property "MPN" "" (id 6) (at 288.29 78.74 0)
      (effects (font (size 1.27 1.27)) hide)
    )
    (property "SPR" "Digikey" (id 7) (at 288.29 78.74 0)
      (effects (font (size 1.27 1.27)) hide)
    )
    (property "SPN" "541-2979-1-ND" (id 8) (at 288.29 78.74 0)
      (effects (font (size 1.27 1.27)) hide)
    )
    (property "SPURL" "https://www.digikey.com/products/en?keywords=541-2979-1-ND" (id 9) (at 288.29 78.74 0)
      (effects (font (size 1.27 1.27)) hide)
    )
    (property "DESC" "" (id 10) (at 271.78 77.47 0)
      (effects (font (size 1.27 1.27)) hide)
    )
    (pin "1" (uuid b13f2477-db4f-4649-a1f5-166f56275c96))
    (pin "2" (uuid 751f49fc-0152-47b0-ab29-2b747c6726d5))
  )

  (symbol (lib_id "power:GND") (at 207.01 58.42 0) (mirror y) (unit 1)
    (in_bom yes) (on_board yes)
    (uuid b86d60a8-f16a-449e-b34c-c946fcf52f40)
    (property "Reference" "#PWR0339" (id 0) (at 207.01 64.77 0)
      (effects (font (size 1.27 1.27)) hide)
    )
    (property "Value" "GND" (id 1) (at 210.82 60.96 0))
    (property "Footprint" "" (id 2) (at 207.01 58.42 0)
      (effects (font (size 1.27 1.27)) hide)
    )
    (property "Datasheet" "" (id 3) (at 207.01 58.42 0)
      (effects (font (size 1.27 1.27)) hide)
    )
    (pin "1" (uuid 8e092305-d1c9-4cd3-b0c6-64477d774b6f))
  )

  (symbol (lib_id "Device:C") (at 92.71 146.05 0) (unit 1)
    (in_bom yes) (on_board yes)
    (uuid c035ec2f-db82-42a5-b124-82b70fc83bca)
    (property "Reference" "C302" (id 0) (at 93.98 143.51 0)
      (effects (font (size 1.27 1.27)) (justify left))
    )
    (property "Value" "0.1uF" (id 1) (at 93.98 148.59 0)
      (effects (font (size 1.27 1.27)) (justify left))
    )
    (property "Footprint" "Capacitor_SMD:C_0402_1005Metric" (id 2) (at 93.6752 149.86 0)
      (effects (font (size 1.27 1.27)) hide)
    )
    (property "Datasheet" "" (id 3) (at 92.71 146.05 0)
      (effects (font (size 1.27 1.27)) hide)
    )
    (property "MFR" "" (id 4) (at 16.51 217.17 0)
      (effects (font (size 1.27 1.27)) hide)
    )
    (property "MPN" "" (id 5) (at 16.51 217.17 0)
      (effects (font (size 1.27 1.27)) hide)
    )
    (property "SPR" "Digikey" (id 6) (at 16.51 217.17 0)
      (effects (font (size 1.27 1.27)) hide)
    )
    (property "SPN" "" (id 7) (at 16.51 217.17 0)
      (effects (font (size 1.27 1.27)) hide)
    )
    (property "SPURL" "" (id 8) (at 16.51 217.17 0)
      (effects (font (size 1.27 1.27)) hide)
    )
    (property "DESC" "" (id 9) (at 16.51 217.17 0)
      (effects (font (size 1.27 1.27)) hide)
    )
    (pin "1" (uuid 2ac72953-c0de-4bcb-9aa0-f56db40a3a1d))
    (pin "2" (uuid 0a14cbb9-a5f4-49fd-b953-71c8309bb65e))
  )

  (symbol (lib_id "Aaron:SSM2518CPZ") (at 160.02 137.16 0) (unit 1)
    (in_bom yes) (on_board yes) (fields_autoplaced)
    (uuid c09d49f2-576a-464c-a5eb-d25cc9ffbed4)
    (property "Reference" "U301" (id 0) (at 160.02 109.22 0)
      (effects (font (size 1.524 1.524)))
    )
    (property "Value" "SSM2518CPZ" (id 1) (at 160.02 113.03 0)
      (effects (font (size 1.524 1.524)))
    )
    (property "Footprint" "Package_CSP:LFCSP-20-1EP_4x4mm_P0.5mm_EP2.6x2.6mm" (id 2) (at 160.02 113.665 0)
      (effects (font (size 1.524 1.524)) hide)
    )
    (property "Datasheet" "https://www.analog.com/media/en/technical-documentation/data-sheets/SSM2518.pdf" (id 3) (at 149.86 105.41 0)
      (effects (font (size 1.524 1.524)) hide)
    )
    (pin "1" (uuid 3e5a2a77-efd1-4131-b5fa-c81fec4b7557))
    (pin "10" (uuid 842696ed-c40c-47c5-8acf-30f08f60a2e3))
    (pin "11" (uuid 01e5ffa3-873a-49df-a06c-e2ac1133eada))
    (pin "12" (uuid c12b0be7-8fb7-41d6-bf93-abc1451014c3))
    (pin "13" (uuid 5d70945e-79ff-47a3-b348-940c53a2bb9e))
    (pin "14" (uuid d8798127-c606-4ee5-b9db-cfaa403e3ac9))
    (pin "15" (uuid 1ba5e8fc-cda9-4a85-b344-7c956c077481))
    (pin "16" (uuid 306afb74-0638-4087-a626-e7b6a7cf5c23))
    (pin "17" (uuid 72e60f47-68eb-4c51-8f2a-6529b690a10f))
    (pin "18" (uuid 684075e4-12d5-4914-bf97-9bbcbb53c331))
    (pin "19" (uuid 80e45b8a-d2a5-48ea-9254-282fb621fdd9))
    (pin "2" (uuid 3b1032df-3070-4059-b570-21faea7230e3))
    (pin "20" (uuid 8df7e0c1-4a85-4a8b-a26c-854718d0def2))
    (pin "21" (uuid ac528f93-16da-4f33-86cd-eba29551809d))
    (pin "3" (uuid 3a6e0f6a-3a84-4362-a81a-230d2830b274))
    (pin "4" (uuid bb4ff2f9-1ed5-4812-84cc-49d5e0d796f9))
    (pin "5" (uuid a340cf1b-d0d7-4118-86e6-d4d852557595))
    (pin "6" (uuid 360291ee-22b0-4a0e-b15d-246631b51ce5))
    (pin "7" (uuid 14a22ed7-ab63-4e6e-8f93-8d1933dd97ee))
    (pin "8" (uuid 7f0a904e-1ad8-4990-adcf-624cb95108d6))
    (pin "9" (uuid 2d9fb659-5f44-449a-aef1-a8ed4f494988))
  )

  (symbol (lib_id "power:+3.3V") (at 125.73 149.86 0) (unit 1)
    (in_bom yes) (on_board yes)
    (uuid c6a88092-64d7-422c-a9c9-2777c37c427b)
    (property "Reference" "#PWR0349" (id 0) (at 125.73 153.67 0)
      (effects (font (size 1.27 1.27)) hide)
    )
    (property "Value" "+3.3V" (id 1) (at 126.111 145.4658 0))
    (property "Footprint" "" (id 2) (at 125.73 149.86 0)
      (effects (font (size 1.27 1.27)) hide)
    )
    (property "Datasheet" "" (id 3) (at 125.73 149.86 0)
      (effects (font (size 1.27 1.27)) hide)
    )
    (pin "1" (uuid 492851ae-7957-4af7-b2f9-21b0630cafd2))
  )

  (symbol (lib_id "power:VBUS") (at 119.38 149.86 0) (unit 1)
    (in_bom yes) (on_board yes)
    (uuid c71e9078-1732-428d-afc7-e3cf8128ce0b)
    (property "Reference" "#PWR0348" (id 0) (at 119.38 153.67 0)
      (effects (font (size 1.27 1.27)) hide)
    )
    (property "Value" "VBUS" (id 1) (at 119.761 145.4658 0))
    (property "Footprint" "" (id 2) (at 119.38 149.86 0)
      (effects (font (size 1.27 1.27)) hide)
    )
    (property "Datasheet" "" (id 3) (at 119.38 149.86 0)
      (effects (font (size 1.27 1.27)) hide)
    )
    (pin "1" (uuid 9984e0ba-26eb-4da8-bcbc-23a1df98bc8f))
  )

  (symbol (lib_id "power:GND") (at 137.16 157.48 0) (unit 1)
    (in_bom yes) (on_board yes)
    (uuid cb869037-2586-42a2-954f-301b3829afdd)
    (property "Reference" "#PWR0351" (id 0) (at 137.16 163.83 0)
      (effects (font (size 1.27 1.27)) hide)
    )
    (property "Value" "GND" (id 1) (at 137.287 161.8742 0))
    (property "Footprint" "" (id 2) (at 137.16 157.48 0)
      (effects (font (size 1.27 1.27)) hide)
    )
    (property "Datasheet" "" (id 3) (at 137.16 157.48 0)
      (effects (font (size 1.27 1.27)) hide)
    )
    (pin "1" (uuid afa731f0-e59a-4830-9393-e886402565ac))
  )

  (symbol (lib_id "Device:C") (at 215.9 67.31 0) (mirror y) (unit 1)
    (in_bom yes) (on_board yes)
    (uuid d0702cbf-0620-4809-8448-c9f4c6275ffa)
    (property "Reference" "C315" (id 0) (at 220.98 64.77 0)
      (effects (font (size 1.27 1.27)) (justify left))
    )
    (property "Value" "1uF" (id 1) (at 219.71 69.85 0)
      (effects (font (size 1.27 1.27)) (justify left))
    )
    (property "Footprint" "Capacitor_SMD:C_0402_1005Metric" (id 2) (at 214.9348 71.12 0)
      (effects (font (size 1.27 1.27)) hide)
    )
    (property "Datasheet" "" (id 3) (at 215.9 67.31 0)
      (effects (font (size 1.27 1.27)) hide)
    )
    (property "MFR" "" (id 4) (at 252.73 199.39 0)
      (effects (font (size 1.27 1.27)) hide)
    )
    (property "MPN" "" (id 5) (at 252.73 199.39 0)
      (effects (font (size 1.27 1.27)) hide)
    )
    (property "SPR" "Digikey" (id 6) (at 252.73 199.39 0)
      (effects (font (size 1.27 1.27)) hide)
    )
    (property "SPN" "" (id 7) (at 252.73 199.39 0)
      (effects (font (size 1.27 1.27)) hide)
    )
    (property "SPURL" "" (id 8) (at 252.73 199.39 0)
      (effects (font (size 1.27 1.27)) hide)
    )
    (property "DESC" "" (id 9) (at 252.73 171.45 0)
      (effects (font (size 1.27 1.27)) hide)
    )
    (pin "1" (uuid 8fec7abc-cd89-43de-8755-e64e35196d45))
    (pin "2" (uuid 5e4cabe3-63ad-4b13-9445-8d91f6a44e98))
  )

  (symbol (lib_id "power:GND") (at 133.35 48.26 0) (unit 1)
    (in_bom yes) (on_board yes)
    (uuid d0e273aa-6007-4b3d-8553-dfd1dd8becd5)
    (property "Reference" "#PWR0338" (id 0) (at 133.35 54.61 0)
      (effects (font (size 1.27 1.27)) hide)
    )
    (property "Value" "GND" (id 1) (at 133.477 52.6542 0))
    (property "Footprint" "" (id 2) (at 133.35 48.26 0)
      (effects (font (size 1.27 1.27)) hide)
    )
    (property "Datasheet" "" (id 3) (at 133.35 48.26 0)
      (effects (font (size 1.27 1.27)) hide)
    )
    (pin "1" (uuid 381fe504-bce7-420f-8122-04357ef9b03f))
  )

  (symbol (lib_id "power:GND") (at 92.71 149.86 0) (unit 1)
    (in_bom yes) (on_board yes)
    (uuid d8a9b4aa-ebb2-4006-b934-aa800d5bee6c)
    (property "Reference" "#PWR0346" (id 0) (at 92.71 156.21 0)
      (effects (font (size 1.27 1.27)) hide)
    )
    (property "Value" "GND" (id 1) (at 92.837 154.2542 0))
    (property "Footprint" "" (id 2) (at 92.71 149.86 0)
      (effects (font (size 1.27 1.27)) hide)
    )
    (property "Datasheet" "" (id 3) (at 92.71 149.86 0)
      (effects (font (size 1.27 1.27)) hide)
    )
    (pin "1" (uuid d24578e2-5cd9-4848-9664-41d01bb3906e))
  )

  (symbol (lib_id "Device:C") (at 110.49 156.21 0) (unit 1)
    (in_bom yes) (on_board yes)
    (uuid dbcac0c3-fa44-4f84-99b8-710c526bd794)
    (property "Reference" "C319" (id 0) (at 104.14 153.67 0)
      (effects (font (size 1.27 1.27)) (justify left))
    )
    (property "Value" "0.1uF" (id 1) (at 105.41 158.75 0)
      (effects (font (size 1.27 1.27)) (justify left))
    )
    (property "Footprint" "Capacitor_SMD:C_0402_1005Metric" (id 2) (at 111.4552 160.02 0)
      (effects (font (size 1.27 1.27)) hide)
    )
    (property "Datasheet" "" (id 3) (at 110.49 156.21 0)
      (effects (font (size 1.27 1.27)) hide)
    )
    (property "MFR" "" (id 4) (at 34.29 227.33 0)
      (effects (font (size 1.27 1.27)) hide)
    )
    (property "MPN" "" (id 5) (at 34.29 227.33 0)
      (effects (font (size 1.27 1.27)) hide)
    )
    (property "SPR" "Digikey" (id 6) (at 34.29 227.33 0)
      (effects (font (size 1.27 1.27)) hide)
    )
    (property "SPN" "" (id 7) (at 34.29 227.33 0)
      (effects (font (size 1.27 1.27)) hide)
    )
    (property "SPURL" "" (id 8) (at 34.29 227.33 0)
      (effects (font (size 1.27 1.27)) hide)
    )
    (property "DESC" "" (id 9) (at 34.29 227.33 0)
      (effects (font (size 1.27 1.27)) hide)
    )
    (pin "1" (uuid 5d1ddf95-14db-4649-be58-60f19fb0aacd))
    (pin "2" (uuid 0e421def-aa8a-4145-9bd5-6d0b5c7c409a))
  )

  (symbol (lib_id "led-controller-wrover32-rescue:Micro_SD_Card-Connector") (at 160.02 63.5 180) (unit 1)
    (in_bom yes) (on_board yes)
    (uuid e583ee32-875c-41ea-afbe-ab843839b71d)
    (property "Reference" "J303" (id 0) (at 161.29 42.7482 0))
    (property "Value" "Micro_SD_Card" (id 1) (at 161.29 45.0596 0))
    (property "Footprint" "Connector_Card:microSD_HC_Molex_047571-0001" (id 2) (at 130.81 71.12 0)
      (effects (font (size 1.27 1.27)) hide)
    )
    (property "Datasheet" "" (id 3) (at 160.02 63.5 0)
      (effects (font (size 1.27 1.27)) hide)
    )
    (property "MFR" "Wuerth" (id 4) (at 200.66 -107.95 0)
      (effects (font (size 1.27 1.27)) hide)
    )
    (property "MPN" "693072010801" (id 5) (at 200.66 -107.95 0)
      (effects (font (size 1.27 1.27)) hide)
    )
    (property "SPR" "Digikey" (id 6) (at 200.66 -107.95 0)
      (effects (font (size 1.27 1.27)) hide)
    )
    (property "SPN" "732-3820-1-ND" (id 7) (at 200.66 -107.95 0)
      (effects (font (size 1.27 1.27)) hide)
    )
    (property "SPURL" "https://www.digikey.com/product-detail/en/w-rth-elektronik/693072010801/732-3820-1-ND/3124605" (id 8) (at 200.66 -107.95 0)
      (effects (font (size 1.27 1.27)) hide)
    )
    (property "DESC" "CONN MICRO SD CARD HINGED TYPE" (id 9) (at 200.66 -81.28 0)
      (effects (font (size 1.27 1.27)) hide)
    )
    (pin "1" (uuid 49852ab2-2885-4910-91d2-5897b35c94a2))
    (pin "2" (uuid 1fcc5dcc-3b19-4a75-8731-6c1e800f0fd1))
    (pin "3" (uuid 53758ceb-f852-4191-b2d6-3e605139d43d))
    (pin "4" (uuid fca5b684-a3f5-47f0-8b5e-749b9a748859))
    (pin "5" (uuid bc7a4a1a-7f42-41d9-bf50-dd82b1a1b3b2))
    (pin "6" (uuid 40229cfd-7d9c-4f10-8560-d83d3fb03775))
    (pin "7" (uuid 2139f9d3-7ea5-43bd-902b-8701d66baeae))
    (pin "8" (uuid 9b6c8d91-15fa-43d8-bead-e8630f91f167))
    (pin "9" (uuid b8e905aa-e50f-41c9-a484-d6ef7d5dd7c3))
  )

  (symbol (lib_id "power:+3.3V") (at 137.16 101.6 0) (unit 1)
    (in_bom yes) (on_board yes)
    (uuid e6694af4-b3f8-42bd-989d-a02971bedab2)
    (property "Reference" "#PWR0135" (id 0) (at 137.16 105.41 0)
      (effects (font (size 1.27 1.27)) hide)
    )
    (property "Value" "+3.3V" (id 1) (at 137.541 97.2058 0))
    (property "Footprint" "" (id 2) (at 137.16 101.6 0)
      (effects (font (size 1.27 1.27)) hide)
    )
    (property "Datasheet" "" (id 3) (at 137.16 101.6 0)
      (effects (font (size 1.27 1.27)) hide)
    )
    (pin "1" (uuid e3566474-8145-4b3e-a32d-45005113cdd0))
  )

  (symbol (lib_id "power:+3.3V") (at 110.49 152.4 0) (unit 1)
    (in_bom yes) (on_board yes)
    (uuid f4bd3113-eaad-45a1-ad5a-792fda0ac47b)
    (property "Reference" "#PWR0350" (id 0) (at 110.49 156.21 0)
      (effects (font (size 1.27 1.27)) hide)
    )
    (property "Value" "+3.3V" (id 1) (at 110.871 148.0058 0))
    (property "Footprint" "" (id 2) (at 110.49 152.4 0)
      (effects (font (size 1.27 1.27)) hide)
    )
    (property "Datasheet" "" (id 3) (at 110.49 152.4 0)
      (effects (font (size 1.27 1.27)) hide)
    )
    (pin "1" (uuid 40db914c-395a-4e0c-8864-254a4b77f0ca))
  )
)
