C:\EjerciciosWebAaron\ServerAplication\ToDoList\src\main\java\com\softtek\academy\controller\ControllerServlet.java
C:\EjerciciosWebAaron\ServerAplication\ToDoList\src\main\java\com\softtek\academy\model\BeanModel.java
C:\EjerciciosWebAaron\ServerAplication\ToDoList\src\main\java\com\softtek\academy\views\DaoViews.java
C:\EjerciciosWebAaron\ServerAplication\ToDoList\src\main\java\com\softtek\academy\views\AddDao.java
C:\EjerciciosWebAaron\ServerAplication\ToDoList\src\main\java\com\softtek\academy\controller\AddController.java
C:\EjerciciosWebAaron\ServerAplication\ToDoList\src\main\java\com\softtek\academy\views\Conexion.java
