C:\EjerciciosWebAaron\ServerAplication\AaronParcial2\src\main\java\com\softtek\academy\controller\ControllerDone.java
C:\EjerciciosWebAaron\ServerAplication\AaronParcial2\src\main\java\com\softtek\academy\controller\ControllerServlet.java
C:\EjerciciosWebAaron\ServerAplication\AaronParcial2\src\main\java\com\softtek\academy\views\UpdDao.java
C:\EjerciciosWebAaron\ServerAplication\AaronParcial2\src\main\java\com\softtek\academy\views\DaoViews.java
C:\EjerciciosWebAaron\ServerAplication\AaronParcial2\src\main\java\com\softtek\academy\controller\UpdateController.java
C:\EjerciciosWebAaron\ServerAplication\AaronParcial2\src\main\java\com\softtek\academy\model\BeanModel.java
C:\EjerciciosWebAaron\ServerAplication\AaronParcial2\src\main\java\com\softtek\academy\views\Conexion.java
C:\EjerciciosWebAaron\ServerAplication\AaronParcial2\src\main\java\com\softtek\academy\views\AddDao.java
C:\EjerciciosWebAaron\ServerAplication\AaronParcial2\src\main\java\com\softtek\academy\views\DaoDone.java
C:\EjerciciosWebAaron\ServerAplication\AaronParcial2\src\main\java\com\softtek\academy\controller\AddController.java
