{
	"info": {
		"_postman_id": "b59d2292-e6ea-4f4b-8aba-af7492acfa75",
		"name": "Finxact - Transaction with Image",
		"schema": "https://schema.getpostman.com/json/collection/v2.1.0/collection.json"
	},
	"item": [
		{
			"name": "account group",
			"request": {
				"method": "GET",
				"header": [
					{
						"key": "client_id",
						"value": "{{.API_ClientId}}"
					},
					{
						"key": "secret",
						"value": "{{.API_ClientSecret}}"
					},
					{
						"key": "Content-Type",
						"value": "application/json"
					},
					{
						"key": "Fnx-Header",
						"value": "{\"identity\":{\"userRoles\":[\"developer\"]}}"
					}
				],
				"url": {
					"raw": "{{.path_root}}/model/v1/acctGroup/1",
					"host": [
						"{{.path_root}}"
					],
					"path": [
						"model",
						"v1",
						"acctGroup",
						"1"
					]
				}
			},
			"response": []
		},
		{
			"name": "Get Customer - only returns party_person Copy",
			"request": {
				"method": "GET",
				"header": [
					{
						"key": "client_id",
						"value": "{{.API_ClientId}}"
					},
					{
						"key": "secret",
						"value": "{{.API_ClientSecret}}"
					},
					{
						"key": "Content-Type",
						"value": "application/json"
					},
					{
						"key": "Fnx-Header",
						"value": "{\"identity\":{\"userRoles\":[\"developer\"]}}"
					}
				],
				"url": {
					"raw": "{{.path_root}}/core/v1/customer?customerId=1038809&customerGroup=2",
					"host": [
						"{{.path_root}}"
					],
					"path": [
						"core",
						"v1",
						"customer"
					],
					"query": [
						{
							"key": "customerId",
							"value": "1038809"
						},
						{
							"key": "customerGroup",
							"value": "2"
						}
					]
				}
			},
			"response": []
		},
		{
			"name": "Create Account",
			"request": {
				"method": "POST",
				"header": [
					{
						"key": "client_id",
						"value": "{{.API_ClientId}}"
					},
					{
						"key": "secret",
						"value": "{{.API_ClientSecret}}"
					},
					{
						"key": "Content-Type",
						"value": "application/json"
					},
					{
						"key": "Fnx-Header",
						"value": "{\"identity\":{\"userRoles\":[\"developer\"]}}"
					}
				],
				"body": {
					"mode": "raw",
					"raw": "{\n    \"prodName\": \"P2001\",\n    \"acct_bk\": {\n        \"acctNbr\": \"101123669001\",\n        \"name\": \"Savings Account\",\n        \"acctGroup\": 1,\n        \"acctTitle\": \"Mike Fakey Test Account 1\",\n        \"isBrokered\": false,\n        \"tmZoneCode\": \"usnyc\"\n    },\n    \"posn_depDtl\": [\n        {\n            \"posn_dep\": {\n                \"ccyCode\": \"USD\",\n                \"acctgSeg\": {\n                    \"deptId\": \"350\",\n                    \"vertical\": \"01\"\n                }\n            }\n        }\n    ]\n}"
				},
				"url": {
					"raw": "{{.path_root}}/core/v1/acct_bk",
					"host": [
						"{{.path_root}}"
					],
					"path": [
						"core",
						"v1",
						"acct_bk"
					]
				}
			},
			"response": []
		},
		{
			"name": "Get Account (101123669001)",
			"protocolProfileBehavior": {
				"disableBodyPruning": true
			},
			"request": {
				"method": "GET",
				"header": [
					{
						"key": "client_id",
						"value": "{{.API_ClientId}}"
					},
					{
						"key": "secret",
						"value": "{{.API_ClientSecret}}"
					},
					{
						"key": "Content-Type",
						"value": "application/json"
					},
					{
						"key": "Fnx-Header",
						"value": "{\"identity\":{\"userRoles\":[\"developer\"]}}"
					}
				],
				"body": {
					"mode": "raw",
					"raw": "{\n    \"prodName\": \"P2001\",\n    \"acct_bk\": {\n        \"acctNbr\": \"101123669001\",\n        \"name\": \"Savings Account\",\n        \"acctGroup\": 1,\n        \"acctTitle\": \"Mike Fakey Test Account 2\",\n        \"isBrokered\": false,\n        \"tmZoneCode\": \"usnyc\"\n    },\n    \"posn_depDtl\": [\n        {\n            \"posn_dep\": {\n                \"ccyCode\": \"USD\",\n                \"acctgSeg\": {\n                    \"deptId\": \"350\",\n                    \"vertical\": \"01\"\n                }\n            }\n        }\n    ]\n}"
				},
				"url": {
					"raw": "{{.path_root}}/core/v1/acct_bk/1/101123669001",
					"host": [
						"{{.path_root}}"
					],
					"path": [
						"core",
						"v1",
						"acct_bk",
						"1",
						"101123669001"
					]
				}
			},
			"response": []
		},
		{
			"name": "link account",
			"protocolProfileBehavior": {
				"disableBodyPruning": true
			},
			"request": {
				"method": "GET",
				"header": [
					{
						"key": "client_id",
						"value": "{{.API_ClientId}}"
					},
					{
						"key": "secret",
						"value": "{{.API_ClientSecret}}"
					},
					{
						"key": "Content-Type",
						"value": "application/json"
					},
					{
						"key": "Fnx-Header",
						"value": "{\"identity\":{\"userRoles\":[\"developer\"]}}"
					}
				],
				"body": {
					"mode": "raw",
					"raw": "{\n    \"customer\": {\n        \"customerGroup\": \"2\",\n        \"customerId\": \"2e4ea835-9299-4b2d-9a7f-3b43a63014e0\"\n    },\n    \"existingAccounts\" : [\n    \t{\n    \t\t\"acct\": {\n\t\t\t\t\"acctNbr\": \"402672290040\"\n    \t\t},\n    \t\t\"acctPartyRel\": {\n    \t\t\t\"relType\": \"1\",\n                \"isAuthSigner\": true\n    \t\t}\n    \t}\n    ]\n}"
				},
				"url": {
					"raw": "{{.path_root}}/model/v1/acctGroup/1",
					"host": [
						"{{.path_root}}"
					],
					"path": [
						"model",
						"v1",
						"acctGroup",
						"1"
					]
				}
			},
			"response": []
		},
		{
			"name": "acctPartyRel",
			"request": {
				"method": "GET",
				"header": [
					{
						"key": "client_id",
						"value": "{{.API_ClientId}}"
					},
					{
						"key": "secret",
						"value": "{{.API_ClientSecret}}"
					},
					{
						"key": "Content-Type",
						"value": "application/json"
					},
					{
						"key": "Fnx-Header",
						"value": "{\"identity\":{\"userRoles\":[\"developer\"]}}"
					}
				],
				"url": {
					"raw": "{{.path_root}}/model/v1/acctPartyRel?filter.q=isAuthSigner=true",
					"host": [
						"{{.path_root}}"
					],
					"path": [
						"model",
						"v1",
						"acctPartyRel"
					],
					"query": [
						{
							"key": "filter.q",
							"value": "isAuthSigner=true"
						}
					]
				}
			},
			"response": []
		},
		{
			"name": "Upload X9 File",
			"event": [
				{
					"listen": "prerequest",
					"script": {
						"exec": [
							"var data = pm.request.body.toJSON();",
							"var file = data.formdata[0].src;",
							"var values = file.split(\"\\\\\");",
							"if (values.length === 0) {",
							"    values = file.values(\"/\");",
							"}",
							"",
							"var fileName = values[values.length - 1];",
							"postman.setEnvironmentVariable(\".fileName\", fileName);"
						],
						"type": "text/javascript"
					}
				}
			],
			"request": {
				"method": "POST",
				"header": [
					{
						"key": "client_id",
						"value": "{{.API_ClientId}}",
						"type": "text"
					},
					{
						"key": "secret",
						"value": "{{.API_ClientSecret}}",
						"type": "text"
					},
					{
						"key": "Fnx-Header",
						"value": "{\"identity\":{\"userRoles\":[\"developer\"]}}",
						"type": "text"
					},
					{
						"key": "Content-Type",
						"name": "Content-Type",
						"value": "application/x-www-form-urlencoded",
						"type": "text"
					}
				],
				"body": {
					"mode": "formdata",
					"formdata": [
						{
							"key": "file",
							"type": "file",
							"src": "/Users/mikefinger/Documents/sandbox/ebcdic/402128429448.X937"
						}
					]
				},
				"url": {
					"raw": "{{.path_root}}/core/v1/file/check/in",
					"host": [
						"{{.path_root}}"
					],
					"path": [
						"core",
						"v1",
						"file",
						"check",
						"in"
					]
				}
			},
			"response": []
		},
		{
			"name": "Process X9 Credit file",
			"request": {
				"method": "POST",
				"header": [
					{
						"key": "client_id",
						"value": "{{.API_ClientId}}"
					},
					{
						"key": "secret",
						"value": "{{.API_ClientSecret}}"
					},
					{
						"key": "Content-Type",
						"value": "application/json"
					},
					{
						"key": "Fnx-Header",
						"value": "{\"identity\":{\"userRoles\":[\"developer\"]}}"
					}
				],
				"body": {
					"mode": "raw",
					"raw": "{\n\t\"fileName\": \"MCD202103080805.X937\",\n\t\"isCr\": true,\n   \"runDtm\": \"2022-11-16T04:05:05.212Z\"\n}"
				},
				"url": {
					"raw": "{{.path_root}}/core/v1/check/processFile",
					"host": [
						"{{.path_root}}"
					],
					"path": [
						"core",
						"v1",
						"check",
						"processFile"
					]
				}
			},
			"response": []
		},
		{
			"name": "trn",
			"request": {
				"method": "GET",
				"header": [
					{
						"key": "client_id",
						"value": "{{.API_ClientId}}"
					},
					{
						"key": "secret",
						"value": "{{.API_ClientSecret}}"
					},
					{
						"key": "Content-Type",
						"value": "application/json"
					},
					{
						"key": "Fnx-Header",
						"value": "{\"identity\":{\"userRoles\":[\"developer\"]}}"
					}
				],
				"url": {
					"raw": "{{.path_root}}/model/v1/trn?filter.q=entries.acctGroup=1 and entries.posnAcctNbr=402128429448",
					"host": [
						"{{.path_root}}"
					],
					"path": [
						"model",
						"v1",
						"trn"
					],
					"query": [
						{
							"key": "filter.q",
							"value": "entries.acctGroup=1 and entries.posnAcctNbr=402128429448"
						}
					]
				}
			},
			"response": []
		},
		{
			"name": "Get Image",
			"protocolProfileBehavior": {
				"disableBodyPruning": true
			},
			"request": {
				"method": "GET",
				"header": [
					{
						"key": "client_id",
						"value": "{{.API_ClientId}}"
					},
					{
						"key": "secret",
						"value": "{{.API_ClientSecret}}"
					},
					{
						"key": "Content-Type",
						"value": "application/json"
					},
					{
						"key": "Fnx-Header",
						"value": "{\"identity\":{\"userRoles\":[\"developer\"]}}"
					},
					{
						"key": "ResponseType",
						"value": "blob",
						"type": "default"
					}
				],
				"body": {
					"mode": "raw",
					"raw": "{\n\t\"fileName\": \"MCD202103080805.X937\",\n\t\"isCr\": true,\n   \"runDtm\": \"2022-11-16T04:05:05.212Z\"\n}"
				},
				"url": {
					"raw": "{{.path_root}}/core/v1/file/download/check/images/checks/4mUiw2jlIQqLiV----uF----_1_rear.tif",
					"host": [
						"{{.path_root}}"
					],
					"path": [
						"core",
						"v1",
						"file",
						"download",
						"check",
						"images",
						"checks",
						"4mUiw2jlIQqLiV----uF----_1_rear.tif"
					]
				}
			},
			"response": []
		}
	]
}