1 10 20
100 200 125
201 210 89
900 1000 174
1000 2000 182
2000 3000 217
4000 8000 262
9000 135258 354
1 1 1
1000000 568456 525
123558 554158 470
102151 223215 386
25 15625 276
15355 12014 276
156 1524 182
152655 12 375
150 253 128
158 135 117
2351 12356 268
15256 263 276
64 845 171
48653 548684 470
845868 84654 525
456835 45875 449
1 25625 282
153547 48563 375
999999 888888 507
15354 56748 340
54351 12348 340
441531 45341 449
5 48 112
153 115353 354
15354 88455 351
45354 11235 324
5478 45635 324
4535 15351 276
4864 4865 47
56456 45641 340
35451 15315 311
843152 265 525
153 153 37
1513 15315 276
486453 15315 449
48645 55841 340
484656 300114 449
13514 1548 276
665 442 145
1354 11524 268
8468 153185 375
8978 418563 449
6548 48534 324
7864 4834 262
156515 48364 383
156548 1534 383
554848 4864 470
996584 456874 525
7748 153 262
55215 153 340
663254 456 509
11548 486 268
663 475 145
2251 418564 449
33256 486521 449
115256 4153 354
55454 8651 340
12541 6523 268
22154 65 279
22586 6854 279
669966 69585 509
558 65874 340
665 51214 324
98 15315 276
6 321 131
5 1425 182
48 2415 183
556 8457 262
87754 96586 333
5468 54854 340
58487 6584 340
484 5482 238
1235 5482 238
48435 54851 340
4534 325821 443
4864 6485 262
7864 4511 262
135348 541145 470
45643 54844 340
438463 54841 449
11534 541524 470
415314 1154 449
5435 1 238
45848 15 324
7186 1234 262
775555 4545 509
54354 4848 340
153415 7868 375
41511 864846 525
11253 845684 525
41451 96548 351
15135 846846 525
