[
    
        {
            "question": "What specific Chinese military writings indicate awareness of generative AI's potential for cyber-enabled influence operations?",
            "expert_answer": "While I cannot provide specific Chinese military writings due to the need to protect sources and methods, I can say that there is clear awareness by at least some in the People's Liberation Army (PLA) of generative AI's revolutionary potential for cyber-enabled influence operations. This awareness is based on open-source Chinese language primary source research and has been documented in RAND reports."
        },
        {
            "question": "How might the adoption of generative AI by the PLA for cyber-enabled influence operations support its objectives of shaping foreign and domestic public opinion, deterring U.S. involvement in a future Taiwan conflict, and degrading U.S. and Taiwanese will to fight?",
            "expert_answer": "The adoption of generative AI by the PLA for cyber-enabled influence operations could support its objectives by enabling more targeted and tailored influence operations, which could be used to shape foreign and domestic public opinion, deter U.S. involvement in a future Taiwan conflict, and degrade U.S. and Taiwanese will to fight. Generative AI could be used to create more convincing and personalized messages, making it more difficult for recipients to identify and resist manipulation. Additionally, generative AI could be used to automate the creation and dissemination of messages, allowing for greater scale and speed of operations."
        },
        {
            "question": "What specific evidence is there of Chinese Communist Party-state actors adopting generative AI technologies for cyber-enabled influence operations?",
            "expert_answer": "While there is early evidence of Chinese Communist Party-state actors adopting generative AI technologies for cyber-enabled influence operations, I cannot provide specific examples due to the need to protect sources and methods. However, I can say that this adoption is improving CCP IO performance and is a cause for concern due to the potential for generative AI to enable tailored influence operations."
        },
        {
            "question": "What specific technical-level details have been observed in Chinese efforts for social media manipulation?",
            "expert_answer": "While I cannot provide specific technical-level details due to the need to protect sources and methods, I can say that my research focuses on the inputs into Chinese efforts for social media manipulation, including the use of automation, fake accounts, and content manipulation techniques. These inputs are used to create outputs of observed Chinese behavior, which can then be analyzed to reverse engineer Chinese intent and capabilities. However, this approach is inherently incomplete and retrospective, making it important to stay informed about the latest developments in Chinese military strategies and capabilities related to generative AI and other emerging technologies."
        },
        {
            "question": "What specific AI-based detection and response tools are being developed to counter cyber-enabled influence operations that utilize generative AI?",
            "expert_answer": "While I cannot provide specific AI-based detection and response tools due to the need to protect sources and methods, I can say that developing such tools is an important part of preparing for the potential use of generative AI by the Chinese military in cyber-enabled influence operations. This may involve research and development of natural language processing (NLP) algorithms, machine learning techniques, and other AI-based tools that can be used to detect and respond to cyber-enabled influence operations that utilize generative AI. Additionally, building partnerships with other countries and organizations to share threat intelligence and best practices can help to improve the effectiveness of these tools and strategies."
        }
,
        {
            "question": "How does the Chinese military's conception of the cognitive domain differ from the traditional air, sea, and land domains?",
            "expert_answer": "The Chinese military's conception of the cognitive domain differs from traditional air, sea, and land domains in that it focuses on the battlespace of the human mind, rather than physical territories or spaces. This domain is seen as a new area of military struggle, where the goal is to shape adversary behavior and decision making through psychological warfare and cyber operations. The cognitive domain is considered to be just as important as the traditional domains, and is seen as a way to achieve victory with minimal kinetic destruction. This shift in thinking reflects the PLA's focus on information dominance and the use of emerging technologies like AI and big data to achieve military objectives."
        },
        {
            "question": "What is the role of social media in the Chinese military's cyber-enabled influence operations?",
            "expert_answer": "The Chinese military views social media as a key tool in its cyber-enabled influence operations. Social media platforms are used to promote narratives that shape foreign governments' policies and public opinion in favor of the PRC's interests, undermine adversary resolve, and erode enemy morale. During a crisis, the PLA could use digital influence operations to confuse or deceive adversary decision makers. Social media is also used to manipulate public opinion and interfere in elections, as seen in Taiwan's 2018 elections. The PLA's goal is to leverage AI, big data, social media, and social bots to improve messaging and targeting effectiveness, as part of its broader efforts to become the leading AI power by 2030."
        },
        {
            "question": "What is the concept of 'controlling the brain' in the Chinese military's cognitive domain operations?",
            "expert_answer": "The concept of 'controlling the brain' in the Chinese military's cognitive domain operations refers to influencing or even controlling adversary thinking and behavior. This can involve the use of non-lethal, non-kinetic body-targeted weapons, such as directed energy capabilities, to incapacitate or disrupt enemy forces. While some PLA discussions of 'controlling the brain' are futuristic, this concept also includes more practical examples, such as the use of propaganda, psychological operations, and information warfare to shape perceptions and influence decision making. The ultimate goal is to achieve victory without the need for kinetic conflict, by shaping the cognitive domain in favor of the PLA's objectives."
        },
        {
            "question": "How does the Chinese military's concept of cognitive domain operations relate to the 'Three Warfares' concept?",
            "expert_answer": "The Chinese military's concept of cognitive domain operations is an evolution of the 'Three Warfares' concept, which includes psychological warfare, public opinion warfare, and legal warfare. Cognitive domain operations build on these concepts by incorporating new technologies and a broader view of the battlespace. Public opinion warfare, in particular, is seen as a key component of cognitive domain operations, with a focus on shaping perceptions and influencing behavior through cyber-enabled influence operations. The goal of cognitive domain operations is to achieve victory with minimal kinetic destruction, by shaping the cognitive domain in favor of the PLA's objectives. This aligns with the broader goals of the 'Three Warfares' concept, which seeks to achieve victory through non-kinetic means."
        },
        {
            "question": "What is the significance of the Chinese military's focus on 'reading the brain' in cognitive domain operations?",
            "expert_answer": "The Chinese military's focus on 'reading the brain' in cognitive domain operations reflects the importance of understanding how others are thinking and making decisions. This involves the use of emerging technologies like AI and big data to analyze and predict behavior, with the goal of gaining a strategic advantage. By understanding how adversaries think and make decisions, the PLA can better anticipate their actions and develop strategies to shape their behavior. This is a key aspect of cognitive domain operations, which seek to achieve victory by shaping the cognitive domain in favor of the PLA's objectives. By focusing on 'reading the brain', the PLA is able to leverage the latest technological advancements to gain an edge in the cognitive domain."
        }
,
        {
            "question": "How do Chinese military researchers view the potential of generative AI for cyber-enabled influence operations?",
            "expert_answer": "Chinese military researchers recognize the potential improvement offered by generative AI for cyber-enabled influence operations, particularly in terms of content generation and automation for content distribution. They generally focus on the advantages of generative AI for producing inauthentic content and distributing it using social bots, aligning with existing PLA interest in content generation and distribution. However, there is also a focus on the potential cyber and AI-driven information threat from the United States, indicating a concern for regime security."
        },
        {
            "question": "What tactics do PLA authors discuss for artificially influencing public opinion using generative AI?",
            "expert_answer": "PLA authors discuss the prospect of running large-scale networks of social bots powered by automated content generation, specifically to influence public opinion via these bots. They argue that generative AI will enable nuanced, personalized content, and not only proactively post but also respond to other users' posts and engage in long-term conversations. This would make social bots based on ChatGPT more influential and concealed than traditional human-run astroturfing."
        },
        {
            "question": "How do PLA discussions of generative AI's potential for cyber-enabled IO focus on the prospects for long-term subtle influence?",
            "expert_answer": "PLA discussions of generative AI's potential for cyber-enabled IO mainly focus on the prospects for long-term subtle influence across several different tactics, including influencing public opinion via large-scale bot networks, producing intentionally biased publicly available models, and specifically degrading support for adversary leadership. These tactics aim to artificially influence public opinion, enable precision cognitive attacks, and create or reinforce information bubbles, making it harder to detect and counteract the desired content."
        },
        {
            "question": "What concerns do PLA researchers express about the use of generative AI by the Chinese military in cyber-enabled influence operations?",
            "expert_answer": "PLA researchers express concerns about the potential use of generative AI by the Chinese military in cyber-enabled influence operations, particularly in terms of challenges in training data, human confidence in the models, and lack of transparency. They also acknowledge that there are subtle issues, such as cultural symbols and historical allusions, that require high context information to help AI understand. However, they believe that generative AI will almost certainly improve current PLA capabilities, especially in addressing longstanding complaints about poor foreign language capabilities and cross-cultural understanding."
        },
        {
            "question": "How do PLA researchers perceive U.S. efforts to use generative AI for influence operations?",
            "expert_answer": "PLA researchers perceive U.S. efforts to use generative AI for influence operations as a significant threat to Chinese regime security. They believe that the U.S. government, often specifically the U.S. military, is either developing or has already deployed such capabilities and could, or already is, targeting them at Beijing. This concern may be driven in part by fears of technological inferiority, as initial Chinese appraisals acknowledged the U.S. lead in generative AI. However, PLA researchers also use these concerns to justify Chinese efforts in response."
        }
,
        {
            "question": "How might the Chinese military's adoption of generative AI impact the balance of power in cyber-enabled influence operations?",
            "expert_answer": "The Chinese military's adoption of generative AI could significantly impact the balance of power in cyber-enabled influence operations. Generative AI has the potential to automate the creation and dissemination of disinformation at an unprecedented scale, making it easier for the Chinese military to shape public opinion and influence decision-making. This could potentially give the Chinese military an advantage over other countries that have not yet adopted this technology. However, it's important to note that the effectiveness of generative AI in cyber-enabled influence operations will depend on a variety of factors, including the quality of the AI models, the availability of high-quality data, and the ability to effectively target and deliver disinformation to the intended audience. Additionally, the use of generative AI in cyber-enabled influence operations may be subject to legal and ethical constraints, which could limit its effectiveness in some cases."
        },
        {
            "question": "What are some potential challenges or limitations of using generative AI for cyber-enabled influence operations?",
            "expert_answer": "There are several potential challenges or limitations of using generative AI for cyber-enabled influence operations. One challenge is the risk of generating inaccurate or misleading information, which could undermine the credibility of the operation and potentially harm the reputation of the organization or country conducting it. Another challenge is the risk of generating politically unacceptable information, which could lead to legal or diplomatic consequences. Additionally, the effectiveness of generative AI in cyber-enabled influence operations may be limited by the availability of high-quality data and the ability to effectively target and deliver disinformation to the intended audience. Finally, the use of generative AI in cyber-enabled influence operations may be subject to legal and ethical constraints, which could limit its effectiveness in some cases."
        },
        {
            "question": "How can open-source research help us understand the Chinese military's adoption of generative AI?",
            "expert_answer": "Open-source research can help us understand the Chinese military's adoption of generative AI by providing insights into the military's research and development activities, as well as its operational capabilities and strategies. This can involve monitoring Chinese military writings, engaging with experts in the field, and conducting analysis of open-source data, such as social media posts, news articles, and academic publications. By analyzing this data, we can identify trends and patterns in the Chinese military's adoption of generative AI, as well as potential vulnerabilities and opportunities for countermeasures. However, it's important to note that open-source research has its limitations, as not all military activities are conducted in the open, and some information may be intentionally withheld or obfuscated. Therefore, open-source research should be complemented with other sources of intelligence, such as human intelligence and signals intelligence, to provide a more comprehensive understanding of the Chinese military's adoption of generative AI."
        },
        {
            "question": "What are some potential countermeasures to the Chinese military's use of generative AI in cyber-enabled influence operations?",
            "expert_answer": "There are several potential countermeasures to the Chinese military's use of generative AI in cyber-enabled influence operations. One approach is to invest in research and development of AI-based detection and response tools, which can help identify and mitigate the impact of disinformation campaigns. This may involve developing algorithms to detect anomalies in social media posts, news articles, and other online content, as well as building partnerships with other countries and organizations to share threat intelligence and best practices. Another approach is to build resilience to disinformation by promoting media literacy and critical thinking skills, as well as fostering a culture of transparency and accountability in the public sphere. Finally, it may be necessary to consider legal and diplomatic measures to deter the use of generative AI in cyber-enabled influence operations, such as imposing sanctions or initiating international negotiations to establish norms and standards for the use of AI in military operations."
        }
,
        {
            "question": "What specific political constraints might prevent the Chinese military and other Party-state actors from embracing generative AI for influence operations?",
            "expert_answer": "The Chinese Communist Party (CCP) has strict control over all aspects of Chinese society, including its military and intelligence agencies. This means that any use of generative AI for influence operations would need to fall within CCP-acceptable talking points and not challenge the Party's authority. However, this can be challenging in practice, as the use of AI in influence operations can be unpredictable and may produce unintended consequences. As a result, the PLA and other Party-state actors may be hesitant to embrace generative AI for fear of internal backlash or negative impacts on the overall performance of their models. Additionally, the CCP's emphasis on political loyalty and ideological purity may lead to the development of politically reliable but less effective models, as resources and talent may be diverted towards ensuring ideological alignment rather than technical excellence."
        },
        {
            "question": "Beyond the PLA, what other Party-state actors are likely involved in cyber-enabled influence operations against Taiwan?",
            "expert_answer": "In addition to the PLA, other Party-state actors that are likely involved in cyber-enabled influence operations against Taiwan include the CCP Propaganda Department, the Ministry of Foreign Affairs (MFA), the Ministry of State Security (MSS), the Ministry of Public Security, the Cyberspace Administration of China, and the United Front Work Department. These actors may have different goals, tactics, and levels of technical sophistication, but they all ultimately serve the interests of the CCP and are subject to its control. Understanding the roles and responsibilities of these different actors is crucial for developing effective strategies to counter their influence operations."
        },
        {
            "question": "What are some examples of past PLA cyber-enabled influence efforts against Taiwan, and how effective have they been?",
            "expert_answer": "There have been several reported instances of PLA cyber-enabled influence efforts against Taiwan, although attribution is difficult and the effectiveness of these efforts is uncertain. In 2016, Taiwan accused the PLA Air Force of disinformation for posting a photo of Chinese bombers flying close to Taiwan, and in 2018, Taipei specifically blamed the PLASSF for interfering with its election via social media. However, the evidence for these claims is largely circumstantial, and the impact of these influence operations on Taiwanese politics and society is unclear. According to available public evidence, China's overall efforts in 2020 yielded minimal results, suggesting that the PLA and other Party-state actors may need to refine their strategies and tactics to achieve their goals."
        },
        {
            "question": "What are some potential countermeasures that Taiwan and its allies can take to detect and counter Chinese cyber-enabled influence operations?",
            "expert_answer": "There are several potential countermeasures that Taiwan and its allies can take to detect and counter Chinese cyber-enabled influence operations. These include investing in research and development of AI-based detection and response tools, building partnerships with other countries and organizations to share threat intelligence and best practices, and engaging in public diplomacy and information campaigns to counter Chinese propaganda and disinformation. Additionally, Taiwan can strengthen its cybersecurity defenses, improve its media literacy education, and encourage critical thinking and skepticism among its citizens to reduce the impact of Chinese influence operations. Ultimately, a comprehensive and multi-faceted approach that involves both technical and strategic considerations is necessary to effectively counter Chinese cyber-enabled influence operations."
        }
,
        {
            "question": "How might the adoption of generative AI by the Chinese Party-state for cyber-enabled IO impact the effectiveness of current countermeasures employed by democratic countries?",
            "expert_answer": "The adoption of generative AI by the Chinese Party-state for cyber-enabled IO could significantly impact the effectiveness of current countermeasures employed by democratic countries. Generative AI can enable more sophisticated and targeted influence operations, making it harder to detect and mitigate them. This requires democratic countries to adapt their countermeasures to address the new challenges posed by AI-enabled influence operations. This may involve investing in research and development of AI-based detection and response tools, as well as building partnerships with other countries and organizations to share threat intelligence and best practices. Additionally, it is crucial to ensure that democratic institutions and societies are resilient to influence operations, by promoting media literacy, transparency, and public awareness of the risks associated with disinformation and propaganda."
        },
        {
            "question": "What are the potential risks associated with the use of generative AI by the Chinese Party-state for cyber-enabled IO, and how might they be mitigated?",
            "expert_answer": "The potential risks associated with the use of generative AI by the Chinese Party-state for cyber-enabled IO include the spread of disinformation, propaganda, and manipulation of public opinion, which can undermine democratic institutions and values. These risks can be mitigated by a combination of technical and strategic measures. On the technical side, democratic countries can invest in research and development of AI-based detection and response tools, as well as strengthen their cybersecurity defenses to prevent unauthorized access and manipulation of their systems. On the strategic side, democratic countries can promote media literacy, transparency, and public awareness of the risks associated with disinformation and propaganda. Additionally, they can build partnerships with other countries and organizations to share threat intelligence and best practices, and engage in diplomatic efforts to discourage the use of cyber-enabled IO for malicious purposes. Ultimately, addressing the risks associated with the use of generative AI by the Chinese Party-state requires a comprehensive and proactive approach that involves both technical and strategic considerations."
        },
        {
            "question": "How might the Chinese Party-state's use of generative AI for cyber-enabled IO influence the behavior of other state and non-state actors in the international system?",
            "expert_answer": "The Chinese Party-state's use of generative AI for cyber-enabled IO can influence the behavior of other state and non-state actors in the international system in several ways. On the one hand, it can encourage other actors to adopt similar tactics, leading to a proliferation of AI-enabled influence operations and a corresponding erosion of trust and credibility in the international system. On the other hand, it can also lead to a backlash from other actors, who may view the use of AI for malicious purposes as a threat to their own interests and values. This can result in increased tensions and conflicts in the international system, as well as a renewed focus on the need for norms and rules to govern the use of AI in international relations. Ultimately, the Chinese Party-state's use of generative AI for cyber-enabled IO is a reflection of the broader trends and challenges associated with the rise of AI and emerging technologies in the international system, and requires a coordinated and proactive response from all actors involved."
        },
        {
            "question": "What are the potential ethical implications of the Chinese Party-state's use of generative AI for cyber-enabled IO, and how might they be addressed?",
            "expert_answer": "The potential ethical implications of the Chinese Party-state's use of generative AI for cyber-enabled IO include the violation of privacy, autonomy, and informed consent of individuals and groups targeted by such operations. These implications can be addressed by a combination of legal, ethical, and technical measures. On the legal side, democratic countries can enact and enforce laws and regulations that prohibit the use of AI for malicious purposes, such as disinformation, propaganda, and manipulation of public opinion. On the ethical side, democratic countries can promote ethical guidelines and principles that govern the use of AI in the public sphere, such as transparency, accountability, and fairness. On the technical side, democratic countries can invest in research and development of AI-based detection and response tools that can help identify and mitigate the risks associated with AI-enabled influence operations. Ultimately, addressing the ethical implications of the Chinese Party-state's use of generative AI for cyber-enabled IO requires a multidisciplinary and collaborative approach that involves legal, ethical, and technical expertise."
        }
,
        {
            "question": "How might generative AI enhance the PLA's ability to degrade adversary decision-making in cyber-enabled influence operations?",
            "expert_answer": "Generative AI can potentially improve the PLA's ability to degrade adversary decision-making by creating more convincing and personalized propaganda, which can be tailored to specific audiences and delivered through various channels. This can help to sow confusion and doubt, and potentially influence decision-making processes. Additionally, generative AI can be used to automate the creation and dissemination of content, allowing for a greater volume and faster pace of operations. This can make it more difficult for adversaries to keep up and respond effectively. However, it's important to note that the effectiveness of such tactics will depend on various factors, including the quality of the AI-generated content, the target audience, and the broader context in which the influence operations are taking place."
        },
        {
            "question": "What potential challenges might the PLA face in integrating generative AI into its cyber-enabled influence operations?",
            "expert_answer": "The PLA may face several challenges in integrating generative AI into its cyber-enabled influence operations. These might include technical challenges, such as ensuring the reliability and robustness of AI systems, as well as ethical and legal challenges, such as ensuring compliance with international laws and norms governing the use of AI in influence operations. Additionally, the PLA may face challenges in developing and maintaining the necessary expertise and capabilities to effectively leverage generative AI. This might involve investing in research and development, as well as building partnerships with academic institutions and private sector companies. Finally, the PLA may face challenges in adapting its organizational structures and processes to effectively integrate AI into its operations, which may require significant cultural and institutional changes."
        },
        {
            "question": "How might generative AI be used to support Chinese psychological warfare objectives, such as undermining adversary support for war?",
            "expert_answer": "Generative AI can potentially be used to support Chinese psychological warfare objectives, such as undermining adversary support for war, by creating and disseminating content that is designed to appeal to specific audiences and persuade them to adopt certain viewpoints. For example, AI-generated content might be used to stoke fears about the potential costs and consequences of war, or to highlight the benefits of peaceful engagement. Additionally, generative AI can be used to automate the creation and dissemination of content, allowing for a greater volume and faster pace of operations. This can help to amplify certain messages and drown out opposing viewpoints, potentially influencing public opinion and undermining support for war. However, it's important to note that the effectiveness of such tactics will depend on various factors, including the quality of the AI-generated content, the target audience, and the broader context in which the influence operations are taking place."
        },
        {
            "question": "What potential ethical concerns might arise from the use of generative AI in cyber-enabled influence operations?",
            "expert_answer": "The use of generative AI in cyber-enabled influence operations raises several potential ethical concerns. For example, there is a risk that AI-generated content could be used to deceive or manipulate people, potentially undermining their autonomy and informed consent. Additionally, there is a risk that AI-generated content could be used to spread disinformation or propaganda, potentially undermining democratic institutions and social cohesion. There is also a risk that the use of AI in influence operations could exacerbate existing power imbalances, potentially reinforcing the dominance of certain actors and further marginalizing others. To address these concerns, it is important to establish clear ethical guidelines and regulations governing the use of AI in influence operations, and to ensure that these guidelines and regulations are enforced through effective oversight and accountability mechanisms."
        },
        {
            "question": "How might generative AI be used to support Chinese deception objectives in cyber-enabled influence operations?",
            "expert_answer": "Generative AI can potentially be used to support Chinese deception objectives in cyber-enabled influence operations by creating and disseminating content that is designed to mislead or confuse adversaries. For example, AI-generated content might be used to create false narratives or distractions, or to obscure the true intentions or capabilities of the PLA. Additionally, generative AI can be used to automate the creation and dissemination of content, allowing for a greater volume and faster pace of operations. This can help to overwhelm adversaries and make it more difficult for them to distinguish truth from falsehood. However, it's important to note that the effectiveness of such tactics will depend on various factors, including the quality of the AI-generated content, the target audience, and the broader context in which the influence operations are taking place."
        }
,
        {
            "question": "What are the potential risks and implications of the PLA adopting generative AI for cyber-enabled IO?",
            "expert_answer": "The PLA's adoption of generative AI for cyber-enabled IO could significantly improve its ability to conduct influence operations while making detection and attribution more difficult. This could lead to a range of risks and implications for the United States, including the potential for foreign election interference, the degradation of adversary will to fight, and the erosion of trust in democratic institutions. Additionally, the use of generative AI could lower the barrier to entry for cyber-enabled IO, making it easier for less sophisticated actors to conduct influence operations. To mitigate these risks, it is important for U.S. policymakers to stay informed about Chinese military strategies and capabilities, invest in research and development of AI-based detection and response tools, and build partnerships with other countries and organizations to share threat intelligence and best practices."
        },
        {
            "question": "How can the U.S. government stay informed about Chinese military strategies and capabilities related to generative AI?",
            "expert_answer": "To stay informed about Chinese military strategies and capabilities related to generative AI, the U.S. government can conduct open-source research, monitor Chinese military writings, and engage with experts in the field. This can involve tracking Chinese military publications, attending conferences and workshops on AI and national security, and building relationships with academic and industry experts. Additionally, the U.S. government can leverage intelligence and law enforcement capabilities to gather information on Chinese military activities related to generative AI. By staying informed about Chinese military strategies and capabilities, the U.S. government can better prepare for and respond to potential threats."
        },
        {
            "question": "What are some potential strategies for detecting and countering cyber-enabled influence operations that utilize generative AI?",
            "expert_answer": "Detecting and countering cyber-enabled influence operations that utilize generative AI may involve a range of strategies, including: (1) investing in research and development of AI-based detection and response tools, such as natural language processing algorithms that can identify and flag suspicious content; (2) building partnerships with other countries and organizations to share threat intelligence and best practices; (3) conducting regular cybersecurity assessments and exercises to test and improve detection and response capabilities; (4) raising public awareness about the risks of cyber-enabled influence operations and encouraging critical thinking and media literacy; and (5) working with social media platforms and other technology companies to develop and implement policies and procedures for identifying and removing suspicious content. Ultimately, a comprehensive approach that involves both technical and strategic considerations is likely to be most effective in detecting and countering cyber-enabled influence operations that utilize generative AI."
        },
        {
            "question": "What are the potential benefits of investing in AI-based detection and response tools for cybersecurity?",
            "expert_answer": "Investing in AI-based detection and response tools for cybersecurity can provide a range of benefits, including: (1) improved speed and accuracy in detecting and responding to cyber threats, particularly those that utilize emerging technologies like generative AI; (2) reduced reliance on manual processes and human analysts, freeing up resources for other critical tasks; (3) enhanced scalability and adaptability, allowing organizations to quickly and easily respond to changing threat landscapes; (4) increased efficiency and cost-effectiveness, particularly as compared to traditional cybersecurity approaches; and (5) improved situational awareness and decision-making capabilities, enabling organizations to better understand and respond to cyber threats in real-time. By investing in AI-based detection and response tools, organizations can better protect themselves against a wide range of cyber threats, including those that may utilize generative AI."
        },
        {
            "question": "What are some potential challenges or limitations of AI-based detection and response tools for cybersecurity?",
            "expert_answer": "While AI-based detection and response tools for cybersecurity can provide a range of benefits, they may also be subject to certain challenges or limitations, including: (1) the risk of false positives or false negatives, particularly as AI models may not always be able to accurately distinguish between legitimate and malicious activity; (2) the potential for adversaries to develop countermeasures that can evade or manipulate AI-based detection and response tools; (3) the need for large and diverse datasets to train AI models, which may not always be available or may be subject to bias or other issues; (4) the potential for AI models to inadvertently reinforce or amplify existing biases or discriminatory practices; and (5) the need for ongoing maintenance and updates to ensure that AI models remain effective as threat landscapes evolve. By understanding and addressing these challenges and limitations, organizations can better leverage AI-based detection and response tools to improve their cybersecurity posture."
        }
,
        {
            "question": "How can social media platforms effectively detect and label AI-generated content, given the current limitations of available detection tools?",
            "expert_answer": "Detecting AI-generated content is a challenging task, as current tools have shown inconsistent performance. However, social media platforms can take several steps to improve their detection capabilities. First, they can invest in research and development of new detection algorithms and techniques. This may involve collaborating with academic institutions and private companies that are working on AI detection technologies. Second, social media platforms can implement a multi-layered detection approach that combines automated tools with human review. This can help to improve the accuracy and reliability of content labeling. Third, social media platforms can establish clear guidelines and policies for content labeling, and provide training and support to their users to help them understand how to label their content appropriately. Finally, social media platforms can engage in public-private collaboration to share threat intelligence and best practices for detecting and labeling AI-generated content."
        },
        {
            "question": "What role can Congress play in addressing the challenge of AI-generated content on social media platforms?",
            "expert_answer": "Congress can play a critical role in addressing the challenge of AI-generated content on social media platforms. First, Congress can allocate dedicated resources to appropriate agencies' budgets to support research and development of AI detection and response tools. This can help to accelerate the development of more effective detection algorithms and techniques. Second, Congress can fund studies on the topic of AI-generated content and its impact on social media platforms. This can help to build a better understanding of the challenges and opportunities associated with AI-generated content, and inform the development of evidence-based policies and regulations. Third, Congress can encourage public-private collaboration to address the challenge of AI-generated content. This can involve facilitating partnerships between social media platforms, academic institutions, and private companies to share threat intelligence and best practices. Finally, Congress can consider legislation to require social media platforms to take specific steps to detect and label AI-generated content, such as implementing robust content moderation policies and investing in AI detection tools."
        },
        {
            "question": "What are the potential risks and benefits of using generative AI to produce content on social media platforms?",
            "expert_answer": "The use of generative AI to produce content on social media platforms has both potential risks and benefits. On the one hand, AI-generated content can be used to spread misinformation, propaganda, and other forms of harmful content. This can undermine the integrity of social media platforms and erode public trust in digital media. On the other hand, AI-generated content can also be used for positive purposes, such as generating creative and engaging content for marketing campaigns, creating personalized content for individual users, and improving accessibility for people with disabilities. To maximize the benefits and minimize the risks of AI-generated content, social media platforms should implement robust content moderation policies and invest in AI detection tools to detect and label AI-generated content. They should also engage in public-private collaboration to share threat intelligence and best practices, and provide training and support to their users to help them understand how to use AI-generated content responsibly."
        },
        {
            "question": "How can social media platforms ensure that their AI detection tools are fair and unbiased, and do not discriminate against certain types of content or users?",
            "expert_answer": "To ensure that their AI detection tools are fair and unbiased, social media platforms should take several steps. First, they should conduct thorough testing and validation of their AI detection algorithms to ensure that they are accurate and reliable across a wide range of content and user scenarios. This may involve using diverse and representative data sets to train and test the algorithms, and engaging with independent experts to review and validate the results. Second, social media platforms should establish clear guidelines and policies for content moderation, and ensure that these policies are applied consistently and fairly to all content and users. This may involve implementing transparent and accountable content moderation processes, and providing users with the opportunity to appeal decisions that they believe are unfair or inappropriate. Third, social media platforms should engage in public-private collaboration to share best practices and develop industry standards for AI detection and content moderation. This can help to ensure that all social media platforms are held to the same high standards of fairness and unbiasedness, and that users can trust that their content will be treated fairly and consistently across different platforms."
        }
,
        {
            "question": "How can media literacy training for government employees help prevent the spread of inauthentic content within government agencies?",
            "expert_answer": "Media literacy training for government employees can help prevent the spread of inauthentic content within government agencies by equipping employees with the skills and knowledge to identify and evaluate the credibility of information sources. This includes understanding the potential for AI-generated content to be used for disinformation and learning how to verify the authenticity of information before sharing it. By improving media literacy, government employees can help ensure that accurate and reliable information is used in decision-making processes, which is essential for maintaining national security and public trust."
        },
        {
            "question": "What are some potential challenges in implementing media literacy initiatives for citizens, and how can they be addressed?",
            "expert_answer": "Some potential challenges in implementing media literacy initiatives for citizens include limited access to education and technology, language barriers, and cultural differences. To address these challenges, it is important to engage with local organizations and constituents to understand their specific needs and develop tailored solutions. This may involve partnering with schools, libraries, and community organizations to provide media literacy training, as well as leveraging technology to reach a wider audience through online resources and social media platforms. Additionally, it is important to ensure that media literacy initiatives are culturally sensitive and accessible to individuals with disabilities."
        },
        {
            "question": "How can blockchain or watermarking technologies be used to improve the trustworthiness of authentic media, and what are some potential limitations?",
            "expert_answer": "Blockchain or watermarking technologies can be used to improve the trustworthiness of authentic media by providing a tamper-proof record of the origin and history of a media asset. This can help ensure that authentic media is not altered or misrepresented, and can provide a mechanism for verifying the authenticity of media content. However, there are also potential limitations to these technologies, including the need for widespread adoption, the potential for technical issues or errors, and the risk of hacking or other forms of cyber attacks. Additionally, it is important to ensure that these technologies are transparent and accessible to all users, and that they do not create new barriers to access or participation in media production and distribution."
        },
        {
            "question": "What are some potential risks associated with the use of AI-generated content in government communication, and how can they be mitigated?",
            "expert_answer": "Some potential risks associated with the use of AI-generated content in government communication include the potential for misinformation, the loss of transparency and accountability, and the potential for bias or discrimination. To mitigate these risks, it is important to ensure that AI-generated content is thoroughly vetted and verified for accuracy and credibility, and that it is used in a transparent and accountable manner. Additionally, it is important to ensure that AI-generated content is developed and deployed in a way that is fair and equitable, and that it does not perpetuate or exacerbate existing biases or discrimination. This may involve engaging with a diverse range of stakeholders, including experts in AI ethics and social justice, to ensure that the development and deployment of AI-generated content is guided by a strong ethical framework."
        }
,
        {
            "question": "From the perspective of a counterfactual reasoning student, how would the absence of public reporting on foreign malign actors' influence on U.S. public opinion impact the overall transparency of U.S. elections?",
            "expert_answer": "The absence of public reporting on foreign malign actors' influence on U.S. public opinion would significantly reduce transparency around the integrity of U.S. elections. This lack of transparency could lead to a lack of public trust in the election process, as well as make it more difficult for policymakers and election officials to address and counter foreign interference. Public reporting provides important insights into the tactics, techniques, and procedures used by foreign malign actors, allowing for more informed decision-making and a more proactive approach to election security. Additionally, public reporting helps to hold foreign actors accountable for their actions and serves as a deterrent against future interference."
        },
        {
            "question": "From the perspective of a counterfactual reasoning student, how might a yearly, dedicated report on foreign malign actors' efforts to influence U.S. public opinion impact the public's understanding of the issue?",
            "expert_answer": "A yearly, dedicated report on foreign malign actors' efforts to influence U.S. public opinion would provide the public with a comprehensive and consistent understanding of the issue. This report would serve as a valuable resource for policymakers, election officials, and the general public, providing detailed information about the tactics, techniques, and procedures used by foreign malign actors. Additionally, the report would help to establish a baseline for foreign activity over time, allowing for more accurate comparisons and analysis of trends and changes in foreign influence efforts. By providing this information on a yearly basis, the public would be better informed about the issue and more able to engage in informed discussions and decision-making."
        },
        {
            "question": "From the perspective of a counterfactual reasoning student, how might a more proactive approach to publicly calling out Chinese cyber-enabled influence operations impact the overall effectiveness of U.S. countermeasures?",
            "expert_answer": "A more proactive approach to publicly calling out Chinese cyber-enabled influence operations could increase the overall effectiveness of U.S. countermeasures. By publicly identifying and attributing these operations, the U.S. government can send a clear message that such activities are unacceptable and will not be tolerated. This can serve as a deterrent against future operations and help to disrupt ongoing activities. Additionally, publicly calling out Chinese cyber-enabled influence operations can help to build public support for U.S. countermeasures and increase the credibility of U.S. efforts to address this issue. However, it is important to balance the need to publicly identify and attribute these operations with the risk of drawing more attention to them and potentially inspiring others to engage in similar activities."
        },
        {
            "question": "From the perspective of a counterfactual reasoning student, how might the adoption of generative AI by foreign malign actors impact U.S. election security?",
            "expert_answer": "The adoption of generative AI by foreign malign actors could significantly impact U.S. election security. Generative AI can be used to create deepfakes, synthetic media, and other forms of disinformation that can be used to manipulate public opinion and interfere with the election process. Additionally, generative AI can be used to automate and scale up influence operations, making it more difficult for election officials and security professionals to detect and counter these activities. To address this threat, it is important for the U.S. government to invest in research and development of AI-based detection and response tools, as well as to build partnerships with other countries and organizations to share threat intelligence and best practices. Additionally, it is important for the U.S. government to engage in public reporting and education efforts to increase awareness of this threat and help the public to better understand and respond to it."
        }
,
        {
            "question": "How can Taiwan's increased information-sharing about Chinese cyber-enabled influence operations impact the global perception of Chinese malign activities?",
            "expert_answer": "Taiwan's increased information-sharing about Chinese cyber-enabled influence operations can significantly impact the global perception of Chinese malign activities by shedding light on the extent and sophistication of these operations. Public reports and declassified information can serve as evidence for other countries to consider when assessing their own risk and developing their response strategies. This can also encourage other democracies to share their experiences and best practices, fostering a global network of cooperation and support. Ultimately, increased information-sharing can contribute to a more informed and coordinated response to Chinese malign activities, helping to protect democratic institutions and values worldwide."
        },
        {
            "question": "What are the potential benefits and challenges of engaging China in a dialogue on AI-driven social media manipulation?",
            "expert_answer": "Engaging China in a dialogue on AI-driven social media manipulation has the potential to establish a framework for limiting the adoption of generative AI for malign purposes. However, there are also significant challenges to consider. On the one hand, a bilateral agreement could empower the United States to hold China accountable publicly and better engage with allies and partners on the topic. On the other hand, there is a risk that China may violate any agreement, as it has done in the past. Therefore, it is crucial to approach this dialogue with a clear understanding of China's motivations and capabilities, as well as a robust plan for verification and enforcement. Ultimately, the potential benefits of such a dialogue may outweigh the challenges, but it requires careful consideration and preparation."
        },
        {
            "question": "How can the Global Cooperation and Training Framework serve as a platform for Taiwan to share its expertise on countering Chinese influence operations with other countries?",
            "expert_answer": "The Global Cooperation and Training Framework can serve as an excellent platform for Taiwan to share its expertise on countering Chinese influence operations with other countries. This initiative provides opportunities for Taiwan to engage in dialogue and collaboration with other interested countries on global issues of concern, including cybersecurity and influence operations. By participating in this framework, Taiwan can share its experiences, best practices, and lessons learned in countering Chinese malign activities, contributing to a more informed and coordinated response worldwide. Additionally, the framework can serve as a platform for building partnerships and fostering trust between Taiwan and other democracies, helping to strengthen the global network of support and cooperation."
        },
        {
            "question": "What are the potential risks and benefits of sharing information about Chinese malign activities with allies and partners?",
            "expert_answer": "Sharing information about Chinese malign activities with allies and partners has the potential to strengthen the global response to these activities, enabling countries to better detect, mitigate, and respond to threats. By sharing information, countries can build trust and foster cooperation, contributing to a more coordinated and effective response. However, there are also potential risks to consider, such as the risk of revealing sensitive sources and methods, or the risk of escalating tensions with China. Therefore, it is crucial to approach information-sharing with a clear understanding of the potential risks and benefits, as well as a robust plan for verification and enforcement. Ultimately, the potential benefits of information-sharing may outweigh the risks, but it requires careful consideration and preparation."
        }
,
        {
            "question": "What are the primary goals and objectives of Chinese cyber-enabled influence operations, and how do they differ from similar efforts by other adversaries?",
            "expert_answer": "Chinese cyber-enabled influence operations are primarily focused on advancing the country's strategic and economic interests, and they often involve the use of propaganda, disinformation, and other tactics to shape public opinion and influence decision-making. Compared to other adversaries, such as Russia, Chinese influence operations are often more subtle and long-term, and they may involve a greater emphasis on building relationships and cultivating influence within target organizations and communities. Additionally, Chinese influence operations often involve the use of legal and semi-legal means, such as the use of state-owned media outlets and front organizations, to achieve their goals."
        },
        {
            "question": "What are the key components of the Chinese military's CDO operational concept, and how do they fit into the broader context of Chinese cyber strategy?",
            "expert_answer": "The Chinese military's CDO (Conducting Cyber Operations) operational concept is a framework for conducting cyber operations that is designed to support the country's broader strategic goals. It includes a range of capabilities, such as cyber espionage, cyber attack, and cyber defense, and it is supported by a variety of organizations and units within the Chinese military. The CDO operational concept is part of a broader Chinese cyber strategy that is focused on building a robust and capable cyber force that can defend the country's interests in cyberspace and project power beyond its borders. This strategy involves a range of activities, including the development of advanced cyber weapons and capabilities, the establishment of cyber partnerships and alliances with other countries, and the use of cyber operations to support military and political objectives."
        },
        {
            "question": "How can the U.S. government better coordinate and align its information efforts to counter Chinese cyber-enabled influence operations?",
            "expert_answer": "To better coordinate and align its information efforts to counter Chinese cyber-enabled influence operations, the U.S. government should consider establishing a centralized body or mechanism to oversee and coordinate these efforts. This could involve creating a new organization or designating an existing agency to lead these efforts, and it would require close collaboration and coordination with other relevant agencies, such as the Department of Defense, the State Department, and the intelligence community. Additionally, the U.S. government should consider developing a clear and consistent strategic messaging framework that aligns with its overall strategic priorities and that can be used to counter Chinese disinformation and propaganda. This would require close coordination and collaboration with other countries and organizations, as well as a deep understanding of the target audiences and the most effective channels for reaching them."
        },
        {
            "question": "What are the potential risks and benefits of using generative AI models from Chinese companies for U.S. government information efforts?",
            "expert_answer": "The use of generative AI models from Chinese companies for U.S. government information efforts presents both potential risks and benefits. On the one hand, these models could provide the U.S. government with powerful new tools for analyzing and understanding large volumes of data, and for generating targeted and persuasive messaging. On the other hand, there are potential risks associated with using these models, including the risk of intellectual property theft, the risk of data breaches or leaks, and the risk of being dependent on a foreign power for critical technology. Additionally, there is the risk that the use of these models could be perceived as a form of legitimization or endorsement of the Chinese government or its policies, and that it could contribute to the erosion of trust and confidence in the U.S. government. Ultimately, the decision to use generative AI models from Chinese companies for U.S. government information efforts should be based on a thorough and rigorous risk-benefit analysis that takes into account all of these factors."
        }
,
        {
            "question": "From the perspective of a social media platform administrator, how can we better detect and mitigate the use of generative AI in influence operations on our platform?",
            "expert_answer": {
                "text": "As a social media platform administrator, it is important to stay up-to-date on the latest developments in generative AI and its potential use in influence operations. This may involve partnering with researchers and experts in the field to understand the latest techniques and trends. Additionally, you can invest in AI-based detection and moderation tools that can help identify and remove inauthentic or manipulative content generated by AI. It is also important to establish clear policies and guidelines for acceptable use of AI on your platform, and to enforce these policies consistently. This may involve suspending or banning accounts that violate these policies, or implementing other penalties as appropriate. Ultimately, being proactive and vigilant in detecting and mitigating the use of generative AI in influence operations is key to maintaining the integrity and trustworthiness of your platform."
            }
        },
        {
            "question": "How might generative AI be used in combination with other tactics in a comprehensive influence operation?",
            "expert_answer": {
                "text": "Generative AI can be a powerful tool in a comprehensive influence operation, particularly when used in combination with other tactics. For example, AI-generated content can be used to support a narrative or cause, while bots can be used to amplify that content and create the appearance of a broad consensus. Testimonials generated by AI can be used to elicit emotional reactions or sway opinions, while impersonation techniques can be used to misrepresent the position or views of others. Keyword squatting and swarming tactics can be used to manipulate search engine results and drown out competing narratives. By combining these tactics with generative AI, influence operations can be more effective and harder to detect. Therefore, it is important to be aware of these potential combinations and to develop strategies and capabilities to detect and counter them."
            }
        },
        {
            "question": "What are the potential ethical implications of using generative AI in influence operations?",
            "expert_answer": {
                "text": "The use of generative AI in influence operations raises a number of ethical concerns. For example, the use of AI to impersonate individuals or create deepfakes can be highly manipulative and deceptive, potentially leading to harm or exploitation of those individuals. The use of AI to generate large volumes of inauthentic content can also undermine trust and credibility in online information spaces, making it harder for people to make informed decisions. Additionally, the use of AI in influence operations can exacerbate existing power imbalances and contribute to the spread of disinformation and propaganda. Therefore, it is important to consider these ethical implications when developing and deploying generative AI in influence operations, and to establish clear guidelines and safeguards to ensure that its use is responsible and ethical."
            }
        },
        {
            "question": "How can governments and organizations build resilience to the potential use of generative AI in influence operations?",
            "expert_answer": {
                "text": "Building resilience to the potential use of generative AI in influence operations involves a multi-faceted approach that includes both technical and strategic considerations. From a technical perspective, governments and organizations can invest in AI-based detection and response tools that can help identify and mitigate the use of generative AI in influence operations. This may involve partnering with researchers and experts in the field to develop and deploy these tools. From a strategic perspective, governments and organizations can work to build trust and credibility in online information spaces, and to promote media literacy and critical thinking skills among their constituents. This may involve investing in education and outreach programs, as well as building partnerships with other countries and organizations to share threat intelligence and best practices. Ultimately, building resilience to the potential use of generative AI in influence operations requires a proactive and collaborative approach that involves both technical and strategic considerations."
            }
        }
    ]
