{
  "name": "Research Object Submission Form",
  "children": [
    {
      "title": "Type of Research Object",
      "id": "fa0c39ca-0486-4e29-ba24-f86f7d375c3f",
      "component": "Select",
      "name": "submission.objectType",
      "options": [
        {
          "id": "df5fc212-b055-4cba-9d0e-e85222e3d4f2",
          "label": "Dataset",
          "value": "dataset"
        },
        {
          "id": "ef2ddada-105a-412e-8d7f-56b1df44c02f",
          "label": "Software",
          "value": "software"
        },
        {
          "id": "0fafbfc3-6797-46e3-aff4-3fd4f16261b1",
          "label": "Figure",
          "value": "figure"
        },
        {
          "id": "5117a7c6-2fcf-414b-ac60-47f8d93ccfef",
          "label": "Notebook",
          "value": "notebook"
        },
        {
          "id": "32121b38-b855-465e-b039-b5100177698b",
          "label": "Research article ",
          "value": "Research article "
        }
      ]
    },
    {
      "title": "Title",
      "id": "47fd802f-ed30-460d-9617-c8a9b9025e95",
      "component": "TextField",
      "name": "meta.title",
      "placeholder": "Enter the manuscript's title",
      "hideFromReviewers": "false"
    },
    {
      "title": "Author names",
      "id": "d76e5b3c-eeaa-4168-9318-95d43a31e3e4",
      "component": "AuthorsInput",
      "name": "submission.authorNames",
      "hideFromReviewers": "false"
    },
    {
      "title": "Topics",
      "id": "62ca72ad-04b0-41fc-85d1-415469d7e895",
      "component": "CheckboxGroup",
      "name": "submission.topics",
      "hideFromReviewers": "false",
      "options": [
        {
          "id": "2323b6d1-8223-45e8-a0fc-1044a1e39d37",
          "label": "Neuropsychology ",
          "value": "Neuropsychology "
        },
        {
          "id": "ac7cafca-c5c8-4940-9f2f-014d18660e90",
          "label": "Topic 2",
          "value": "Topic 2"
        },
        {
          "id": "93c88240-9c2b-4c23-9301-23ed94ef61d7",
          "label": "Topic 3",
          "value": "Topic 3"
        }
      ]
    },
    {
      "title": "DOI",
      "id": "1c2e9325-3fa8-41f3-8607-180eb8a25aa3",
      "component": "TextField",
      "name": "submission.DOI",
      "doiValidation": "true",
      "placeholder": "Enter the manuscript's DOI",
      "hideFromReviewers": "false"
    },
    {
      "title": "Abstract",
      "shortDescription": "Abstract",
      "id": "d80b2c88-6144-4003-b671-63990b9b2793",
      "component": "AbstractEditor",
      "name": "submission.abstract",
      "description": "<p>Please provide a short summary of your submission</p>",
      "placeholder": "Input your abstract...",
      "hideFromReviewers": "false"
    },
    {
      "title": "Author correspondence ",
      "id": "7f5aa395-3486-4067-b636-ae204d472c16",
      "component": "TextField",
      "name": "submission.AuthorCorrespondence"
    },
    {
      "title": "Cover letter",
      "id": "347dc171-f008-45ac-8433-ca0711bf213c",
      "component": "AbstractEditor",
      "name": "submission.cover",
      "description": "<p>Cover letter describing submission, relevant implications, and timely information to consider</p>",
      "placeholder": "Enter your cover letter"
    },
    {
      "title": "Editors evaluation ",
      "id": "14b8da7d-5924-4098-8d1f-e528c7c440b9",
      "component": "TextField",
      "name": "submission.EditorsEvaluation"
    },
    {
      "title": "Data and Code availability statements",
      "id": "bf2f9b4a-377b-4303-8f51-70d836eb1456",
      "component": "AbstractEditor",
      "name": "submission.datacode",
      "placeholder": "Enter your data and code availability statement"
    },
    {
      "title": "Competing interests",
      "id": "fa5e5b75-4b6f-4a2d-9113-c2b4db73ef8a",
      "component": "AbstractEditor",
      "name": "submission.competingInterests",
      "hideFromReviewers": "false"
    },
    {
      "title": "Funding",
      "id": "6bfdc237-814d-4af8-b0f0-064099d679ba",
      "component": "TextField",
      "name": "submission.Funding"
    },
    {
      "title": "Upload supplementary materials",
      "id": "b769b4d5-f9b3-48d3-a6d5-77bb6a9e95b0",
      "component": "SupplementaryFiles",
      "name": "fileName"
    },
    {
      "title": "Author contributions ",
      "id": "b127ecb1-4862-4662-a958-3266eb284353",
      "component": "TextField",
      "name": "submission.authorContributions"
    },
    {
      "title": "Decision letter and author response",
      "id": "6342cff7-c57a-4fd9-b91d-c4cf77b4c309",
      "component": "AbstractEditor",
      "name": "submission.DecisionLetter"
    },
    {
      "title": "References ",
      "id": "e8af0c63-e46f-46a8-bc90-5023fe50a541",
      "component": "AbstractEditor",
      "name": "submission.references",
      "hideFromReviewers": "false"
    },
    {
      "title": "Reviewing editors name ",
      "id": "ebe75cec-0ba8-4f00-9024-20e77ed94f1c",
      "component": "AuthorsInput",
      "name": "submission.reviewingEditor"
    },
    {
      "title": "Copyright holder",
      "id": "6871680a-2278-40b3-80c6-7de06f21aafb",
      "component": "TextField",
      "name": "submission.copyrightHolder",
      "description": "<p class=\"paragraph\">e.g. British Medical Journal </p>"
    },
    {
      "title": "Copyright statement ",
      "id": "1e9ff636-f850-4d20-b079-36af49fa4ad1",
      "component": "TextField",
      "name": "submission.copyrightStatement",
      "description": "<p class=\"paragraph\">e.g. This article is distributed under the terms of the Creative Commons Attribution License, which permits unrestricted use and redistribution provided that the original author and source are credited.</p>"
    },
    {
      "title": "Copyright year ",
      "id": "7617c919-4413-4306-b709-ef78c3110c3f",
      "component": "TextField",
      "name": "submission.copyrightYear",
      "description": "<p class=\"paragraph\">e.g. 2022</p>"
    },
    {
      "title": "Date received ",
      "id": "6deaacc6-759a-4a68-b494-c38c664bb665",
      "component": "TextField",
      "name": "submission.dateReceived",
      "description": "<p class=\"paragraph\">preferred format: DD.MM.YYYY e.g. 07.01.2021</p>"
    },
    {
      "title": "Date accepted",
      "id": "8b858adc-5f65-4385-9f79-5c5af1f67bd5",
      "component": "TextField",
      "name": "submission.dateAccepted",
      "description": "<p class=\"paragraph\">preferred format: DD.MM.YYYY e.g. 07.01.2021</p>"
    },
    {
      "title": "Date published ",
      "id": "f6e46890-4b96-4c90-ab48-b4fc5abb9b40",
      "component": "TextField",
      "name": "submission.datePublished",
      "description": "<p class=\"paragraph\">preferred format: DD.MM.YYYY e.g. 07.01.2021</p>"
    },
    {
      "title": "Manuscript File",
      "id": "66469976-314f-4949-b2ff-702039b262c0",
      "component": "ManuscriptFile",
      "name": "manuscriptFile"
    }
  ],
  "description": "<p>Please fill out the form below to complete your submission.</p>",
  "haspopup": "true",
  "popuptitle": "By submitting the manuscript, you agree to the following statements.",
  "popupdescription": "<p>The corresponding author confirms that all co-authors are included, and that everyone listed as a co-author agrees to that role and all the following requirements and acknowledgements:</p><p></p><p>The submission represents original work and sources are given proper attribution. The journal employs CrossCheck to compare submissions against a large and growing database of published scholarly content. If in the judgment of a senior editor a submission is genuinely suspected of plagiarism, it will be returned to the author(s) with a request for explanation.</p><p></p><p>The research was conducted in accordance with ethical principles.</p><p></p><p>There is a Data Accessibility Statement, containing information about the location of open data and materials, in the manuscript.</p><p></p><p>A conflict of interest statement is present in the manuscript, even if to state no conflicts of interest.</p>"
}
