%!PS-Adobe-3.0
%%Creator: Model Technology ModelSim ALTERA STARTER EDITION vsim 10.1d Simulator 2012.11 Nov  2 2012
%%Title: mp2_first4500way0.ps
%%CreationDate: 2017-10-08 03:00:38 PM
%%DocumentData: Clean8Bit
%%DocumentNeededResources: font Helvetica
%%Orientation: Landscape
%%PageOrder: ascend
%%Pages: 1
%%EndComments
%%BeginSetup
%%BeginFeature: *PageSize 8.5x11.0
<< /PageSize [612.0 792.0]
/ImagingBBox null
>> setpagedevice
%%EndFeature
%%EndSetup
%%Page: 1 1
gsave
90 rotate 0.12 dup neg scale
% dump string table
/NP {newpath} def/SD {setdash} def/CL {setrgbcolor} def/GR {setgray} def
/SX {exch LEdge sub XScale mul MaxLabelWidth add LMargin add LEdge LabelWidth sub add exch} def/CSX {exch dup LabelWidth gt {exch SX} {exch} ifelse} def
/MT {SX moveto} def/LS {SX lineto stroke} def/LT {SX lineto} def/LFS {SX lineto fill stroke} def/RSS {rmoveto show stroke} def/ST {stroke} def/WT {CSX moveto dup stringwidth pop} def/TSW {pop 0 originOffset} def
/TSE {MaxLabelWidth LabelWidth sub LMargin add 0 rmoveto neg originOffset} def/TS {-2 div originOffset CSX} def
/MLW {stringwidth pop dup MaxLabelWidth gt {/MaxLabelWidth exch def}{pop} ifelse XS} def
/XS {/XScale LabelWidth LMargin sub MaxLabelWidth LEdge LabelWidth sub add sub REdge LEdge sub div 1 add def} def
/ARC {5 -2 roll SX 5 2 roll arc} def/LC {1 index stringwidth pop lt {pop ()} if} def
/SW {stringwidth pop} def
/ESTR {   dup 3 add string   /CurrentStr exch def   exch 0 2 index getinterval   0 1 3 index 1 sub {     dup     2 index exch get exch     CurrentStr exch 3 -1 roll put   } for   pop   dup 1 2 2 index add {     CurrentStr exch 46 put   } for   pop} def
/LC {   exch  dup dup /CurrentStr exch def   SW 2 index gt {     CurrentStr length     dup     {       2 div cvi       3 index       CurrentStr SW       sub       dup 0 lt {         1 index         4 -1 roll         exch sub         3 1 roll       }       {         dup 5 index gt {           1 index 4 -1 roll add 3 1 roll         }         {           exit         } ifelse       } ifelse       3 index 2 index ESTR       1 index 0 eq {         exit       } if       pop     } loop     pop pop pop pop pop     CurrentStr   }   {     CurrentStr   } ifelse} def
/XScale 1 def/MaxLabelWidth 0 def/LMargin 300 def/LEdge 1037 def/REdge 5699 def/LabelWidth 1000 def
/Helvetica findfont [100 0 0 -100 0 0] makefont setfont
/originOffset   currentfont   /FontBBox get 1 get   currentfont  /FontMatrix get 3 get   mul   currentfont   /FontType get   42 eq {     1000000 div   } {     neg   } ifelse def
(data \(way 0\)) MLW
([7]) MLW
([6]) MLW
([5]) MLW
([4]) MLW
([3]) MLW
([2]) MLW
([1]) MLW
([0]) MLW
(tag \(way 0\)) MLW
([7]) MLW
([6]) MLW
([5]) MLW
([4]) MLW
([3]) MLW
([2]) MLW
([1]) MLW
([0]) MLW
(pc_out) MLW
([15]) MLW
([14]) MLW
([13]) MLW
([12]) MLW
([11]) MLW
([10]) MLW
([9]) MLW
([8]) MLW
([7]) MLW
([6]) MLW
([5]) MLW
([4]) MLW
([3]) MLW
([2]) MLW
([1]) MLW
([0]) MLW
% draw waveform shading
0 0 0 CL
(00000000000000000000000000000000 00000000000000000000000000000000 00000000000000000000000000000000 00000000000000000000000000000000 00000000000000000000000000000000 00000000000000000000000000000000 00000000000000000000000000000000 00000000000000000000000000000000) 889 LC 1051 389 WT pop 0 originOffset 50 add RSS
[] 0 SD
3 setlinewidth
0 setlinejoin
0 setlinecap
1037 389 MT 1037 389 LT 1044 334 LT 1947 334 LT 1954 389 LT ST
1037 389 MT 1037 389 LT 1044 444 LT 1947 444 LT 1954 389 LT ST
(baddbaddbaddbaddbaddbaddbaddbadd 00000000000000000000000000000000 00000000000000000000000000000000 00000000000000000000000000000000 00000000000000000000000000000000 00000000000000000000000000000000 00000000000000000000000000000000 00000000000000000000000000000000) 229 LC 1968 389 WT pop 0 originOffset 50 add RSS
1954 389 MT 1954 389 LT 1961 334 LT 2204 334 LT 2211 389 LT ST
1954 389 MT 1954 389 LT 1961 444 LT 2204 444 LT 2211 389 LT ST
(52205220522052205220522052205220 00000000000000000000000000000000 00000000000000000000000000000000 00000000000000000000000000000000 00000000000000000000000000000000 00000000000000000000000000000000 00000000000000000000000000000000 00000000000000000000000000000000) 428 LC 2225 389 WT pop 0 originOffset 50 add RSS
2211 389 MT 2211 389 LT 2218 334 LT 2660 334 LT 2667 389 LT ST
2211 389 MT 2211 389 LT 2218 444 LT 2660 444 LT 2667 389 LT ST
(600d600d600d600d600d600d600d600d 00000000000000000000000000000000 00000000000000000000000000000000 00000000000000000000000000000000 00000000000000000000000000000000 00000000000000000000000000000000 00000000000000000000000000000000 00000000000000000000000000000000) 849 LC 2681 389 WT pop 0 originOffset 50 add RSS
2667 389 MT 2667 389 LT 2674 334 LT 3537 334 LT 3544 389 LT ST
2667 389 MT 2667 389 LT 2674 444 LT 3537 444 LT 3544 389 LT ST
(52205220522052205220522052205220 00000000000000000000000000000000 00000000000000000000000000000000 00000000000000000000000000000000 00000000000000000000000000000000 00000000000000000000000000000000 00000000000000000000000000000000 00000000000000000000000000000000) 218 LC 3558 389 WT pop 0 originOffset 50 add RSS
3544 389 MT 3544 389 LT 3551 334 LT 3783 334 LT 3790 389 LT ST
3544 389 MT 3544 389 LT 3551 444 LT 3783 444 LT 3790 389 LT ST
(baddbaddbaddbaddbaddbaddbaddbadd 00000000000000000000000000000000 00000000000000000000000000000000 00000000000000000000000000000000 00000000000000000000000000000000 00000000000000000000000000000000 00000000000000000000000000000000 00000000000000000000000000000000) 626 LC 3804 389 WT pop 0 originOffset 50 add RSS
3790 389 MT 3790 389 LT 3797 334 LT 4437 334 LT 4444 389 LT ST
3790 389 MT 3790 389 LT 3797 444 LT 4437 444 LT 4444 389 LT ST
(baddbaddbaddbaddbaddbaddbaddbadd bffdbeedbdddbccdbbbdbaadb99db88d 00000000000000000000000000000000 00000000000000000000000000000000 00000000000000000000000000000000 00000000000000000000000000000000 00000000000000000000000000000000 00000000000000000000000000000000) 230 LC 4458 389 WT pop 0 originOffset 50 add RSS
4444 389 MT 4444 389 LT 4451 334 LT 4695 334 LT 4702 389 LT ST
4444 389 MT 4444 389 LT 4451 444 LT 4695 444 LT 4702 389 LT ST
(baddbaddbaddbaddbaddbaddbaddbadd 522051105ff05ee05dd05cc05bb05aa0 00000000000000000000000000000000 00000000000000000000000000000000 00000000000000000000000000000000 00000000000000000000000000000000 00000000000000000000000000000000 00000000000000000000000000000000) 89 LC 4716 389 WT pop 0 originOffset 50 add RSS
4702 389 MT 4702 389 LT 4709 334 LT 4812 334 LT 4819 389 LT ST
4702 389 MT 4702 389 LT 4709 444 LT 4812 444 LT 4819 389 LT ST
(baddbaddbaddbaddbaddbaddbaddbadd 522051105ff000d05dd05cc05bb05aa0 00000000000000000000000000000000 00000000000000000000000000000000 00000000000000000000000000000000 00000000000000000000000000000000 00000000000000000000000000000000 00000000000000000000000000000000) 428 LC 4833 389 WT pop 0 originOffset 50 add RSS
4819 389 MT 4819 389 LT 4826 334 LT 5268 334 LT 5275 389 LT ST
4819 389 MT 4819 389 LT 4826 444 LT 5268 444 LT 5275 389 LT ST
(baddbaddbaddbaddbaddbaddbaddbadd 522051105fe000d05dd05cc05bb05aa0 00000000000000000000000000000000 00000000000000000000000000000000 00000000000000000000000000000000 00000000000000000000000000000000 00000000000000000000000000000000 00000000000000000000000000000000) 53 LC 5289 389 WT pop 0 originOffset 50 add RSS
5275 389 MT 5275 389 LT 5282 334 LT 5349 334 LT 5356 389 LT ST
5275 389 MT 5275 389 LT 5282 444 LT 5349 444 LT 5356 389 LT ST
(baddbaddbaddbaddbaddbaddbaddbadd 522051105fe000d05dd000e05bb05aa0 00000000000000000000000000000000 00000000000000000000000000000000 00000000000000000000000000000000 00000000000000000000000000000000 00000000000000000000000000000000 00000000000000000000000000000000) 487 LC 5370 389 WT pop 0 originOffset 50 add RSS
5356 389 MT 5356 389 LT 5363 334 LT 5864 334 LT 5871 389 LT ST
5356 389 MT 5356 389 LT 5363 444 LT 5864 444 LT 5871 389 LT ST
(baddbaddbaddbaddbaddbaddbaddbadd 5220511000e000d05dd000e05bb05aa0 00000000000000000000000000000000 00000000000000000000000000000000 00000000000000000000000000000000 00000000000000000000000000000000 00000000000000000000000000000000 00000000000000000000000000000000) 135 LC 5885 389 WT pop 0 originOffset 50 add RSS
5871 389 MT 5871 389 LT 5878 334 LT 6027 334 LT 6034 389 LT ST
5871 389 MT 5871 389 LT 5878 444 LT 6027 444 LT 6034 389 LT ST
(baddbaddbaddbaddbaddbaddbaddbadd 5220511000e000d05dd000e05bb05aa0 00000000000000000000000000000000 00000000000000000000000000000000 00000000000000000000000000000000 00000000000000000000000000000000 00000000000000000000000000000000 6ddd6ccd6bbd6aad699d688d677d666d) 230 LC 6048 389 WT pop 0 originOffset 50 add RSS
6034 389 MT 6034 389 LT 6041 334 LT 6285 334 LT 6292 389 LT ST
6034 389 MT 6034 389 LT 6041 444 LT 6285 444 LT 6292 389 LT ST
6292 389 MT 6292 389 LT 6295 334 LT 6298 334 LT ST
6292 389 MT 6292 389 LT 6295 444 LT 6298 444 LT ST
(00000000000000000000000000000000) 889 LC 1051 565 WT pop 0 originOffset 50 add RSS
1037 565 MT 1037 565 LT 1044 510 LT 1947 510 LT 1954 565 LT ST
1037 565 MT 1037 565 LT 1044 620 LT 1947 620 LT 1954 565 LT ST
(baddbaddbaddbaddbaddbaddbaddbadd) 229 LC 1968 565 WT pop 0 originOffset 50 add RSS
1954 565 MT 1954 565 LT 1961 510 LT 2204 510 LT 2211 565 LT ST
1954 565 MT 1954 565 LT 1961 620 LT 2204 620 LT 2211 565 LT ST
(52205220522052205220522052205220) 428 LC 2225 565 WT pop 0 originOffset 50 add RSS
2211 565 MT 2211 565 LT 2218 510 LT 2660 510 LT 2667 565 LT ST
2211 565 MT 2211 565 LT 2218 620 LT 2660 620 LT 2667 565 LT ST
(600d600d600d600d600d600d600d600d) 849 LC 2681 565 WT pop 0 originOffset 50 add RSS
2667 565 MT 2667 565 LT 2674 510 LT 3537 510 LT 3544 565 LT ST
2667 565 MT 2667 565 LT 2674 620 LT 3537 620 LT 3544 565 LT ST
(52205220522052205220522052205220) 218 LC 3558 565 WT pop 0 originOffset 50 add RSS
3544 565 MT 3544 565 LT 3551 510 LT 3783 510 LT 3790 565 LT ST
3544 565 MT 3544 565 LT 3551 620 LT 3783 620 LT 3790 565 LT ST
(baddbaddbaddbaddbaddbaddbaddbadd) 2480 LC 3804 565 WT pop 0 originOffset 50 add RSS
3790 565 MT 3790 565 LT 3797 510 LT 6298 510 LT ST
3790 565 MT 3790 565 LT 3797 620 LT 6298 620 LT ST
(00000000000000000000000000000000) 3379 LC 1051 730 WT pop 0 originOffset 50 add RSS
1037 730 MT 1037 730 LT 1044 675 LT 4437 675 LT 4444 730 LT ST
1037 730 MT 1037 730 LT 1044 785 LT 4437 785 LT 4444 730 LT ST
(bffdbeedbdddbccdbbbdbaadb99db88d) 230 LC 4458 730 WT pop 0 originOffset 50 add RSS
4444 730 MT 4444 730 LT 4451 675 LT 4695 675 LT 4702 730 LT ST
4444 730 MT 4444 730 LT 4451 785 LT 4695 785 LT 4702 730 LT ST
(522051105ff05ee05dd05cc05bb05aa0) 89 LC 4716 730 WT pop 0 originOffset 50 add RSS
4702 730 MT 4702 730 LT 4709 675 LT 4812 675 LT 4819 730 LT ST
4702 730 MT 4702 730 LT 4709 785 LT 4812 785 LT 4819 730 LT ST
(522051105ff000d05dd05cc05bb05aa0) 428 LC 4833 730 WT pop 0 originOffset 50 add RSS
4819 730 MT 4819 730 LT 4826 675 LT 5268 675 LT 5275 730 LT ST
4819 730 MT 4819 730 LT 4826 785 LT 5268 785 LT 5275 730 LT ST
(522051105fe000d05dd05cc05bb05aa0) 53 LC 5289 730 WT pop 0 originOffset 50 add RSS
5275 730 MT 5275 730 LT 5282 675 LT 5349 675 LT 5356 730 LT ST
5275 730 MT 5275 730 LT 5282 785 LT 5349 785 LT 5356 730 LT ST
(522051105fe000d05dd000e05bb05aa0) 487 LC 5370 730 WT pop 0 originOffset 50 add RSS
5356 730 MT 5356 730 LT 5363 675 LT 5864 675 LT 5871 730 LT ST
5356 730 MT 5356 730 LT 5363 785 LT 5864 785 LT 5871 730 LT ST
(5220511000e000d05dd000e05bb05aa0) 399 LC 5885 730 WT pop 0 originOffset 50 add RSS
5871 730 MT 5871 730 LT 5878 675 LT 6298 675 LT ST
5871 730 MT 5871 730 LT 5878 785 LT 6298 785 LT ST
(00000000000000000000000000000000) 5233 LC 1051 895 WT pop 0 originOffset 50 add RSS
1037 895 MT 1037 895 LT 1044 840 LT 6298 840 LT ST
1037 895 MT 1037 895 LT 1044 950 LT 6298 950 LT ST
(00000000000000000000000000000000) 5233 LC 1051 1060 WT pop 0 originOffset 50 add RSS
1037 1060 MT 1037 1060 LT 1044 1005 LT 6298 1005 LT ST
1037 1060 MT 1037 1060 LT 1044 1115 LT 6298 1115 LT ST
(00000000000000000000000000000000) 5233 LC 1051 1225 WT pop 0 originOffset 50 add RSS
1037 1225 MT 1037 1225 LT 1044 1170 LT 6298 1170 LT ST
1037 1225 MT 1037 1225 LT 1044 1280 LT 6298 1280 LT ST
(00000000000000000000000000000000) 5233 LC 1051 1390 WT pop 0 originOffset 50 add RSS
1037 1390 MT 1037 1390 LT 1044 1335 LT 6298 1335 LT ST
1037 1390 MT 1037 1390 LT 1044 1445 LT 6298 1445 LT ST
(00000000000000000000000000000000) 5233 LC 1051 1555 WT pop 0 originOffset 50 add RSS
1037 1555 MT 1037 1555 LT 1044 1500 LT 6298 1500 LT ST
1037 1555 MT 1037 1555 LT 1044 1610 LT 6298 1610 LT ST
(00000000000000000000000000000000) 4969 LC 1051 1720 WT pop 0 originOffset 50 add RSS
1037 1720 MT 1037 1720 LT 1044 1665 LT 6027 1665 LT 6034 1720 LT ST
1037 1720 MT 1037 1720 LT 1044 1775 LT 6027 1775 LT 6034 1720 LT ST
(6ddd6ccd6bbd6aad699d688d677d666d) 230 LC 6048 1720 WT pop 0 originOffset 50 add RSS
6034 1720 MT 6034 1720 LT 6041 1665 LT 6285 1665 LT 6292 1720 LT ST
6034 1720 MT 6034 1720 LT 6041 1775 LT 6285 1775 LT 6292 1720 LT ST
6292 1720 MT 6292 1720 LT 6295 1665 LT 6298 1665 LT ST
6292 1720 MT 6292 1720 LT 6295 1775 LT 6298 1775 LT ST
(000 000 000 000 000 000 000 000) 889 LC 1051 1896 WT pop 0 originOffset 50 add RSS
1037 1896 MT 1037 1896 LT 1044 1841 LT 1947 1841 LT 1954 1896 LT ST
1037 1896 MT 1037 1896 LT 1044 1951 LT 1947 1951 LT 1954 1896 LT ST
(001 000 000 000 000 000 000 000) 440 LC 1968 1896 WT pop 0 originOffset 50 add RSS
1954 1896 MT 1954 1896 LT 1961 1841 LT 2415 1841 LT 2422 1896 LT ST
1954 1896 MT 1954 1896 LT 1961 1951 LT 2415 1951 LT 2422 1896 LT ST
(000 000 000 000 000 000 000 000) 1094 LC 2436 1896 WT pop 0 originOffset 50 add RSS
2422 1896 MT 2422 1896 LT 2429 1841 LT 3537 1841 LT 3544 1896 LT ST
2422 1896 MT 2422 1896 LT 2429 1951 LT 3537 1951 LT 3544 1896 LT ST
(002 000 000 000 000 000 000 000) 872 LC 3558 1896 WT pop 0 originOffset 50 add RSS
3544 1896 MT 3544 1896 LT 3551 1841 LT 4437 1841 LT 4444 1896 LT ST
3544 1896 MT 3544 1896 LT 3551 1951 LT 4437 1951 LT 4444 1896 LT ST
(002 001 000 000 000 000 000 000) 1562 LC 4458 1896 WT pop 0 originOffset 50 add RSS
4444 1896 MT 4444 1896 LT 4451 1841 LT 6027 1841 LT 6034 1896 LT ST
4444 1896 MT 4444 1896 LT 4451 1951 LT 6027 1951 LT 6034 1896 LT ST
(002 001 000 000 000 000 000 001) 236 LC 6048 1896 WT pop 0 originOffset 50 add RSS
6034 1896 MT 6034 1896 LT 6041 1841 LT 6298 1841 LT ST
6034 1896 MT 6034 1896 LT 6041 1951 LT 6298 1951 LT ST
(000) 889 LC 1051 2072 WT pop 0 originOffset 50 add RSS
1037 2072 MT 1037 2072 LT 1044 2017 LT 1947 2017 LT 1954 2072 LT ST
1037 2072 MT 1037 2072 LT 1044 2127 LT 1947 2127 LT 1954 2072 LT ST
(001) 440 LC 1968 2072 WT pop 0 originOffset 50 add RSS
1954 2072 MT 1954 2072 LT 1961 2017 LT 2415 2017 LT 2422 2072 LT ST
1954 2072 MT 1954 2072 LT 1961 2127 LT 2415 2127 LT 2422 2072 LT ST
(000) 1094 LC 2436 2072 WT pop 0 originOffset 50 add RSS
2422 2072 MT 2422 2072 LT 2429 2017 LT 3537 2017 LT 3544 2072 LT ST
2422 2072 MT 2422 2072 LT 2429 2127 LT 3537 2127 LT 3544 2072 LT ST
(002) 2726 LC 3558 2072 WT pop 0 originOffset 50 add RSS
3544 2072 MT 3544 2072 LT 3551 2017 LT 6298 2017 LT ST
3544 2072 MT 3544 2072 LT 3551 2127 LT 6298 2127 LT ST
(000) 3379 LC 1051 2237 WT pop 0 originOffset 50 add RSS
1037 2237 MT 1037 2237 LT 1044 2182 LT 4437 2182 LT 4444 2237 LT ST
1037 2237 MT 1037 2237 LT 1044 2292 LT 4437 2292 LT 4444 2237 LT ST
(001) 1826 LC 4458 2237 WT pop 0 originOffset 50 add RSS
4444 2237 MT 4444 2237 LT 4451 2182 LT 6298 2182 LT ST
4444 2237 MT 4444 2237 LT 4451 2292 LT 6298 2292 LT ST
(000) 5233 LC 1051 2402 WT pop 0 originOffset 50 add RSS
1037 2402 MT 1037 2402 LT 1044 2347 LT 6298 2347 LT ST
1037 2402 MT 1037 2402 LT 1044 2457 LT 6298 2457 LT ST
(000) 5233 LC 1051 2567 WT pop 0 originOffset 50 add RSS
1037 2567 MT 1037 2567 LT 1044 2512 LT 6298 2512 LT ST
1037 2567 MT 1037 2567 LT 1044 2622 LT 6298 2622 LT ST
(000) 5233 LC 1051 2732 WT pop 0 originOffset 50 add RSS
1037 2732 MT 1037 2732 LT 1044 2677 LT 6298 2677 LT ST
1037 2732 MT 1037 2732 LT 1044 2787 LT 6298 2787 LT ST
(000) 5233 LC 1051 2897 WT pop 0 originOffset 50 add RSS
1037 2897 MT 1037 2897 LT 1044 2842 LT 6298 2842 LT ST
1037 2897 MT 1037 2897 LT 1044 2952 LT 6298 2952 LT ST
(000) 5233 LC 1051 3062 WT pop 0 originOffset 50 add RSS
1037 3062 MT 1037 3062 LT 1044 3007 LT 6298 3007 LT ST
1037 3062 MT 1037 3062 LT 1044 3117 LT 6298 3117 LT ST
(000) 4969 LC 1051 3227 WT pop 0 originOffset 50 add RSS
1037 3227 MT 1037 3227 LT 1044 3172 LT 6027 3172 LT 6034 3227 LT ST
1037 3227 MT 1037 3227 LT 1044 3282 LT 6027 3282 LT 6034 3227 LT ST
(001) 236 LC 6048 3227 WT pop 0 originOffset 50 add RSS
6034 3227 MT 6034 3227 LT 6041 3172 LT 6298 3172 LT ST
6034 3227 MT 6034 3227 LT 6041 3282 LT 6298 3282 LT ST
1037 3403 MT 1037 3403 LT 1039 3348 LT 1040 3348 LT 1042 3403 LT ST
1037 3403 MT 1037 3403 LT 1039 3458 LT 1040 3458 LT 1042 3403 LT ST
(0002) 323 LC 1056 3403 WT pop 0 originOffset 50 add RSS
1042 3403 MT 1042 3403 LT 1049 3348 LT 1386 3348 LT 1393 3403 LT ST
1042 3403 MT 1042 3403 LT 1049 3458 LT 1386 3458 LT 1393 3403 LT ST
(0004) 31 LC 1407 3403 WT pop 0 originOffset 50 add RSS
1393 3403 MT 1393 3403 LT 1400 3348 LT 1445 3348 LT 1452 3403 LT ST
1393 3403 MT 1393 3403 LT 1400 3458 LT 1445 3458 LT 1452 3403 LT ST
(0006) 30 LC 1466 3403 WT pop 0 originOffset 50 add RSS
1452 3403 MT 1452 3403 LT 1459 3348 LT 1503 3348 LT 1510 3403 LT ST
1452 3403 MT 1452 3403 LT 1459 3458 LT 1503 3458 LT 1510 3403 LT ST
(0008) 346 LC 1524 3403 WT pop 0 originOffset 50 add RSS
1510 3403 MT 1510 3403 LT 1517 3348 LT 1877 3348 LT 1884 3403 LT ST
1510 3403 MT 1510 3403 LT 1517 3458 LT 1877 3458 LT 1884 3403 LT ST
(000a) 346 LC 1898 3403 WT pop 0 originOffset 50 add RSS
1884 3403 MT 1884 3403 LT 1891 3348 LT 2251 3348 LT 2258 3403 LT ST
1884 3403 MT 1884 3403 LT 1891 3458 LT 2251 3458 LT 2258 3403 LT ST
(000c) 54 LC 2272 3403 WT pop 0 originOffset 50 add RSS
2258 3403 MT 2258 3403 LT 2265 3348 LT 2333 3348 LT 2340 3403 LT ST
2258 3403 MT 2258 3403 LT 2265 3458 LT 2333 3458 LT 2340 3403 LT ST
(000e) 346 LC 2354 3403 WT pop 0 originOffset 50 add RSS
2340 3403 MT 2340 3403 LT 2347 3348 LT 2707 3348 LT 2714 3403 LT ST
2340 3403 MT 2340 3403 LT 2347 3458 LT 2707 3458 LT 2714 3403 LT ST
(0010) 54 LC 2728 3403 WT pop 0 originOffset 50 add RSS
2714 3403 MT 2714 3403 LT 2721 3348 LT 2789 3348 LT 2796 3403 LT ST
2714 3403 MT 2714 3403 LT 2721 3458 LT 2789 3458 LT 2796 3403 LT ST
(0012) 638 LC 2810 3403 WT pop 0 originOffset 50 add RSS
2796 3403 MT 2796 3403 LT 2803 3348 LT 3455 3348 LT 3462 3403 LT ST
2796 3403 MT 2796 3403 LT 2803 3458 LT 3455 3458 LT 3462 3403 LT ST
(0014) 347 LC 3476 3403 WT pop 0 originOffset 50 add RSS
3462 3403 MT 3462 3403 LT 3469 3348 LT 3830 3348 LT 3837 3403 LT ST
3462 3403 MT 3462 3403 LT 3469 3458 LT 3830 3458 LT 3837 3403 LT ST
(0016) 53 LC 3851 3403 WT pop 0 originOffset 50 add RSS
3837 3403 MT 3837 3403 LT 3844 3348 LT 3911 3348 LT 3918 3403 LT ST
3837 3403 MT 3837 3403 LT 3844 3458 LT 3911 3458 LT 3918 3403 LT ST
(0018) 54 LC 3932 3403 WT pop 0 originOffset 50 add RSS
3918 3403 MT 3918 3403 LT 3925 3348 LT 3993 3348 LT 4000 3403 LT ST
3918 3403 MT 3918 3403 LT 3925 3458 LT 3993 3458 LT 4000 3403 LT ST
(001a) 346 LC 4014 3403 WT pop 0 originOffset 50 add RSS
4000 3403 MT 4000 3403 LT 4007 3348 LT 4367 3348 LT 4374 3403 LT ST
4000 3403 MT 4000 3403 LT 4007 3458 LT 4367 3458 LT 4374 3403 LT ST
(001c) 346 LC 4388 3403 WT pop 0 originOffset 50 add RSS
4374 3403 MT 4374 3403 LT 4381 3348 LT 4741 3348 LT 4748 3403 LT ST
4374 3403 MT 4374 3403 LT 4381 3458 LT 4741 3458 LT 4748 3403 LT ST
(001e) 54 LC 4762 3403 WT pop 0 originOffset 50 add RSS
4748 3403 MT 4748 3403 LT 4755 3348 LT 4823 3348 LT 4830 3403 LT ST
4748 3403 MT 4748 3403 LT 4755 3458 LT 4823 3458 LT 4830 3403 LT ST
(0020) 54 LC 4844 3403 WT pop 0 originOffset 50 add RSS
4830 3403 MT 4830 3403 LT 4837 3348 LT 4905 3348 LT 4912 3403 LT ST
4830 3403 MT 4830 3403 LT 4837 3458 LT 4905 3458 LT 4912 3403 LT ST
(0022) 346 LC 4926 3403 WT pop 0 originOffset 50 add RSS
4912 3403 MT 4912 3403 LT 4919 3348 LT 5279 3348 LT 5286 3403 LT ST
4912 3403 MT 4912 3403 LT 4919 3458 LT 5279 3458 LT 5286 3403 LT ST
(0024) 54 LC 5300 3403 WT pop 0 originOffset 50 add RSS
5286 3403 MT 5286 3403 LT 5293 3348 LT 5361 3348 LT 5368 3403 LT ST
5286 3403 MT 5286 3403 LT 5293 3458 LT 5361 3458 LT 5368 3403 LT ST
(0026) 346 LC 5382 3403 WT pop 0 originOffset 50 add RSS
5368 3403 MT 5368 3403 LT 5375 3348 LT 5735 3348 LT 5742 3403 LT ST
5368 3403 MT 5368 3403 LT 5375 3458 LT 5735 3458 LT 5742 3403 LT ST
(0028) 31 LC 5756 3403 WT pop 0 originOffset 50 add RSS
5742 3403 MT 5742 3403 LT 5749 3348 LT 5794 3348 LT 5801 3403 LT ST
5742 3403 MT 5742 3403 LT 5749 3458 LT 5794 3458 LT 5801 3403 LT ST
(002a) 53 LC 5815 3403 WT pop 0 originOffset 50 add RSS
5801 3403 MT 5801 3403 LT 5808 3348 LT 5875 3348 LT 5882 3403 LT ST
5801 3403 MT 5801 3403 LT 5808 3458 LT 5875 3458 LT 5882 3403 LT ST
(002c) 31 LC 5896 3403 WT pop 0 originOffset 50 add RSS
5882 3403 MT 5882 3403 LT 5889 3348 LT 5934 3348 LT 5941 3403 LT ST
5882 3403 MT 5882 3403 LT 5889 3458 LT 5934 3458 LT 5941 3403 LT ST
(002e) 30 LC 5955 3403 WT pop 0 originOffset 50 add RSS
5941 3403 MT 5941 3403 LT 5948 3348 LT 5992 3348 LT 5999 3403 LT ST
5941 3403 MT 5941 3403 LT 5948 3458 LT 5992 3458 LT 5999 3403 LT ST
5999 3403 MT 5999 3403 LT 6005 3348 LT 6005 3348 LT 6011 3403 LT ST
5999 3403 MT 5999 3403 LT 6005 3458 LT 6005 3458 LT 6011 3403 LT ST
(0082) 259 LC 6025 3403 WT pop 0 originOffset 50 add RSS
6011 3403 MT 6011 3403 LT 6018 3348 LT 6298 3348 LT ST
6011 3403 MT 6011 3403 LT 6018 3458 LT 6298 3458 LT ST
% draw timeline
(0.00 ns) 9999 LC 1037 4597 WT TS RSS
1052 4455 MT 1052 4492 LS
1051 4474 MT 1053 4474 LS
1095 4455 MT 1095 4492 LS
1154 4455 MT 1154 4492 LS
1212 4455 MT 1212 4492 LS
1271 4455 MT 1271 4492 LS
1329 4455 MT 1329 4492 LS
1388 4455 MT 1388 4492 LS
1446 4455 MT 1446 4492 LS
1505 4455 MT 1505 4492 LS
1563 4455 MT 1563 4492 LS
1621 4428 MT 1621 4492 LS
1679 4455 MT 1679 4492 LS
1738 4455 MT 1738 4492 LS
1796 4455 MT 1796 4492 LS
1855 4455 MT 1855 4492 LS
1913 4455 MT 1913 4492 LS
1972 4455 MT 1972 4492 LS
2030 4455 MT 2030 4492 LS
2089 4455 MT 2089 4492 LS
2147 4455 MT 2147 4492 LS
2206 4428 MT 2206 4492 LS
(1000 ns) 9999 LC 2206 4597 WT TS RSS
2264 4455 MT 2264 4492 LS
2323 4455 MT 2323 4492 LS
2381 4455 MT 2381 4492 LS
2440 4455 MT 2440 4492 LS
2498 4455 MT 2498 4492 LS
2557 4455 MT 2557 4492 LS
2615 4455 MT 2615 4492 LS
2674 4455 MT 2674 4492 LS
2732 4455 MT 2732 4492 LS
2790 4428 MT 2790 4492 LS
2848 4455 MT 2848 4492 LS
2907 4455 MT 2907 4492 LS
2965 4455 MT 2965 4492 LS
3024 4455 MT 3024 4492 LS
3082 4455 MT 3082 4492 LS
3141 4455 MT 3141 4492 LS
3199 4455 MT 3199 4492 LS
3258 4455 MT 3258 4492 LS
3316 4455 MT 3316 4492 LS
3375 4428 MT 3375 4492 LS
(2000 ns) 9999 LC 3375 4597 WT TS RSS
3433 4455 MT 3433 4492 LS
3492 4455 MT 3492 4492 LS
3550 4455 MT 3550 4492 LS
3609 4455 MT 3609 4492 LS
3667 4455 MT 3667 4492 LS
3726 4455 MT 3726 4492 LS
3784 4455 MT 3784 4492 LS
3843 4455 MT 3843 4492 LS
3901 4455 MT 3901 4492 LS
3959 4428 MT 3959 4492 LS
4017 4455 MT 4017 4492 LS
4076 4455 MT 4076 4492 LS
4134 4455 MT 4134 4492 LS
4193 4455 MT 4193 4492 LS
4251 4455 MT 4251 4492 LS
4310 4455 MT 4310 4492 LS
4368 4455 MT 4368 4492 LS
4427 4455 MT 4427 4492 LS
4485 4455 MT 4485 4492 LS
4544 4428 MT 4544 4492 LS
(3000 ns) 9999 LC 4544 4597 WT TS RSS
4602 4455 MT 4602 4492 LS
4661 4455 MT 4661 4492 LS
4719 4455 MT 4719 4492 LS
4778 4455 MT 4778 4492 LS
4836 4455 MT 4836 4492 LS
4895 4455 MT 4895 4492 LS
4953 4455 MT 4953 4492 LS
5012 4455 MT 5012 4492 LS
5070 4455 MT 5070 4492 LS
5128 4428 MT 5128 4492 LS
5186 4455 MT 5186 4492 LS
5245 4455 MT 5245 4492 LS
5303 4455 MT 5303 4492 LS
5362 4455 MT 5362 4492 LS
5420 4455 MT 5420 4492 LS
5479 4455 MT 5479 4492 LS
5537 4455 MT 5537 4492 LS
5596 4455 MT 5596 4492 LS
5654 4455 MT 5654 4492 LS
5713 4428 MT 5713 4492 LS
(4000 ns) 9999 LC 5713 4597 WT TS RSS
5771 4455 MT 5771 4492 LS
5830 4455 MT 5830 4492 LS
5888 4455 MT 5888 4492 LS
5947 4455 MT 5947 4492 LS
6005 4455 MT 6005 4492 LS
6064 4455 MT 6064 4492 LS
6122 4455 MT 6122 4492 LS
6181 4455 MT 6181 4492 LS
6239 4455 MT 6239 4492 LS
6298 4428 MT 6298 4492 LS
6356 4455 MT 6356 4492 LS
6415 4455 MT 6415 4492 LS
6473 4455 MT 6473 4492 LS
6532 4455 MT 6532 4492 LS
6590 4455 MT 6590 4492 LS
6649 4455 MT 6649 4492 LS
6707 4455 MT 6707 4492 LS
6766 4455 MT 6766 4492 LS
6824 4455 MT 6824 4492 LS
% draw grid
1621 300 MT 1621 4428 LS
2206 300 MT 2206 4428 LS
2790 300 MT 2790 4428 LS
3375 300 MT 3375 4428 LS
3959 300 MT 3959 4428 LS
4544 300 MT 4544 4428 LS
5128 300 MT 5128 4428 LS
5713 300 MT 5713 4428 LS
6298 300 MT 6298 4428 LS
% draw waveforms
(data \(way 0\)) 9999 LC 1000 443 WT TSE RSS
1614 300 MT 1628 300 LS
2199 300 MT 2213 300 LS
2783 300 MT 2797 300 LS
3368 300 MT 3382 300 LS
3952 300 MT 3966 300 LS
4537 300 MT 4551 300 LS
5121 300 MT 5135 300 LS
5706 300 MT 5720 300 LS
6291 300 MT 6305 300 LS
(00000000000000000000000000000000 00000000000000000000000000000000 00000000000000000000000000000000 00000000000000000000000000000000 00000000000000000000000000000000 00000000000000000000000000000000 00000000000000000000000000000000 00000000000000000000000000000000) 889 LC 1051 389 WT pop 0 originOffset 50 add RSS
1037 389 MT 1037 389 LT 1044 334 LT 1947 334 LT 1954 389 LT ST
1037 389 MT 1037 389 LT 1044 444 LT 1947 444 LT 1954 389 LT ST
(baddbaddbaddbaddbaddbaddbaddbadd 00000000000000000000000000000000 00000000000000000000000000000000 00000000000000000000000000000000 00000000000000000000000000000000 00000000000000000000000000000000 00000000000000000000000000000000 00000000000000000000000000000000) 229 LC 1968 389 WT pop 0 originOffset 50 add RSS
1954 389 MT 1954 389 LT 1961 334 LT 2204 334 LT 2211 389 LT ST
1954 389 MT 1954 389 LT 1961 444 LT 2204 444 LT 2211 389 LT ST
(52205220522052205220522052205220 00000000000000000000000000000000 00000000000000000000000000000000 00000000000000000000000000000000 00000000000000000000000000000000 00000000000000000000000000000000 00000000000000000000000000000000 00000000000000000000000000000000) 428 LC 2225 389 WT pop 0 originOffset 50 add RSS
2211 389 MT 2211 389 LT 2218 334 LT 2660 334 LT 2667 389 LT ST
2211 389 MT 2211 389 LT 2218 444 LT 2660 444 LT 2667 389 LT ST
(600d600d600d600d600d600d600d600d 00000000000000000000000000000000 00000000000000000000000000000000 00000000000000000000000000000000 00000000000000000000000000000000 00000000000000000000000000000000 00000000000000000000000000000000 00000000000000000000000000000000) 849 LC 2681 389 WT pop 0 originOffset 50 add RSS
2667 389 MT 2667 389 LT 2674 334 LT 3537 334 LT 3544 389 LT ST
2667 389 MT 2667 389 LT 2674 444 LT 3537 444 LT 3544 389 LT ST
(52205220522052205220522052205220 00000000000000000000000000000000 00000000000000000000000000000000 00000000000000000000000000000000 00000000000000000000000000000000 00000000000000000000000000000000 00000000000000000000000000000000 00000000000000000000000000000000) 218 LC 3558 389 WT pop 0 originOffset 50 add RSS
3544 389 MT 3544 389 LT 3551 334 LT 3783 334 LT 3790 389 LT ST
3544 389 MT 3544 389 LT 3551 444 LT 3783 444 LT 3790 389 LT ST
(baddbaddbaddbaddbaddbaddbaddbadd 00000000000000000000000000000000 00000000000000000000000000000000 00000000000000000000000000000000 00000000000000000000000000000000 00000000000000000000000000000000 00000000000000000000000000000000 00000000000000000000000000000000) 626 LC 3804 389 WT pop 0 originOffset 50 add RSS
3790 389 MT 3790 389 LT 3797 334 LT 4437 334 LT 4444 389 LT ST
3790 389 MT 3790 389 LT 3797 444 LT 4437 444 LT 4444 389 LT ST
(baddbaddbaddbaddbaddbaddbaddbadd bffdbeedbdddbccdbbbdbaadb99db88d 00000000000000000000000000000000 00000000000000000000000000000000 00000000000000000000000000000000 00000000000000000000000000000000 00000000000000000000000000000000 00000000000000000000000000000000) 230 LC 4458 389 WT pop 0 originOffset 50 add RSS
4444 389 MT 4444 389 LT 4451 334 LT 4695 334 LT 4702 389 LT ST
4444 389 MT 4444 389 LT 4451 444 LT 4695 444 LT 4702 389 LT ST
(baddbaddbaddbaddbaddbaddbaddbadd 522051105ff05ee05dd05cc05bb05aa0 00000000000000000000000000000000 00000000000000000000000000000000 00000000000000000000000000000000 00000000000000000000000000000000 00000000000000000000000000000000 00000000000000000000000000000000) 89 LC 4716 389 WT pop 0 originOffset 50 add RSS
4702 389 MT 4702 389 LT 4709 334 LT 4812 334 LT 4819 389 LT ST
4702 389 MT 4702 389 LT 4709 444 LT 4812 444 LT 4819 389 LT ST
(baddbaddbaddbaddbaddbaddbaddbadd 522051105ff000d05dd05cc05bb05aa0 00000000000000000000000000000000 00000000000000000000000000000000 00000000000000000000000000000000 00000000000000000000000000000000 00000000000000000000000000000000 00000000000000000000000000000000) 428 LC 4833 389 WT pop 0 originOffset 50 add RSS
4819 389 MT 4819 389 LT 4826 334 LT 5268 334 LT 5275 389 LT ST
4819 389 MT 4819 389 LT 4826 444 LT 5268 444 LT 5275 389 LT ST
(baddbaddbaddbaddbaddbaddbaddbadd 522051105fe000d05dd05cc05bb05aa0 00000000000000000000000000000000 00000000000000000000000000000000 00000000000000000000000000000000 00000000000000000000000000000000 00000000000000000000000000000000 00000000000000000000000000000000) 53 LC 5289 389 WT pop 0 originOffset 50 add RSS
5275 389 MT 5275 389 LT 5282 334 LT 5349 334 LT 5356 389 LT ST
5275 389 MT 5275 389 LT 5282 444 LT 5349 444 LT 5356 389 LT ST
(baddbaddbaddbaddbaddbaddbaddbadd 522051105fe000d05dd000e05bb05aa0 00000000000000000000000000000000 00000000000000000000000000000000 00000000000000000000000000000000 00000000000000000000000000000000 00000000000000000000000000000000 00000000000000000000000000000000) 487 LC 5370 389 WT pop 0 originOffset 50 add RSS
5356 389 MT 5356 389 LT 5363 334 LT 5864 334 LT 5871 389 LT ST
5356 389 MT 5356 389 LT 5363 444 LT 5864 444 LT 5871 389 LT ST
(baddbaddbaddbaddbaddbaddbaddbadd 5220511000e000d05dd000e05bb05aa0 00000000000000000000000000000000 00000000000000000000000000000000 00000000000000000000000000000000 00000000000000000000000000000000 00000000000000000000000000000000 00000000000000000000000000000000) 135 LC 5885 389 WT pop 0 originOffset 50 add RSS
5871 389 MT 5871 389 LT 5878 334 LT 6027 334 LT 6034 389 LT ST
5871 389 MT 5871 389 LT 5878 444 LT 6027 444 LT 6034 389 LT ST
(baddbaddbaddbaddbaddbaddbaddbadd 5220511000e000d05dd000e05bb05aa0 00000000000000000000000000000000 00000000000000000000000000000000 00000000000000000000000000000000 00000000000000000000000000000000 00000000000000000000000000000000 6ddd6ccd6bbd6aad699d688d677d666d) 230 LC 6048 389 WT pop 0 originOffset 50 add RSS
6034 389 MT 6034 389 LT 6041 334 LT 6285 334 LT 6292 389 LT ST
6034 389 MT 6034 389 LT 6041 444 LT 6285 444 LT 6292 389 LT ST
6292 389 MT 6292 389 LT 6295 334 LT 6298 334 LT ST
6292 389 MT 6292 389 LT 6295 444 LT 6298 444 LT ST
([7]) 9999 LC 1000 619 WT TSE RSS
1614 487 MT 1628 487 LS
2199 487 MT 2213 487 LS
2783 487 MT 2797 487 LS
3368 487 MT 3382 487 LS
3952 487 MT 3966 487 LS
4537 487 MT 4551 487 LS
5121 487 MT 5135 487 LS
5706 487 MT 5720 487 LS
6291 487 MT 6305 487 LS
(00000000000000000000000000000000) 889 LC 1051 565 WT pop 0 originOffset 50 add RSS
1037 565 MT 1037 565 LT 1044 510 LT 1947 510 LT 1954 565 LT ST
1037 565 MT 1037 565 LT 1044 620 LT 1947 620 LT 1954 565 LT ST
(baddbaddbaddbaddbaddbaddbaddbadd) 229 LC 1968 565 WT pop 0 originOffset 50 add RSS
1954 565 MT 1954 565 LT 1961 510 LT 2204 510 LT 2211 565 LT ST
1954 565 MT 1954 565 LT 1961 620 LT 2204 620 LT 2211 565 LT ST
(52205220522052205220522052205220) 428 LC 2225 565 WT pop 0 originOffset 50 add RSS
2211 565 MT 2211 565 LT 2218 510 LT 2660 510 LT 2667 565 LT ST
2211 565 MT 2211 565 LT 2218 620 LT 2660 620 LT 2667 565 LT ST
(600d600d600d600d600d600d600d600d) 849 LC 2681 565 WT pop 0 originOffset 50 add RSS
2667 565 MT 2667 565 LT 2674 510 LT 3537 510 LT 3544 565 LT ST
2667 565 MT 2667 565 LT 2674 620 LT 3537 620 LT 3544 565 LT ST
(52205220522052205220522052205220) 218 LC 3558 565 WT pop 0 originOffset 50 add RSS
3544 565 MT 3544 565 LT 3551 510 LT 3783 510 LT 3790 565 LT ST
3544 565 MT 3544 565 LT 3551 620 LT 3783 620 LT 3790 565 LT ST
(baddbaddbaddbaddbaddbaddbaddbadd) 2480 LC 3804 565 WT pop 0 originOffset 50 add RSS
3790 565 MT 3790 565 LT 3797 510 LT 6298 510 LT ST
3790 565 MT 3790 565 LT 3797 620 LT 6298 620 LT ST
([6]) 9999 LC 1000 784 WT TSE RSS
1614 652 MT 1628 652 LS
2199 652 MT 2213 652 LS
2783 652 MT 2797 652 LS
3368 652 MT 3382 652 LS
3952 652 MT 3966 652 LS
4537 652 MT 4551 652 LS
5121 652 MT 5135 652 LS
5706 652 MT 5720 652 LS
6291 652 MT 6305 652 LS
(00000000000000000000000000000000) 3379 LC 1051 730 WT pop 0 originOffset 50 add RSS
1037 730 MT 1037 730 LT 1044 675 LT 4437 675 LT 4444 730 LT ST
1037 730 MT 1037 730 LT 1044 785 LT 4437 785 LT 4444 730 LT ST
(bffdbeedbdddbccdbbbdbaadb99db88d) 230 LC 4458 730 WT pop 0 originOffset 50 add RSS
4444 730 MT 4444 730 LT 4451 675 LT 4695 675 LT 4702 730 LT ST
4444 730 MT 4444 730 LT 4451 785 LT 4695 785 LT 4702 730 LT ST
(522051105ff05ee05dd05cc05bb05aa0) 89 LC 4716 730 WT pop 0 originOffset 50 add RSS
4702 730 MT 4702 730 LT 4709 675 LT 4812 675 LT 4819 730 LT ST
4702 730 MT 4702 730 LT 4709 785 LT 4812 785 LT 4819 730 LT ST
(522051105ff000d05dd05cc05bb05aa0) 428 LC 4833 730 WT pop 0 originOffset 50 add RSS
4819 730 MT 4819 730 LT 4826 675 LT 5268 675 LT 5275 730 LT ST
4819 730 MT 4819 730 LT 4826 785 LT 5268 785 LT 5275 730 LT ST
(522051105fe000d05dd05cc05bb05aa0) 53 LC 5289 730 WT pop 0 originOffset 50 add RSS
5275 730 MT 5275 730 LT 5282 675 LT 5349 675 LT 5356 730 LT ST
5275 730 MT 5275 730 LT 5282 785 LT 5349 785 LT 5356 730 LT ST
(522051105fe000d05dd000e05bb05aa0) 487 LC 5370 730 WT pop 0 originOffset 50 add RSS
5356 730 MT 5356 730 LT 5363 675 LT 5864 675 LT 5871 730 LT ST
5356 730 MT 5356 730 LT 5363 785 LT 5864 785 LT 5871 730 LT ST
(5220511000e000d05dd000e05bb05aa0) 399 LC 5885 730 WT pop 0 originOffset 50 add RSS
5871 730 MT 5871 730 LT 5878 675 LT 6298 675 LT ST
5871 730 MT 5871 730 LT 5878 785 LT 6298 785 LT ST
([5]) 9999 LC 1000 949 WT TSE RSS
1614 817 MT 1628 817 LS
2199 817 MT 2213 817 LS
2783 817 MT 2797 817 LS
3368 817 MT 3382 817 LS
3952 817 MT 3966 817 LS
4537 817 MT 4551 817 LS
5121 817 MT 5135 817 LS
5706 817 MT 5720 817 LS
6291 817 MT 6305 817 LS
(00000000000000000000000000000000) 5233 LC 1051 895 WT pop 0 originOffset 50 add RSS
1037 895 MT 1037 895 LT 1044 840 LT 6298 840 LT ST
1037 895 MT 1037 895 LT 1044 950 LT 6298 950 LT ST
([4]) 9999 LC 1000 1114 WT TSE RSS
1614 982 MT 1628 982 LS
2199 982 MT 2213 982 LS
2783 982 MT 2797 982 LS
3368 982 MT 3382 982 LS
3952 982 MT 3966 982 LS
4537 982 MT 4551 982 LS
5121 982 MT 5135 982 LS
5706 982 MT 5720 982 LS
6291 982 MT 6305 982 LS
(00000000000000000000000000000000) 5233 LC 1051 1060 WT pop 0 originOffset 50 add RSS
1037 1060 MT 1037 1060 LT 1044 1005 LT 6298 1005 LT ST
1037 1060 MT 1037 1060 LT 1044 1115 LT 6298 1115 LT ST
([3]) 9999 LC 1000 1279 WT TSE RSS
1614 1147 MT 1628 1147 LS
2199 1147 MT 2213 1147 LS
2783 1147 MT 2797 1147 LS
3368 1147 MT 3382 1147 LS
3952 1147 MT 3966 1147 LS
4537 1147 MT 4551 1147 LS
5121 1147 MT 5135 1147 LS
5706 1147 MT 5720 1147 LS
6291 1147 MT 6305 1147 LS
(00000000000000000000000000000000) 5233 LC 1051 1225 WT pop 0 originOffset 50 add RSS
1037 1225 MT 1037 1225 LT 1044 1170 LT 6298 1170 LT ST
1037 1225 MT 1037 1225 LT 1044 1280 LT 6298 1280 LT ST
([2]) 9999 LC 1000 1444 WT TSE RSS
1614 1312 MT 1628 1312 LS
2199 1312 MT 2213 1312 LS
2783 1312 MT 2797 1312 LS
3368 1312 MT 3382 1312 LS
3952 1312 MT 3966 1312 LS
4537 1312 MT 4551 1312 LS
5121 1312 MT 5135 1312 LS
5706 1312 MT 5720 1312 LS
6291 1312 MT 6305 1312 LS
(00000000000000000000000000000000) 5233 LC 1051 1390 WT pop 0 originOffset 50 add RSS
1037 1390 MT 1037 1390 LT 1044 1335 LT 6298 1335 LT ST
1037 1390 MT 1037 1390 LT 1044 1445 LT 6298 1445 LT ST
([1]) 9999 LC 1000 1609 WT TSE RSS
1614 1477 MT 1628 1477 LS
2199 1477 MT 2213 1477 LS
2783 1477 MT 2797 1477 LS
3368 1477 MT 3382 1477 LS
3952 1477 MT 3966 1477 LS
4537 1477 MT 4551 1477 LS
5121 1477 MT 5135 1477 LS
5706 1477 MT 5720 1477 LS
6291 1477 MT 6305 1477 LS
(00000000000000000000000000000000) 5233 LC 1051 1555 WT pop 0 originOffset 50 add RSS
1037 1555 MT 1037 1555 LT 1044 1500 LT 6298 1500 LT ST
1037 1555 MT 1037 1555 LT 1044 1610 LT 6298 1610 LT ST
([0]) 9999 LC 1000 1774 WT TSE RSS
1614 1642 MT 1628 1642 LS
2199 1642 MT 2213 1642 LS
2783 1642 MT 2797 1642 LS
3368 1642 MT 3382 1642 LS
3952 1642 MT 3966 1642 LS
4537 1642 MT 4551 1642 LS
5121 1642 MT 5135 1642 LS
5706 1642 MT 5720 1642 LS
6291 1642 MT 6305 1642 LS
(00000000000000000000000000000000) 4969 LC 1051 1720 WT pop 0 originOffset 50 add RSS
1037 1720 MT 1037 1720 LT 1044 1665 LT 6027 1665 LT 6034 1720 LT ST
1037 1720 MT 1037 1720 LT 1044 1775 LT 6027 1775 LT 6034 1720 LT ST
(6ddd6ccd6bbd6aad699d688d677d666d) 230 LC 6048 1720 WT pop 0 originOffset 50 add RSS
6034 1720 MT 6034 1720 LT 6041 1665 LT 6285 1665 LT 6292 1720 LT ST
6034 1720 MT 6034 1720 LT 6041 1775 LT 6285 1775 LT 6292 1720 LT ST
6292 1720 MT 6292 1720 LT 6295 1665 LT 6298 1665 LT ST
6292 1720 MT 6292 1720 LT 6295 1775 LT 6298 1775 LT ST
(tag \(way 0\)) 9999 LC 1000 1950 WT TSE RSS
1614 1807 MT 1628 1807 LS
2199 1807 MT 2213 1807 LS
2783 1807 MT 2797 1807 LS
3368 1807 MT 3382 1807 LS
3952 1807 MT 3966 1807 LS
4537 1807 MT 4551 1807 LS
5121 1807 MT 5135 1807 LS
5706 1807 MT 5720 1807 LS
6291 1807 MT 6305 1807 LS
(000 000 000 000 000 000 000 000) 889 LC 1051 1896 WT pop 0 originOffset 50 add RSS
1037 1896 MT 1037 1896 LT 1044 1841 LT 1947 1841 LT 1954 1896 LT ST
1037 1896 MT 1037 1896 LT 1044 1951 LT 1947 1951 LT 1954 1896 LT ST
(001 000 000 000 000 000 000 000) 440 LC 1968 1896 WT pop 0 originOffset 50 add RSS
1954 1896 MT 1954 1896 LT 1961 1841 LT 2415 1841 LT 2422 1896 LT ST
1954 1896 MT 1954 1896 LT 1961 1951 LT 2415 1951 LT 2422 1896 LT ST
(000 000 000 000 000 000 000 000) 1094 LC 2436 1896 WT pop 0 originOffset 50 add RSS
2422 1896 MT 2422 1896 LT 2429 1841 LT 3537 1841 LT 3544 1896 LT ST
2422 1896 MT 2422 1896 LT 2429 1951 LT 3537 1951 LT 3544 1896 LT ST
(002 000 000 000 000 000 000 000) 872 LC 3558 1896 WT pop 0 originOffset 50 add RSS
3544 1896 MT 3544 1896 LT 3551 1841 LT 4437 1841 LT 4444 1896 LT ST
3544 1896 MT 3544 1896 LT 3551 1951 LT 4437 1951 LT 4444 1896 LT ST
(002 001 000 000 000 000 000 000) 1562 LC 4458 1896 WT pop 0 originOffset 50 add RSS
4444 1896 MT 4444 1896 LT 4451 1841 LT 6027 1841 LT 6034 1896 LT ST
4444 1896 MT 4444 1896 LT 4451 1951 LT 6027 1951 LT 6034 1896 LT ST
(002 001 000 000 000 000 000 001) 236 LC 6048 1896 WT pop 0 originOffset 50 add RSS
6034 1896 MT 6034 1896 LT 6041 1841 LT 6298 1841 LT ST
6034 1896 MT 6034 1896 LT 6041 1951 LT 6298 1951 LT ST
([7]) 9999 LC 1000 2126 WT TSE RSS
1614 1994 MT 1628 1994 LS
2199 1994 MT 2213 1994 LS
2783 1994 MT 2797 1994 LS
3368 1994 MT 3382 1994 LS
3952 1994 MT 3966 1994 LS
4537 1994 MT 4551 1994 LS
5121 1994 MT 5135 1994 LS
5706 1994 MT 5720 1994 LS
6291 1994 MT 6305 1994 LS
(000) 889 LC 1051 2072 WT pop 0 originOffset 50 add RSS
1037 2072 MT 1037 2072 LT 1044 2017 LT 1947 2017 LT 1954 2072 LT ST
1037 2072 MT 1037 2072 LT 1044 2127 LT 1947 2127 LT 1954 2072 LT ST
(001) 440 LC 1968 2072 WT pop 0 originOffset 50 add RSS
1954 2072 MT 1954 2072 LT 1961 2017 LT 2415 2017 LT 2422 2072 LT ST
1954 2072 MT 1954 2072 LT 1961 2127 LT 2415 2127 LT 2422 2072 LT ST
(000) 1094 LC 2436 2072 WT pop 0 originOffset 50 add RSS
2422 2072 MT 2422 2072 LT 2429 2017 LT 3537 2017 LT 3544 2072 LT ST
2422 2072 MT 2422 2072 LT 2429 2127 LT 3537 2127 LT 3544 2072 LT ST
(002) 2726 LC 3558 2072 WT pop 0 originOffset 50 add RSS
3544 2072 MT 3544 2072 LT 3551 2017 LT 6298 2017 LT ST
3544 2072 MT 3544 2072 LT 3551 2127 LT 6298 2127 LT ST
([6]) 9999 LC 1000 2291 WT TSE RSS
1614 2159 MT 1628 2159 LS
2199 2159 MT 2213 2159 LS
2783 2159 MT 2797 2159 LS
3368 2159 MT 3382 2159 LS
3952 2159 MT 3966 2159 LS
4537 2159 MT 4551 2159 LS
5121 2159 MT 5135 2159 LS
5706 2159 MT 5720 2159 LS
6291 2159 MT 6305 2159 LS
(000) 3379 LC 1051 2237 WT pop 0 originOffset 50 add RSS
1037 2237 MT 1037 2237 LT 1044 2182 LT 4437 2182 LT 4444 2237 LT ST
1037 2237 MT 1037 2237 LT 1044 2292 LT 4437 2292 LT 4444 2237 LT ST
(001) 1826 LC 4458 2237 WT pop 0 originOffset 50 add RSS
4444 2237 MT 4444 2237 LT 4451 2182 LT 6298 2182 LT ST
4444 2237 MT 4444 2237 LT 4451 2292 LT 6298 2292 LT ST
([5]) 9999 LC 1000 2456 WT TSE RSS
1614 2324 MT 1628 2324 LS
2199 2324 MT 2213 2324 LS
2783 2324 MT 2797 2324 LS
3368 2324 MT 3382 2324 LS
3952 2324 MT 3966 2324 LS
4537 2324 MT 4551 2324 LS
5121 2324 MT 5135 2324 LS
5706 2324 MT 5720 2324 LS
6291 2324 MT 6305 2324 LS
(000) 5233 LC 1051 2402 WT pop 0 originOffset 50 add RSS
1037 2402 MT 1037 2402 LT 1044 2347 LT 6298 2347 LT ST
1037 2402 MT 1037 2402 LT 1044 2457 LT 6298 2457 LT ST
([4]) 9999 LC 1000 2621 WT TSE RSS
1614 2489 MT 1628 2489 LS
2199 2489 MT 2213 2489 LS
2783 2489 MT 2797 2489 LS
3368 2489 MT 3382 2489 LS
3952 2489 MT 3966 2489 LS
4537 2489 MT 4551 2489 LS
5121 2489 MT 5135 2489 LS
5706 2489 MT 5720 2489 LS
6291 2489 MT 6305 2489 LS
(000) 5233 LC 1051 2567 WT pop 0 originOffset 50 add RSS
1037 2567 MT 1037 2567 LT 1044 2512 LT 6298 2512 LT ST
1037 2567 MT 1037 2567 LT 1044 2622 LT 6298 2622 LT ST
([3]) 9999 LC 1000 2786 WT TSE RSS
1614 2654 MT 1628 2654 LS
2199 2654 MT 2213 2654 LS
2783 2654 MT 2797 2654 LS
3368 2654 MT 3382 2654 LS
3952 2654 MT 3966 2654 LS
4537 2654 MT 4551 2654 LS
5121 2654 MT 5135 2654 LS
5706 2654 MT 5720 2654 LS
6291 2654 MT 6305 2654 LS
(000) 5233 LC 1051 2732 WT pop 0 originOffset 50 add RSS
1037 2732 MT 1037 2732 LT 1044 2677 LT 6298 2677 LT ST
1037 2732 MT 1037 2732 LT 1044 2787 LT 6298 2787 LT ST
([2]) 9999 LC 1000 2951 WT TSE RSS
1614 2819 MT 1628 2819 LS
2199 2819 MT 2213 2819 LS
2783 2819 MT 2797 2819 LS
3368 2819 MT 3382 2819 LS
3952 2819 MT 3966 2819 LS
4537 2819 MT 4551 2819 LS
5121 2819 MT 5135 2819 LS
5706 2819 MT 5720 2819 LS
6291 2819 MT 6305 2819 LS
(000) 5233 LC 1051 2897 WT pop 0 originOffset 50 add RSS
1037 2897 MT 1037 2897 LT 1044 2842 LT 6298 2842 LT ST
1037 2897 MT 1037 2897 LT 1044 2952 LT 6298 2952 LT ST
([1]) 9999 LC 1000 3116 WT TSE RSS
1614 2984 MT 1628 2984 LS
2199 2984 MT 2213 2984 LS
2783 2984 MT 2797 2984 LS
3368 2984 MT 3382 2984 LS
3952 2984 MT 3966 2984 LS
4537 2984 MT 4551 2984 LS
5121 2984 MT 5135 2984 LS
5706 2984 MT 5720 2984 LS
6291 2984 MT 6305 2984 LS
(000) 5233 LC 1051 3062 WT pop 0 originOffset 50 add RSS
1037 3062 MT 1037 3062 LT 1044 3007 LT 6298 3007 LT ST
1037 3062 MT 1037 3062 LT 1044 3117 LT 6298 3117 LT ST
([0]) 9999 LC 1000 3281 WT TSE RSS
1614 3149 MT 1628 3149 LS
2199 3149 MT 2213 3149 LS
2783 3149 MT 2797 3149 LS
3368 3149 MT 3382 3149 LS
3952 3149 MT 3966 3149 LS
4537 3149 MT 4551 3149 LS
5121 3149 MT 5135 3149 LS
5706 3149 MT 5720 3149 LS
6291 3149 MT 6305 3149 LS
(000) 4969 LC 1051 3227 WT pop 0 originOffset 50 add RSS
1037 3227 MT 1037 3227 LT 1044 3172 LT 6027 3172 LT 6034 3227 LT ST
1037 3227 MT 1037 3227 LT 1044 3282 LT 6027 3282 LT 6034 3227 LT ST
(001) 236 LC 6048 3227 WT pop 0 originOffset 50 add RSS
6034 3227 MT 6034 3227 LT 6041 3172 LT 6298 3172 LT ST
6034 3227 MT 6034 3227 LT 6041 3282 LT 6298 3282 LT ST
(pc_out) 9999 LC 1000 3457 WT TSE RSS
1614 3314 MT 1628 3314 LS
2199 3314 MT 2213 3314 LS
2783 3314 MT 2797 3314 LS
3368 3314 MT 3382 3314 LS
3952 3314 MT 3966 3314 LS
4537 3314 MT 4551 3314 LS
5121 3314 MT 5135 3314 LS
5706 3314 MT 5720 3314 LS
6291 3314 MT 6305 3314 LS
1037 3403 MT 1037 3403 LT 1039 3348 LT 1040 3348 LT 1042 3403 LT ST
1037 3403 MT 1037 3403 LT 1039 3458 LT 1040 3458 LT 1042 3403 LT ST
(0002) 323 LC 1056 3403 WT pop 0 originOffset 50 add RSS
1042 3403 MT 1042 3403 LT 1049 3348 LT 1386 3348 LT 1393 3403 LT ST
1042 3403 MT 1042 3403 LT 1049 3458 LT 1386 3458 LT 1393 3403 LT ST
(0004) 31 LC 1407 3403 WT pop 0 originOffset 50 add RSS
1393 3403 MT 1393 3403 LT 1400 3348 LT 1445 3348 LT 1452 3403 LT ST
1393 3403 MT 1393 3403 LT 1400 3458 LT 1445 3458 LT 1452 3403 LT ST
(0006) 30 LC 1466 3403 WT pop 0 originOffset 50 add RSS
1452 3403 MT 1452 3403 LT 1459 3348 LT 1503 3348 LT 1510 3403 LT ST
1452 3403 MT 1452 3403 LT 1459 3458 LT 1503 3458 LT 1510 3403 LT ST
(0008) 346 LC 1524 3403 WT pop 0 originOffset 50 add RSS
1510 3403 MT 1510 3403 LT 1517 3348 LT 1877 3348 LT 1884 3403 LT ST
1510 3403 MT 1510 3403 LT 1517 3458 LT 1877 3458 LT 1884 3403 LT ST
(000a) 346 LC 1898 3403 WT pop 0 originOffset 50 add RSS
1884 3403 MT 1884 3403 LT 1891 3348 LT 2251 3348 LT 2258 3403 LT ST
1884 3403 MT 1884 3403 LT 1891 3458 LT 2251 3458 LT 2258 3403 LT ST
(000c) 54 LC 2272 3403 WT pop 0 originOffset 50 add RSS
2258 3403 MT 2258 3403 LT 2265 3348 LT 2333 3348 LT 2340 3403 LT ST
2258 3403 MT 2258 3403 LT 2265 3458 LT 2333 3458 LT 2340 3403 LT ST
(000e) 346 LC 2354 3403 WT pop 0 originOffset 50 add RSS
2340 3403 MT 2340 3403 LT 2347 3348 LT 2707 3348 LT 2714 3403 LT ST
2340 3403 MT 2340 3403 LT 2347 3458 LT 2707 3458 LT 2714 3403 LT ST
(0010) 54 LC 2728 3403 WT pop 0 originOffset 50 add RSS
2714 3403 MT 2714 3403 LT 2721 3348 LT 2789 3348 LT 2796 3403 LT ST
2714 3403 MT 2714 3403 LT 2721 3458 LT 2789 3458 LT 2796 3403 LT ST
(0012) 638 LC 2810 3403 WT pop 0 originOffset 50 add RSS
2796 3403 MT 2796 3403 LT 2803 3348 LT 3455 3348 LT 3462 3403 LT ST
2796 3403 MT 2796 3403 LT 2803 3458 LT 3455 3458 LT 3462 3403 LT ST
(0014) 347 LC 3476 3403 WT pop 0 originOffset 50 add RSS
3462 3403 MT 3462 3403 LT 3469 3348 LT 3830 3348 LT 3837 3403 LT ST
3462 3403 MT 3462 3403 LT 3469 3458 LT 3830 3458 LT 3837 3403 LT ST
(0016) 53 LC 3851 3403 WT pop 0 originOffset 50 add RSS
3837 3403 MT 3837 3403 LT 3844 3348 LT 3911 3348 LT 3918 3403 LT ST
3837 3403 MT 3837 3403 LT 3844 3458 LT 3911 3458 LT 3918 3403 LT ST
(0018) 54 LC 3932 3403 WT pop 0 originOffset 50 add RSS
3918 3403 MT 3918 3403 LT 3925 3348 LT 3993 3348 LT 4000 3403 LT ST
3918 3403 MT 3918 3403 LT 3925 3458 LT 3993 3458 LT 4000 3403 LT ST
(001a) 346 LC 4014 3403 WT pop 0 originOffset 50 add RSS
4000 3403 MT 4000 3403 LT 4007 3348 LT 4367 3348 LT 4374 3403 LT ST
4000 3403 MT 4000 3403 LT 4007 3458 LT 4367 3458 LT 4374 3403 LT ST
(001c) 346 LC 4388 3403 WT pop 0 originOffset 50 add RSS
4374 3403 MT 4374 3403 LT 4381 3348 LT 4741 3348 LT 4748 3403 LT ST
4374 3403 MT 4374 3403 LT 4381 3458 LT 4741 3458 LT 4748 3403 LT ST
(001e) 54 LC 4762 3403 WT pop 0 originOffset 50 add RSS
4748 3403 MT 4748 3403 LT 4755 3348 LT 4823 3348 LT 4830 3403 LT ST
4748 3403 MT 4748 3403 LT 4755 3458 LT 4823 3458 LT 4830 3403 LT ST
(0020) 54 LC 4844 3403 WT pop 0 originOffset 50 add RSS
4830 3403 MT 4830 3403 LT 4837 3348 LT 4905 3348 LT 4912 3403 LT ST
4830 3403 MT 4830 3403 LT 4837 3458 LT 4905 3458 LT 4912 3403 LT ST
(0022) 346 LC 4926 3403 WT pop 0 originOffset 50 add RSS
4912 3403 MT 4912 3403 LT 4919 3348 LT 5279 3348 LT 5286 3403 LT ST
4912 3403 MT 4912 3403 LT 4919 3458 LT 5279 3458 LT 5286 3403 LT ST
(0024) 54 LC 5300 3403 WT pop 0 originOffset 50 add RSS
5286 3403 MT 5286 3403 LT 5293 3348 LT 5361 3348 LT 5368 3403 LT ST
5286 3403 MT 5286 3403 LT 5293 3458 LT 5361 3458 LT 5368 3403 LT ST
(0026) 346 LC 5382 3403 WT pop 0 originOffset 50 add RSS
5368 3403 MT 5368 3403 LT 5375 3348 LT 5735 3348 LT 5742 3403 LT ST
5368 3403 MT 5368 3403 LT 5375 3458 LT 5735 3458 LT 5742 3403 LT ST
(0028) 31 LC 5756 3403 WT pop 0 originOffset 50 add RSS
5742 3403 MT 5742 3403 LT 5749 3348 LT 5794 3348 LT 5801 3403 LT ST
5742 3403 MT 5742 3403 LT 5749 3458 LT 5794 3458 LT 5801 3403 LT ST
(002a) 53 LC 5815 3403 WT pop 0 originOffset 50 add RSS
5801 3403 MT 5801 3403 LT 5808 3348 LT 5875 3348 LT 5882 3403 LT ST
5801 3403 MT 5801 3403 LT 5808 3458 LT 5875 3458 LT 5882 3403 LT ST
(002c) 31 LC 5896 3403 WT pop 0 originOffset 50 add RSS
5882 3403 MT 5882 3403 LT 5889 3348 LT 5934 3348 LT 5941 3403 LT ST
5882 3403 MT 5882 3403 LT 5889 3458 LT 5934 3458 LT 5941 3403 LT ST
(002e) 30 LC 5955 3403 WT pop 0 originOffset 50 add RSS
5941 3403 MT 5941 3403 LT 5948 3348 LT 5992 3348 LT 5999 3403 LT ST
5941 3403 MT 5941 3403 LT 5948 3458 LT 5992 3458 LT 5999 3403 LT ST
5999 3403 MT 5999 3403 LT 6005 3348 LT 6005 3348 LT 6011 3403 LT ST
5999 3403 MT 5999 3403 LT 6005 3458 LT 6005 3458 LT 6011 3403 LT ST
(0082) 259 LC 6025 3403 WT pop 0 originOffset 50 add RSS
6011 3403 MT 6011 3403 LT 6018 3348 LT 6298 3348 LT ST
6011 3403 MT 6011 3403 LT 6018 3458 LT 6298 3458 LT ST
% draw footer
(Entity:mp2_tb  Architecture:  Date: Sun Oct 08 15:00:38 CDT 2017   Row: 1 Page: 1) 9999 LC 300 4799 WT TSW RSS
grestore
showpage
%%EOF
