%!PS-Adobe-3.0
%%Creator: Model Technology ModelSim ALTERA STARTER EDITION vsim 10.1d Simulator 2012.11 Nov  2 2012
%%Title: mp2_last1000cpu.ps
%%CreationDate: 2017-10-08 03:08:15 PM
%%DocumentData: Clean8Bit
%%DocumentNeededResources: font Helvetica
%%Orientation: Landscape
%%PageOrder: ascend
%%Pages: 1
%%EndComments
%%BeginSetup
%%BeginFeature: *PageSize 8.5x11.0
<< /PageSize [612.0 792.0]
/ImagingBBox null
>> setpagedevice
%%EndFeature
%%EndSetup
%%Page: 1 1
gsave
90 rotate 0.12 dup neg scale
% dump string table
/NP {newpath} def/SD {setdash} def/CL {setrgbcolor} def/GR {setgray} def
/SX {exch LEdge sub XScale mul MaxLabelWidth add LMargin add LEdge LabelWidth sub add exch} def/CSX {exch dup LabelWidth gt {exch SX} {exch} ifelse} def
/MT {SX moveto} def/LS {SX lineto stroke} def/LT {SX lineto} def/LFS {SX lineto fill stroke} def/RSS {rmoveto show stroke} def/ST {stroke} def/WT {CSX moveto dup stringwidth pop} def/TSW {pop 0 originOffset} def
/TSE {MaxLabelWidth LabelWidth sub LMargin add 0 rmoveto neg originOffset} def/TS {-2 div originOffset CSX} def
/MLW {stringwidth pop dup MaxLabelWidth gt {/MaxLabelWidth exch def}{pop} ifelse XS} def
/XS {/XScale LabelWidth LMargin sub MaxLabelWidth LEdge LabelWidth sub add sub REdge LEdge sub div 1 add def} def
/ARC {5 -2 roll SX 5 2 roll arc} def/LC {1 index stringwidth pop lt {pop ()} if} def
/SW {stringwidth pop} def
/ESTR {   dup 3 add string   /CurrentStr exch def   exch 0 2 index getinterval   0 1 3 index 1 sub {     dup     2 index exch get exch     CurrentStr exch 3 -1 roll put   } for   pop   dup 1 2 2 index add {     CurrentStr exch 46 put   } for   pop} def
/LC {   exch  dup dup /CurrentStr exch def   SW 2 index gt {     CurrentStr length     dup     {       2 div cvi       3 index       CurrentStr SW       sub       dup 0 lt {         1 index         4 -1 roll         exch sub         3 1 roll       }       {         dup 5 index gt {           1 index 4 -1 roll add 3 1 roll         }         {           exit         } ifelse       } ifelse       3 index 2 index ESTR       1 index 0 eq {         exit       } if       pop     } loop     pop pop pop pop pop     CurrentStr   }   {     CurrentStr   } ifelse} def
/XScale 1 def/MaxLabelWidth 0 def/LMargin 300 def/LEdge 1212 def/REdge 5699 def/LabelWidth 1175 def
/Helvetica findfont [100 0 0 -100 0 0] makefont setfont
/originOffset   currentfont   /FontBBox get 1 get   currentfont  /FontMatrix get 3 get   mul   currentfont   /FontType get   42 eq {     1000000 div   } {     neg   } ifelse def
(clk) MLW
(pc_out) MLW
(mem_address) MLW
(mem_read) MLW
(mem_rdata) MLW
(mem_write) MLW
(mem_byte_enable) MLW
(mem_wdata) MLW
(regfile) MLW
([7]) MLW
([6]) MLW
([5]) MLW
([4]) MLW
([3]) MLW
([2]) MLW
([1]) MLW
([0]) MLW
(state) MLW
% draw waveform shading
[] 0 SD
3 setlinewidth
0 setlinejoin
0 setlinecap
0 0 0 CL
1212 444 MT 1212 334 LS
1213 444 MT 1237 444 LS
1237 444 MT 1237 334 LS
1238 334 MT 1262 334 LS
1262 444 MT 1262 334 LS
1263 444 MT 1288 444 LS
1288 444 MT 1288 334 LS
1289 334 MT 1313 334 LS
1313 444 MT 1313 334 LS
1314 444 MT 1339 444 LS
1339 444 MT 1339 334 LS
1340 334 MT 1364 334 LS
1364 444 MT 1364 334 LS
1365 444 MT 1390 444 LS
1390 444 MT 1390 334 LS
1391 334 MT 1415 334 LS
1415 444 MT 1415 334 LS
1416 444 MT 1440 444 LS
1440 444 MT 1440 334 LS
1441 334 MT 1466 334 LS
1466 444 MT 1466 334 LS
1467 444 MT 1491 444 LS
1491 444 MT 1491 334 LS
1492 334 MT 1517 334 LS
1517 444 MT 1517 334 LS
1518 444 MT 1542 444 LS
1542 444 MT 1542 334 LS
1543 334 MT 1568 334 LS
1568 444 MT 1568 334 LS
1569 444 MT 1593 444 LS
1593 444 MT 1593 334 LS
1594 334 MT 1618 334 LS
1618 444 MT 1618 334 LS
1619 444 MT 1644 444 LS
1644 444 MT 1644 334 LS
1645 334 MT 1669 334 LS
1669 444 MT 1669 334 LS
1670 444 MT 1695 444 LS
1695 444 MT 1695 334 LS
1696 334 MT 1720 334 LS
1720 444 MT 1720 334 LS
1721 444 MT 1746 444 LS
1746 444 MT 1746 334 LS
1747 334 MT 1771 334 LS
1771 444 MT 1771 334 LS
1772 444 MT 1796 444 LS
1796 444 MT 1796 334 LS
1797 334 MT 1822 334 LS
1822 444 MT 1822 334 LS
1823 444 MT 1847 444 LS
1847 444 MT 1847 334 LS
1848 334 MT 1873 334 LS
1873 444 MT 1873 334 LS
1874 444 MT 1898 444 LS
1898 444 MT 1898 334 LS
1899 334 MT 1924 334 LS
1924 444 MT 1924 334 LS
1925 444 MT 1949 444 LS
1949 444 MT 1949 334 LS
1950 334 MT 1974 334 LS
1974 444 MT 1974 334 LS
1975 444 MT 2000 444 LS
2000 444 MT 2000 334 LS
2001 334 MT 2025 334 LS
2025 444 MT 2025 334 LS
2026 444 MT 2051 444 LS
2051 444 MT 2051 334 LS
2052 334 MT 2076 334 LS
2076 444 MT 2076 334 LS
2077 444 MT 2102 444 LS
2102 444 MT 2102 334 LS
2103 334 MT 2127 334 LS
2127 444 MT 2127 334 LS
2128 444 MT 2152 444 LS
2152 444 MT 2152 334 LS
2153 334 MT 2178 334 LS
2178 444 MT 2178 334 LS
2179 444 MT 2203 444 LS
2203 444 MT 2203 334 LS
2204 334 MT 2229 334 LS
2229 444 MT 2229 334 LS
2230 444 MT 2254 444 LS
2254 444 MT 2254 334 LS
2255 334 MT 2280 334 LS
2280 444 MT 2280 334 LS
2281 444 MT 2305 444 LS
2305 444 MT 2305 334 LS
2306 334 MT 2330 334 LS
2330 444 MT 2330 334 LS
2331 444 MT 2356 444 LS
2356 444 MT 2356 334 LS
2357 334 MT 2381 334 LS
2381 444 MT 2381 334 LS
2382 444 MT 2407 444 LS
2407 444 MT 2407 334 LS
2408 334 MT 2432 334 LS
2432 444 MT 2432 334 LS
2433 444 MT 2458 444 LS
2458 444 MT 2458 334 LS
2459 334 MT 2483 334 LS
2483 444 MT 2483 334 LS
2484 444 MT 2508 444 LS
2508 444 MT 2508 334 LS
2509 334 MT 2534 334 LS
2534 444 MT 2534 334 LS
2535 444 MT 2559 444 LS
2559 444 MT 2559 334 LS
2560 334 MT 2585 334 LS
2585 444 MT 2585 334 LS
2586 444 MT 2610 444 LS
2610 444 MT 2610 334 LS
2611 334 MT 2636 334 LS
2636 444 MT 2636 334 LS
2637 444 MT 2661 444 LS
2661 444 MT 2661 334 LS
2662 334 MT 2686 334 LS
2686 444 MT 2686 334 LS
2687 444 MT 2712 444 LS
2712 444 MT 2712 334 LS
2713 334 MT 2737 334 LS
2737 444 MT 2737 334 LS
2738 444 MT 2763 444 LS
2763 444 MT 2763 334 LS
2764 334 MT 2788 334 LS
2788 444 MT 2788 334 LS
2789 444 MT 2814 444 LS
2814 444 MT 2814 334 LS
2815 334 MT 2839 334 LS
2839 444 MT 2839 334 LS
2840 444 MT 2864 444 LS
2864 444 MT 2864 334 LS
2865 334 MT 2890 334 LS
2890 444 MT 2890 334 LS
2891 444 MT 2915 444 LS
2915 444 MT 2915 334 LS
2916 334 MT 2941 334 LS
2941 444 MT 2941 334 LS
2942 444 MT 2966 444 LS
2966 444 MT 2966 334 LS
2967 334 MT 2992 334 LS
2992 444 MT 2992 334 LS
2993 444 MT 3017 444 LS
3017 444 MT 3017 334 LS
3018 334 MT 3042 334 LS
3042 444 MT 3042 334 LS
3043 444 MT 3068 444 LS
3068 444 MT 3068 334 LS
3069 334 MT 3093 334 LS
3093 444 MT 3093 334 LS
3094 444 MT 3119 444 LS
3119 444 MT 3119 334 LS
3120 334 MT 3144 334 LS
3144 444 MT 3144 334 LS
3145 444 MT 3170 444 LS
3170 444 MT 3170 334 LS
3171 334 MT 3195 334 LS
3195 444 MT 3195 334 LS
3196 444 MT 3220 444 LS
3220 444 MT 3220 334 LS
3221 334 MT 3246 334 LS
3246 444 MT 3246 334 LS
3247 444 MT 3271 444 LS
3271 444 MT 3271 334 LS
3272 334 MT 3297 334 LS
3297 444 MT 3297 334 LS
3298 444 MT 3322 444 LS
3322 444 MT 3322 334 LS
3323 334 MT 3348 334 LS
3348 444 MT 3348 334 LS
3349 444 MT 3373 444 LS
3373 444 MT 3373 334 LS
3374 334 MT 3398 334 LS
3398 444 MT 3398 334 LS
3399 444 MT 3424 444 LS
3424 444 MT 3424 334 LS
3425 334 MT 3449 334 LS
3449 444 MT 3449 334 LS
3450 444 MT 3475 444 LS
3475 444 MT 3475 334 LS
3476 334 MT 3500 334 LS
3500 444 MT 3500 334 LS
3501 444 MT 3526 444 LS
3526 444 MT 3526 334 LS
3527 334 MT 3551 334 LS
3551 444 MT 3551 334 LS
3552 444 MT 3576 444 LS
3576 444 MT 3576 334 LS
3577 334 MT 3602 334 LS
3602 444 MT 3602 334 LS
3603 444 MT 3627 444 LS
3627 444 MT 3627 334 LS
3628 334 MT 3653 334 LS
3653 444 MT 3653 334 LS
3654 444 MT 3678 444 LS
3678 444 MT 3678 334 LS
3679 334 MT 3704 334 LS
3704 444 MT 3704 334 LS
3705 444 MT 3729 444 LS
3729 444 MT 3729 334 LS
3730 334 MT 3755 334 LS
3755 444 MT 3755 334 LS
3756 444 MT 3780 444 LS
3780 444 MT 3780 334 LS
3781 334 MT 3805 334 LS
3805 444 MT 3805 334 LS
3806 444 MT 3831 444 LS
3831 444 MT 3831 334 LS
3832 334 MT 3856 334 LS
3856 444 MT 3856 334 LS
3857 444 MT 3882 444 LS
3882 444 MT 3882 334 LS
3883 334 MT 3907 334 LS
3907 444 MT 3907 334 LS
3908 444 MT 3933 444 LS
3933 444 MT 3933 334 LS
3934 334 MT 3958 334 LS
3958 444 MT 3958 334 LS
3959 444 MT 3983 444 LS
3983 444 MT 3983 334 LS
3984 334 MT 4009 334 LS
4009 444 MT 4009 334 LS
4010 444 MT 4034 444 LS
4034 444 MT 4034 334 LS
4035 334 MT 4060 334 LS
4060 444 MT 4060 334 LS
4061 444 MT 4085 444 LS
4085 444 MT 4085 334 LS
4086 334 MT 4111 334 LS
4111 444 MT 4111 334 LS
4112 444 MT 4136 444 LS
4136 444 MT 4136 334 LS
4137 334 MT 4161 334 LS
4161 444 MT 4161 334 LS
4162 444 MT 4187 444 LS
4187 444 MT 4187 334 LS
4188 334 MT 4212 334 LS
4212 444 MT 4212 334 LS
4213 444 MT 4238 444 LS
4238 444 MT 4238 334 LS
4239 334 MT 4263 334 LS
4263 444 MT 4263 334 LS
4264 444 MT 4289 444 LS
4289 444 MT 4289 334 LS
4290 334 MT 4314 334 LS
4314 444 MT 4314 334 LS
4315 444 MT 4339 444 LS
4339 444 MT 4339 334 LS
4340 334 MT 4365 334 LS
4365 444 MT 4365 334 LS
4366 444 MT 4390 444 LS
4390 444 MT 4390 334 LS
4391 334 MT 4416 334 LS
4416 444 MT 4416 334 LS
4417 444 MT 4441 444 LS
4441 444 MT 4441 334 LS
4442 334 MT 4467 334 LS
4467 444 MT 4467 334 LS
4468 444 MT 4492 444 LS
4492 444 MT 4492 334 LS
4493 334 MT 4517 334 LS
4517 444 MT 4517 334 LS
4518 444 MT 4543 444 LS
4543 444 MT 4543 334 LS
4544 334 MT 4568 334 LS
4568 444 MT 4568 334 LS
4569 444 MT 4594 444 LS
4594 444 MT 4594 334 LS
4595 334 MT 4619 334 LS
4619 444 MT 4619 334 LS
4620 444 MT 4645 444 LS
4645 444 MT 4645 334 LS
4646 334 MT 4670 334 LS
4670 444 MT 4670 334 LS
4671 444 MT 4695 444 LS
4695 444 MT 4695 334 LS
4696 334 MT 4721 334 LS
4721 444 MT 4721 334 LS
4722 444 MT 4746 444 LS
4746 444 MT 4746 334 LS
4747 334 MT 4772 334 LS
4772 444 MT 4772 334 LS
4773 444 MT 4797 444 LS
4797 444 MT 4797 334 LS
4798 334 MT 4823 334 LS
4823 444 MT 4823 334 LS
4824 444 MT 4848 444 LS
4848 444 MT 4848 334 LS
4849 334 MT 4873 334 LS
4873 444 MT 4873 334 LS
4874 444 MT 4899 444 LS
4899 444 MT 4899 334 LS
4900 334 MT 4924 334 LS
4924 444 MT 4924 334 LS
4925 444 MT 4950 444 LS
4950 444 MT 4950 334 LS
4951 334 MT 4975 334 LS
4975 444 MT 4975 334 LS
4976 444 MT 5001 444 LS
5001 444 MT 5001 334 LS
5002 334 MT 5026 334 LS
5026 444 MT 5026 334 LS
5027 444 MT 5051 444 LS
5051 444 MT 5051 334 LS
5052 334 MT 5077 334 LS
5077 444 MT 5077 334 LS
5078 444 MT 5102 444 LS
5102 444 MT 5102 334 LS
5103 334 MT 5128 334 LS
5128 444 MT 5128 334 LS
5129 444 MT 5153 444 LS
5153 444 MT 5153 334 LS
5154 334 MT 5179 334 LS
5179 444 MT 5179 334 LS
5180 444 MT 5204 444 LS
5204 444 MT 5204 334 LS
5205 334 MT 5229 334 LS
5229 444 MT 5229 334 LS
5230 444 MT 5255 444 LS
5255 444 MT 5255 334 LS
5256 334 MT 5280 334 LS
5280 444 MT 5280 334 LS
5281 444 MT 5306 444 LS
5306 444 MT 5306 334 LS
5307 334 MT 5331 334 LS
5331 444 MT 5331 334 LS
5332 444 MT 5357 444 LS
5357 444 MT 5357 334 LS
5358 334 MT 5382 334 LS
5382 444 MT 5382 334 LS
5383 444 MT 5407 444 LS
5407 444 MT 5407 334 LS
5408 334 MT 5433 334 LS
5433 444 MT 5433 334 LS
5434 444 MT 5458 444 LS
5458 444 MT 5458 334 LS
5459 334 MT 5484 334 LS
5484 444 MT 5484 334 LS
5485 444 MT 5509 444 LS
5509 444 MT 5509 334 LS
5510 334 MT 5535 334 LS
5535 444 MT 5535 334 LS
5536 444 MT 5560 444 LS
5560 444 MT 5560 334 LS
5561 334 MT 5585 334 LS
5585 444 MT 5585 334 LS
5586 444 MT 5611 444 LS
5611 444 MT 5611 334 LS
5612 334 MT 5636 334 LS
5636 444 MT 5636 334 LS
5637 444 MT 5662 444 LS
5662 444 MT 5662 334 LS
5663 334 MT 5687 334 LS
5687 444 MT 5687 334 LS
5688 444 MT 5713 444 LS
5713 444 MT 5713 334 LS
5714 334 MT 5738 334 LS
5738 444 MT 5738 334 LS
5739 444 MT 5763 444 LS
5763 444 MT 5763 334 LS
5764 334 MT 5789 334 LS
5789 444 MT 5789 334 LS
5790 444 MT 5814 444 LS
5814 444 MT 5814 334 LS
5815 334 MT 5840 334 LS
5840 444 MT 5840 334 LS
5841 444 MT 5865 444 LS
5865 444 MT 5865 334 LS
5866 334 MT 5891 334 LS
5891 444 MT 5891 334 LS
5892 444 MT 5916 444 LS
5916 444 MT 5916 334 LS
5917 334 MT 5941 334 LS
5941 444 MT 5941 334 LS
5942 444 MT 5967 444 LS
5967 444 MT 5967 334 LS
5968 334 MT 5992 334 LS
5992 444 MT 5992 334 LS
5993 444 MT 6018 444 LS
6018 444 MT 6018 334 LS
6019 334 MT 6043 334 LS
6043 444 MT 6043 334 LS
6044 444 MT 6069 444 LS
6069 444 MT 6069 334 LS
6070 334 MT 6094 334 LS
6094 444 MT 6094 334 LS
6095 444 MT 6119 444 LS
6119 444 MT 6119 334 LS
6120 334 MT 6145 334 LS
6145 444 MT 6145 334 LS
6146 444 MT 6170 444 LS
6170 444 MT 6170 334 LS
6171 334 MT 6196 334 LS
6196 444 MT 6196 334 LS
6197 444 MT 6221 444 LS
6221 444 MT 6221 334 LS
6222 334 MT 6247 334 LS
6247 444 MT 6247 334 LS
6248 444 MT 6272 444 LS
6272 444 MT 6272 334 LS
6273 334 MT 6298 334 LS
6298 444 MT 6298 334 LS
6298 444 MT 6298 444 LS
(0110) 150 LC 1226 576 WT pop 0 originOffset 50 add RSS
1212 521 MT 1212 521 LT 1383 521 LT 1390 576 LT ST
1212 631 MT 1212 631 LT 1383 631 LT 1390 576 LT ST
(010e) 22 LC 1404 576 WT pop 0 originOffset 50 add RSS
1390 576 MT 1390 576 LT 1397 521 LT 1433 521 LT 1440 576 LT ST
1390 576 MT 1390 576 LT 1397 631 LT 1433 631 LT 1440 576 LT ST
(0110) 227 LC 1454 576 WT pop 0 originOffset 50 add RSS
1440 576 MT 1440 576 LT 1447 521 LT 1688 521 LT 1695 576 LT ST
1440 576 MT 1440 576 LT 1447 631 LT 1688 631 LT 1695 576 LT ST
(010e) 23 LC 1709 576 WT pop 0 originOffset 50 add RSS
1695 576 MT 1695 576 LT 1702 521 LT 1739 521 LT 1746 576 LT ST
1695 576 MT 1695 576 LT 1702 631 LT 1739 631 LT 1746 576 LT ST
(0110) 226 LC 1760 576 WT pop 0 originOffset 50 add RSS
1746 576 MT 1746 576 LT 1753 521 LT 1993 521 LT 2000 576 LT ST
1746 576 MT 1746 576 LT 1753 631 LT 1993 631 LT 2000 576 LT ST
(010e) 23 LC 2014 576 WT pop 0 originOffset 50 add RSS
2000 576 MT 2000 576 LT 2007 521 LT 2044 521 LT 2051 576 LT ST
2000 576 MT 2000 576 LT 2007 631 LT 2044 631 LT 2051 576 LT ST
(0110) 226 LC 2065 576 WT pop 0 originOffset 50 add RSS
2051 576 MT 2051 576 LT 2058 521 LT 2298 521 LT 2305 576 LT ST
2051 576 MT 2051 576 LT 2058 631 LT 2298 631 LT 2305 576 LT ST
(010e) 23 LC 2319 576 WT pop 0 originOffset 50 add RSS
2305 576 MT 2305 576 LT 2312 521 LT 2349 521 LT 2356 576 LT ST
2305 576 MT 2305 576 LT 2312 631 LT 2349 631 LT 2356 576 LT ST
(0110) 226 LC 2370 576 WT pop 0 originOffset 50 add RSS
2356 576 MT 2356 576 LT 2363 521 LT 2603 521 LT 2610 576 LT ST
2356 576 MT 2356 576 LT 2363 631 LT 2603 631 LT 2610 576 LT ST
(010e) 23 LC 2624 576 WT pop 0 originOffset 50 add RSS
2610 576 MT 2610 576 LT 2617 521 LT 2654 521 LT 2661 576 LT ST
2610 576 MT 2610 576 LT 2617 631 LT 2654 631 LT 2661 576 LT ST
(0110) 226 LC 2675 576 WT pop 0 originOffset 50 add RSS
2661 576 MT 2661 576 LT 2668 521 LT 2908 521 LT 2915 576 LT ST
2661 576 MT 2661 576 LT 2668 631 LT 2908 631 LT 2915 576 LT ST
(010e) 23 LC 2929 576 WT pop 0 originOffset 50 add RSS
2915 576 MT 2915 576 LT 2922 521 LT 2959 521 LT 2966 576 LT ST
2915 576 MT 2915 576 LT 2922 631 LT 2959 631 LT 2966 576 LT ST
(0110) 226 LC 2980 576 WT pop 0 originOffset 50 add RSS
2966 576 MT 2966 576 LT 2973 521 LT 3213 521 LT 3220 576 LT ST
2966 576 MT 2966 576 LT 2973 631 LT 3213 631 LT 3220 576 LT ST
(010e) 23 LC 3234 576 WT pop 0 originOffset 50 add RSS
3220 576 MT 3220 576 LT 3227 521 LT 3264 521 LT 3271 576 LT ST
3220 576 MT 3220 576 LT 3227 631 LT 3264 631 LT 3271 576 LT ST
(0110) 227 LC 3285 576 WT pop 0 originOffset 50 add RSS
3271 576 MT 3271 576 LT 3278 521 LT 3519 521 LT 3526 576 LT ST
3271 576 MT 3271 576 LT 3278 631 LT 3519 631 LT 3526 576 LT ST
(010e) 22 LC 3540 576 WT pop 0 originOffset 50 add RSS
3526 576 MT 3526 576 LT 3533 521 LT 3569 521 LT 3576 576 LT ST
3526 576 MT 3526 576 LT 3533 631 LT 3569 631 LT 3576 576 LT ST
(0110) 227 LC 3590 576 WT pop 0 originOffset 50 add RSS
3576 576 MT 3576 576 LT 3583 521 LT 3824 521 LT 3831 576 LT ST
3576 576 MT 3576 576 LT 3583 631 LT 3824 631 LT 3831 576 LT ST
(010e) 23 LC 3845 576 WT pop 0 originOffset 50 add RSS
3831 576 MT 3831 576 LT 3838 521 LT 3875 521 LT 3882 576 LT ST
3831 576 MT 3831 576 LT 3838 631 LT 3875 631 LT 3882 576 LT ST
(0110) 226 LC 3896 576 WT pop 0 originOffset 50 add RSS
3882 576 MT 3882 576 LT 3889 521 LT 4129 521 LT 4136 576 LT ST
3882 576 MT 3882 576 LT 3889 631 LT 4129 631 LT 4136 576 LT ST
(010e) 23 LC 4150 576 WT pop 0 originOffset 50 add RSS
4136 576 MT 4136 576 LT 4143 521 LT 4180 521 LT 4187 576 LT ST
4136 576 MT 4136 576 LT 4143 631 LT 4180 631 LT 4187 576 LT ST
(0110) 226 LC 4201 576 WT pop 0 originOffset 50 add RSS
4187 576 MT 4187 576 LT 4194 521 LT 4434 521 LT 4441 576 LT ST
4187 576 MT 4187 576 LT 4194 631 LT 4434 631 LT 4441 576 LT ST
(010e) 23 LC 4455 576 WT pop 0 originOffset 50 add RSS
4441 576 MT 4441 576 LT 4448 521 LT 4485 521 LT 4492 576 LT ST
4441 576 MT 4441 576 LT 4448 631 LT 4485 631 LT 4492 576 LT ST
(0110) 226 LC 4506 576 WT pop 0 originOffset 50 add RSS
4492 576 MT 4492 576 LT 4499 521 LT 4739 521 LT 4746 576 LT ST
4492 576 MT 4492 576 LT 4499 631 LT 4739 631 LT 4746 576 LT ST
(010e) 23 LC 4760 576 WT pop 0 originOffset 50 add RSS
4746 576 MT 4746 576 LT 4753 521 LT 4790 521 LT 4797 576 LT ST
4746 576 MT 4746 576 LT 4753 631 LT 4790 631 LT 4797 576 LT ST
(0110) 226 LC 4811 576 WT pop 0 originOffset 50 add RSS
4797 576 MT 4797 576 LT 4804 521 LT 5044 521 LT 5051 576 LT ST
4797 576 MT 4797 576 LT 4804 631 LT 5044 631 LT 5051 576 LT ST
(010e) 23 LC 5065 576 WT pop 0 originOffset 50 add RSS
5051 576 MT 5051 576 LT 5058 521 LT 5095 521 LT 5102 576 LT ST
5051 576 MT 5051 576 LT 5058 631 LT 5095 631 LT 5102 576 LT ST
(0110) 227 LC 5116 576 WT pop 0 originOffset 50 add RSS
5102 576 MT 5102 576 LT 5109 521 LT 5350 521 LT 5357 576 LT ST
5102 576 MT 5102 576 LT 5109 631 LT 5350 631 LT 5357 576 LT ST
(010e) 22 LC 5371 576 WT pop 0 originOffset 50 add RSS
5357 576 MT 5357 576 LT 5364 521 LT 5400 521 LT 5407 576 LT ST
5357 576 MT 5357 576 LT 5364 631 LT 5400 631 LT 5407 576 LT ST
(0110) 227 LC 5421 576 WT pop 0 originOffset 50 add RSS
5407 576 MT 5407 576 LT 5414 521 LT 5655 521 LT 5662 576 LT ST
5407 576 MT 5407 576 LT 5414 631 LT 5655 631 LT 5662 576 LT ST
(010e) 23 LC 5676 576 WT pop 0 originOffset 50 add RSS
5662 576 MT 5662 576 LT 5669 521 LT 5706 521 LT 5713 576 LT ST
5662 576 MT 5662 576 LT 5669 631 LT 5706 631 LT 5713 576 LT ST
(0110) 226 LC 5727 576 WT pop 0 originOffset 50 add RSS
5713 576 MT 5713 576 LT 5720 521 LT 5960 521 LT 5967 576 LT ST
5713 576 MT 5713 576 LT 5720 631 LT 5960 631 LT 5967 576 LT ST
(010e) 23 LC 5981 576 WT pop 0 originOffset 50 add RSS
5967 576 MT 5967 576 LT 5974 521 LT 6011 521 LT 6018 576 LT ST
5967 576 MT 5967 576 LT 5974 631 LT 6011 631 LT 6018 576 LT ST
(0110) 226 LC 6032 576 WT pop 0 originOffset 50 add RSS
6018 576 MT 6018 576 LT 6025 521 LT 6265 521 LT 6272 576 LT ST
6018 576 MT 6018 576 LT 6025 631 LT 6265 631 LT 6272 576 LT ST
(010e) -2 LC 6286 576 WT pop 0 originOffset 50 add RSS
6272 576 MT 6272 576 LT 6279 521 LT 6298 521 LT ST
6272 576 MT 6272 576 LT 6279 631 LT 6298 631 LT ST
(010e) 5058 LC 1226 763 WT pop 0 originOffset 50 add RSS
1212 708 MT 1212 708 LT 6298 708 LT ST
1212 818 MT 1212 818 LT 6298 818 LT ST
1213 1005 MT 1440 1005 LS
1440 1005 MT 1440 895 LS
1441 895 MT 1491 895 LS
1491 1005 MT 1491 895 LS
1492 1005 MT 1746 1005 LS
1746 1005 MT 1746 895 LS
1747 895 MT 1796 895 LS
1796 1005 MT 1796 895 LS
1797 1005 MT 2051 1005 LS
2051 1005 MT 2051 895 LS
2052 895 MT 2102 895 LS
2102 1005 MT 2102 895 LS
2103 1005 MT 2356 1005 LS
2356 1005 MT 2356 895 LS
2357 895 MT 2407 895 LS
2407 1005 MT 2407 895 LS
2408 1005 MT 2661 1005 LS
2661 1005 MT 2661 895 LS
2662 895 MT 2712 895 LS
2712 1005 MT 2712 895 LS
2713 1005 MT 2966 1005 LS
2966 1005 MT 2966 895 LS
2967 895 MT 3017 895 LS
3017 1005 MT 3017 895 LS
3018 1005 MT 3271 1005 LS
3271 1005 MT 3271 895 LS
3272 895 MT 3322 895 LS
3322 1005 MT 3322 895 LS
3323 1005 MT 3576 1005 LS
3576 1005 MT 3576 895 LS
3577 895 MT 3627 895 LS
3627 1005 MT 3627 895 LS
3628 1005 MT 3882 1005 LS
3882 1005 MT 3882 895 LS
3883 895 MT 3933 895 LS
3933 1005 MT 3933 895 LS
3934 1005 MT 4187 1005 LS
4187 1005 MT 4187 895 LS
4188 895 MT 4238 895 LS
4238 1005 MT 4238 895 LS
4239 1005 MT 4492 1005 LS
4492 1005 MT 4492 895 LS
4493 895 MT 4543 895 LS
4543 1005 MT 4543 895 LS
4544 1005 MT 4797 1005 LS
4797 1005 MT 4797 895 LS
4798 895 MT 4848 895 LS
4848 1005 MT 4848 895 LS
4849 1005 MT 5102 1005 LS
5102 1005 MT 5102 895 LS
5103 895 MT 5153 895 LS
5153 1005 MT 5153 895 LS
5154 1005 MT 5407 1005 LS
5407 1005 MT 5407 895 LS
5408 895 MT 5458 895 LS
5458 1005 MT 5458 895 LS
5459 1005 MT 5713 1005 LS
5713 1005 MT 5713 895 LS
5714 895 MT 5763 895 LS
5763 1005 MT 5763 895 LS
5764 1005 MT 6018 1005 LS
6018 1005 MT 6018 895 LS
6019 895 MT 6069 895 LS
6069 1005 MT 6069 895 LS
6070 1005 MT 6298 1005 LS
6298 1005 MT 6298 1005 LS
(0fff) 5058 LC 1226 1137 WT pop 0 originOffset 50 add RSS
1212 1082 MT 1212 1082 LT 6298 1082 LT ST
1212 1192 MT 1212 1192 LT 6298 1192 LT ST
1213 1379 MT 6298 1379 LS
6298 1379 MT 6298 1379 LS
(3) 5058 LC 1226 1511 WT pop 0 originOffset 50 add RSS
1212 1456 MT 1212 1456 LT 6298 1456 LT ST
1212 1566 MT 1212 1566 LT 6298 1566 LT ST
(0fff) 5058 LC 1226 1698 WT pop 0 originOffset 50 add RSS
1212 1643 MT 1212 1643 LT 6298 1643 LT ST
1212 1753 MT 1212 1753 LT 6298 1753 LT ST
(00b0 000d 5220 baad 0000 0130 00b0 0030) 5058 LC 1226 1885 WT pop 0 originOffset 50 add RSS
1212 1830 MT 1212 1830 LT 6298 1830 LT ST
1212 1940 MT 1212 1940 LT 6298 1940 LT ST
(00b0) 5058 LC 1226 2061 WT pop 0 originOffset 50 add RSS
1212 2006 MT 1212 2006 LT 6298 2006 LT ST
1212 2116 MT 1212 2116 LT 6298 2116 LT ST
(000d) 5058 LC 1226 2226 WT pop 0 originOffset 50 add RSS
1212 2171 MT 1212 2171 LT 6298 2171 LT ST
1212 2281 MT 1212 2281 LT 6298 2281 LT ST
(5220) 5058 LC 1226 2391 WT pop 0 originOffset 50 add RSS
1212 2336 MT 1212 2336 LT 6298 2336 LT ST
1212 2446 MT 1212 2446 LT 6298 2446 LT ST
(baad) 5058 LC 1226 2556 WT pop 0 originOffset 50 add RSS
1212 2501 MT 1212 2501 LT 6298 2501 LT ST
1212 2611 MT 1212 2611 LT 6298 2611 LT ST
(0000) 5058 LC 1226 2721 WT pop 0 originOffset 50 add RSS
1212 2666 MT 1212 2666 LT 6298 2666 LT ST
1212 2776 MT 1212 2776 LT 6298 2776 LT ST
(0130) 5058 LC 1226 2886 WT pop 0 originOffset 50 add RSS
1212 2831 MT 1212 2831 LT 6298 2831 LT ST
1212 2941 MT 1212 2941 LT 6298 2941 LT ST
(00b0) 5058 LC 1226 3051 WT pop 0 originOffset 50 add RSS
1212 2996 MT 1212 2996 LT 6298 2996 LT ST
1212 3106 MT 1212 3106 LT 6298 3106 LT ST
(0030) 5058 LC 1226 3216 WT pop 0 originOffset 50 add RSS
1212 3161 MT 1212 3161 LT 6298 3161 LT ST
1212 3271 MT 1212 3271 LT 6298 3271 LT ST
(fetch3) -3 LC 1226 3392 WT pop 0 originOffset 50 add RSS
1212 3337 MT 1212 3337 LT 1230 3337 LT 1237 3392 LT ST
1212 3447 MT 1212 3447 LT 1230 3447 LT 1237 3392 LT ST
(decode) 23 LC 1251 3392 WT pop 0 originOffset 50 add RSS
1237 3392 MT 1237 3392 LT 1244 3337 LT 1281 3337 LT 1288 3392 LT ST
1237 3392 MT 1237 3392 LT 1244 3447 LT 1281 3447 LT 1288 3392 LT ST
(br) 23 LC 1302 3392 WT pop 0 originOffset 50 add RSS
1288 3392 MT 1288 3392 LT 1295 3337 LT 1332 3337 LT 1339 3392 LT ST
1288 3392 MT 1288 3392 LT 1295 3447 LT 1332 3447 LT 1339 3392 LT ST
(br_taken) 23 LC 1353 3392 WT pop 0 originOffset 50 add RSS
1339 3392 MT 1339 3392 LT 1346 3337 LT 1383 3337 LT 1390 3392 LT ST
1339 3392 MT 1339 3392 LT 1346 3447 LT 1383 3447 LT 1390 3392 LT ST
(fetch1) 22 LC 1404 3392 WT pop 0 originOffset 50 add RSS
1390 3392 MT 1390 3392 LT 1397 3337 LT 1433 3337 LT 1440 3392 LT ST
1390 3392 MT 1390 3392 LT 1397 3447 LT 1433 3447 LT 1440 3392 LT ST
(fetch2) 23 LC 1454 3392 WT pop 0 originOffset 50 add RSS
1440 3392 MT 1440 3392 LT 1447 3337 LT 1484 3337 LT 1491 3392 LT ST
1440 3392 MT 1440 3392 LT 1447 3447 LT 1484 3447 LT 1491 3392 LT ST
(fetch3) 23 LC 1505 3392 WT pop 0 originOffset 50 add RSS
1491 3392 MT 1491 3392 LT 1498 3337 LT 1535 3337 LT 1542 3392 LT ST
1491 3392 MT 1491 3392 LT 1498 3447 LT 1535 3447 LT 1542 3392 LT ST
(decode) 23 LC 1556 3392 WT pop 0 originOffset 50 add RSS
1542 3392 MT 1542 3392 LT 1549 3337 LT 1586 3337 LT 1593 3392 LT ST
1542 3392 MT 1542 3392 LT 1549 3447 LT 1586 3447 LT 1593 3392 LT ST
(br) 23 LC 1607 3392 WT pop 0 originOffset 50 add RSS
1593 3392 MT 1593 3392 LT 1600 3337 LT 1637 3337 LT 1644 3392 LT ST
1593 3392 MT 1593 3392 LT 1600 3447 LT 1637 3447 LT 1644 3392 LT ST
(br_taken) 23 LC 1658 3392 WT pop 0 originOffset 50 add RSS
1644 3392 MT 1644 3392 LT 1651 3337 LT 1688 3337 LT 1695 3392 LT ST
1644 3392 MT 1644 3392 LT 1651 3447 LT 1688 3447 LT 1695 3392 LT ST
(fetch1) 23 LC 1709 3392 WT pop 0 originOffset 50 add RSS
1695 3392 MT 1695 3392 LT 1702 3337 LT 1739 3337 LT 1746 3392 LT ST
1695 3392 MT 1695 3392 LT 1702 3447 LT 1739 3447 LT 1746 3392 LT ST
(fetch2) 22 LC 1760 3392 WT pop 0 originOffset 50 add RSS
1746 3392 MT 1746 3392 LT 1753 3337 LT 1789 3337 LT 1796 3392 LT ST
1746 3392 MT 1746 3392 LT 1753 3447 LT 1789 3447 LT 1796 3392 LT ST
(fetch3) 23 LC 1810 3392 WT pop 0 originOffset 50 add RSS
1796 3392 MT 1796 3392 LT 1803 3337 LT 1840 3337 LT 1847 3392 LT ST
1796 3392 MT 1796 3392 LT 1803 3447 LT 1840 3447 LT 1847 3392 LT ST
(decode) 23 LC 1861 3392 WT pop 0 originOffset 50 add RSS
1847 3392 MT 1847 3392 LT 1854 3337 LT 1891 3337 LT 1898 3392 LT ST
1847 3392 MT 1847 3392 LT 1854 3447 LT 1891 3447 LT 1898 3392 LT ST
(br) 23 LC 1912 3392 WT pop 0 originOffset 50 add RSS
1898 3392 MT 1898 3392 LT 1905 3337 LT 1942 3337 LT 1949 3392 LT ST
1898 3392 MT 1898 3392 LT 1905 3447 LT 1942 3447 LT 1949 3392 LT ST
(br_taken) 23 LC 1963 3392 WT pop 0 originOffset 50 add RSS
1949 3392 MT 1949 3392 LT 1956 3337 LT 1993 3337 LT 2000 3392 LT ST
1949 3392 MT 1949 3392 LT 1956 3447 LT 1993 3447 LT 2000 3392 LT ST
(fetch1) 23 LC 2014 3392 WT pop 0 originOffset 50 add RSS
2000 3392 MT 2000 3392 LT 2007 3337 LT 2044 3337 LT 2051 3392 LT ST
2000 3392 MT 2000 3392 LT 2007 3447 LT 2044 3447 LT 2051 3392 LT ST
(fetch2) 23 LC 2065 3392 WT pop 0 originOffset 50 add RSS
2051 3392 MT 2051 3392 LT 2058 3337 LT 2095 3337 LT 2102 3392 LT ST
2051 3392 MT 2051 3392 LT 2058 3447 LT 2095 3447 LT 2102 3392 LT ST
(fetch3) 22 LC 2116 3392 WT pop 0 originOffset 50 add RSS
2102 3392 MT 2102 3392 LT 2109 3337 LT 2145 3337 LT 2152 3392 LT ST
2102 3392 MT 2102 3392 LT 2109 3447 LT 2145 3447 LT 2152 3392 LT ST
(decode) 23 LC 2166 3392 WT pop 0 originOffset 50 add RSS
2152 3392 MT 2152 3392 LT 2159 3337 LT 2196 3337 LT 2203 3392 LT ST
2152 3392 MT 2152 3392 LT 2159 3447 LT 2196 3447 LT 2203 3392 LT ST
(br) 23 LC 2217 3392 WT pop 0 originOffset 50 add RSS
2203 3392 MT 2203 3392 LT 2210 3337 LT 2247 3337 LT 2254 3392 LT ST
2203 3392 MT 2203 3392 LT 2210 3447 LT 2247 3447 LT 2254 3392 LT ST
(br_taken) 23 LC 2268 3392 WT pop 0 originOffset 50 add RSS
2254 3392 MT 2254 3392 LT 2261 3337 LT 2298 3337 LT 2305 3392 LT ST
2254 3392 MT 2254 3392 LT 2261 3447 LT 2298 3447 LT 2305 3392 LT ST
(fetch1) 23 LC 2319 3392 WT pop 0 originOffset 50 add RSS
2305 3392 MT 2305 3392 LT 2312 3337 LT 2349 3337 LT 2356 3392 LT ST
2305 3392 MT 2305 3392 LT 2312 3447 LT 2349 3447 LT 2356 3392 LT ST
(fetch2) 23 LC 2370 3392 WT pop 0 originOffset 50 add RSS
2356 3392 MT 2356 3392 LT 2363 3337 LT 2400 3337 LT 2407 3392 LT ST
2356 3392 MT 2356 3392 LT 2363 3447 LT 2400 3447 LT 2407 3392 LT ST
(fetch3) 23 LC 2421 3392 WT pop 0 originOffset 50 add RSS
2407 3392 MT 2407 3392 LT 2414 3337 LT 2451 3337 LT 2458 3392 LT ST
2407 3392 MT 2407 3392 LT 2414 3447 LT 2451 3447 LT 2458 3392 LT ST
(decode) 22 LC 2472 3392 WT pop 0 originOffset 50 add RSS
2458 3392 MT 2458 3392 LT 2465 3337 LT 2501 3337 LT 2508 3392 LT ST
2458 3392 MT 2458 3392 LT 2465 3447 LT 2501 3447 LT 2508 3392 LT ST
(br) 23 LC 2522 3392 WT pop 0 originOffset 50 add RSS
2508 3392 MT 2508 3392 LT 2515 3337 LT 2552 3337 LT 2559 3392 LT ST
2508 3392 MT 2508 3392 LT 2515 3447 LT 2552 3447 LT 2559 3392 LT ST
(br_taken) 23 LC 2573 3392 WT pop 0 originOffset 50 add RSS
2559 3392 MT 2559 3392 LT 2566 3337 LT 2603 3337 LT 2610 3392 LT ST
2559 3392 MT 2559 3392 LT 2566 3447 LT 2603 3447 LT 2610 3392 LT ST
(fetch1) 23 LC 2624 3392 WT pop 0 originOffset 50 add RSS
2610 3392 MT 2610 3392 LT 2617 3337 LT 2654 3337 LT 2661 3392 LT ST
2610 3392 MT 2610 3392 LT 2617 3447 LT 2654 3447 LT 2661 3392 LT ST
(fetch2) 23 LC 2675 3392 WT pop 0 originOffset 50 add RSS
2661 3392 MT 2661 3392 LT 2668 3337 LT 2705 3337 LT 2712 3392 LT ST
2661 3392 MT 2661 3392 LT 2668 3447 LT 2705 3447 LT 2712 3392 LT ST
(fetch3) 23 LC 2726 3392 WT pop 0 originOffset 50 add RSS
2712 3392 MT 2712 3392 LT 2719 3337 LT 2756 3337 LT 2763 3392 LT ST
2712 3392 MT 2712 3392 LT 2719 3447 LT 2756 3447 LT 2763 3392 LT ST
(decode) 23 LC 2777 3392 WT pop 0 originOffset 50 add RSS
2763 3392 MT 2763 3392 LT 2770 3337 LT 2807 3337 LT 2814 3392 LT ST
2763 3392 MT 2763 3392 LT 2770 3447 LT 2807 3447 LT 2814 3392 LT ST
(br) 22 LC 2828 3392 WT pop 0 originOffset 50 add RSS
2814 3392 MT 2814 3392 LT 2821 3337 LT 2857 3337 LT 2864 3392 LT ST
2814 3392 MT 2814 3392 LT 2821 3447 LT 2857 3447 LT 2864 3392 LT ST
(br_taken) 23 LC 2878 3392 WT pop 0 originOffset 50 add RSS
2864 3392 MT 2864 3392 LT 2871 3337 LT 2908 3337 LT 2915 3392 LT ST
2864 3392 MT 2864 3392 LT 2871 3447 LT 2908 3447 LT 2915 3392 LT ST
(fetch1) 23 LC 2929 3392 WT pop 0 originOffset 50 add RSS
2915 3392 MT 2915 3392 LT 2922 3337 LT 2959 3337 LT 2966 3392 LT ST
2915 3392 MT 2915 3392 LT 2922 3447 LT 2959 3447 LT 2966 3392 LT ST
(fetch2) 23 LC 2980 3392 WT pop 0 originOffset 50 add RSS
2966 3392 MT 2966 3392 LT 2973 3337 LT 3010 3337 LT 3017 3392 LT ST
2966 3392 MT 2966 3392 LT 2973 3447 LT 3010 3447 LT 3017 3392 LT ST
(fetch3) 23 LC 3031 3392 WT pop 0 originOffset 50 add RSS
3017 3392 MT 3017 3392 LT 3024 3337 LT 3061 3337 LT 3068 3392 LT ST
3017 3392 MT 3017 3392 LT 3024 3447 LT 3061 3447 LT 3068 3392 LT ST
(decode) 23 LC 3082 3392 WT pop 0 originOffset 50 add RSS
3068 3392 MT 3068 3392 LT 3075 3337 LT 3112 3337 LT 3119 3392 LT ST
3068 3392 MT 3068 3392 LT 3075 3447 LT 3112 3447 LT 3119 3392 LT ST
(br) 23 LC 3133 3392 WT pop 0 originOffset 50 add RSS
3119 3392 MT 3119 3392 LT 3126 3337 LT 3163 3337 LT 3170 3392 LT ST
3119 3392 MT 3119 3392 LT 3126 3447 LT 3163 3447 LT 3170 3392 LT ST
(br_taken) 22 LC 3184 3392 WT pop 0 originOffset 50 add RSS
3170 3392 MT 3170 3392 LT 3177 3337 LT 3213 3337 LT 3220 3392 LT ST
3170 3392 MT 3170 3392 LT 3177 3447 LT 3213 3447 LT 3220 3392 LT ST
(fetch1) 23 LC 3234 3392 WT pop 0 originOffset 50 add RSS
3220 3392 MT 3220 3392 LT 3227 3337 LT 3264 3337 LT 3271 3392 LT ST
3220 3392 MT 3220 3392 LT 3227 3447 LT 3264 3447 LT 3271 3392 LT ST
(fetch2) 23 LC 3285 3392 WT pop 0 originOffset 50 add RSS
3271 3392 MT 3271 3392 LT 3278 3337 LT 3315 3337 LT 3322 3392 LT ST
3271 3392 MT 3271 3392 LT 3278 3447 LT 3315 3447 LT 3322 3392 LT ST
(fetch3) 23 LC 3336 3392 WT pop 0 originOffset 50 add RSS
3322 3392 MT 3322 3392 LT 3329 3337 LT 3366 3337 LT 3373 3392 LT ST
3322 3392 MT 3322 3392 LT 3329 3447 LT 3366 3447 LT 3373 3392 LT ST
(decode) 23 LC 3387 3392 WT pop 0 originOffset 50 add RSS
3373 3392 MT 3373 3392 LT 3380 3337 LT 3417 3337 LT 3424 3392 LT ST
3373 3392 MT 3373 3392 LT 3380 3447 LT 3417 3447 LT 3424 3392 LT ST
(br) 23 LC 3438 3392 WT pop 0 originOffset 50 add RSS
3424 3392 MT 3424 3392 LT 3431 3337 LT 3468 3337 LT 3475 3392 LT ST
3424 3392 MT 3424 3392 LT 3431 3447 LT 3468 3447 LT 3475 3392 LT ST
(br_taken) 23 LC 3489 3392 WT pop 0 originOffset 50 add RSS
3475 3392 MT 3475 3392 LT 3482 3337 LT 3519 3337 LT 3526 3392 LT ST
3475 3392 MT 3475 3392 LT 3482 3447 LT 3519 3447 LT 3526 3392 LT ST
(fetch1) 22 LC 3540 3392 WT pop 0 originOffset 50 add RSS
3526 3392 MT 3526 3392 LT 3533 3337 LT 3569 3337 LT 3576 3392 LT ST
3526 3392 MT 3526 3392 LT 3533 3447 LT 3569 3447 LT 3576 3392 LT ST
(fetch2) 23 LC 3590 3392 WT pop 0 originOffset 50 add RSS
3576 3392 MT 3576 3392 LT 3583 3337 LT 3620 3337 LT 3627 3392 LT ST
3576 3392 MT 3576 3392 LT 3583 3447 LT 3620 3447 LT 3627 3392 LT ST
(fetch3) 23 LC 3641 3392 WT pop 0 originOffset 50 add RSS
3627 3392 MT 3627 3392 LT 3634 3337 LT 3671 3337 LT 3678 3392 LT ST
3627 3392 MT 3627 3392 LT 3634 3447 LT 3671 3447 LT 3678 3392 LT ST
(decode) 23 LC 3692 3392 WT pop 0 originOffset 50 add RSS
3678 3392 MT 3678 3392 LT 3685 3337 LT 3722 3337 LT 3729 3392 LT ST
3678 3392 MT 3678 3392 LT 3685 3447 LT 3722 3447 LT 3729 3392 LT ST
(br) 23 LC 3743 3392 WT pop 0 originOffset 50 add RSS
3729 3392 MT 3729 3392 LT 3736 3337 LT 3773 3337 LT 3780 3392 LT ST
3729 3392 MT 3729 3392 LT 3736 3447 LT 3773 3447 LT 3780 3392 LT ST
(br_taken) 23 LC 3794 3392 WT pop 0 originOffset 50 add RSS
3780 3392 MT 3780 3392 LT 3787 3337 LT 3824 3337 LT 3831 3392 LT ST
3780 3392 MT 3780 3392 LT 3787 3447 LT 3824 3447 LT 3831 3392 LT ST
(fetch1) 23 LC 3845 3392 WT pop 0 originOffset 50 add RSS
3831 3392 MT 3831 3392 LT 3838 3337 LT 3875 3337 LT 3882 3392 LT ST
3831 3392 MT 3831 3392 LT 3838 3447 LT 3875 3447 LT 3882 3392 LT ST
(fetch2) 23 LC 3896 3392 WT pop 0 originOffset 50 add RSS
3882 3392 MT 3882 3392 LT 3889 3337 LT 3926 3337 LT 3933 3392 LT ST
3882 3392 MT 3882 3392 LT 3889 3447 LT 3926 3447 LT 3933 3392 LT ST
(fetch3) 22 LC 3947 3392 WT pop 0 originOffset 50 add RSS
3933 3392 MT 3933 3392 LT 3940 3337 LT 3976 3337 LT 3983 3392 LT ST
3933 3392 MT 3933 3392 LT 3940 3447 LT 3976 3447 LT 3983 3392 LT ST
(decode) 23 LC 3997 3392 WT pop 0 originOffset 50 add RSS
3983 3392 MT 3983 3392 LT 3990 3337 LT 4027 3337 LT 4034 3392 LT ST
3983 3392 MT 3983 3392 LT 3990 3447 LT 4027 3447 LT 4034 3392 LT ST
(br) 23 LC 4048 3392 WT pop 0 originOffset 50 add RSS
4034 3392 MT 4034 3392 LT 4041 3337 LT 4078 3337 LT 4085 3392 LT ST
4034 3392 MT 4034 3392 LT 4041 3447 LT 4078 3447 LT 4085 3392 LT ST
(br_taken) 23 LC 4099 3392 WT pop 0 originOffset 50 add RSS
4085 3392 MT 4085 3392 LT 4092 3337 LT 4129 3337 LT 4136 3392 LT ST
4085 3392 MT 4085 3392 LT 4092 3447 LT 4129 3447 LT 4136 3392 LT ST
(fetch1) 23 LC 4150 3392 WT pop 0 originOffset 50 add RSS
4136 3392 MT 4136 3392 LT 4143 3337 LT 4180 3337 LT 4187 3392 LT ST
4136 3392 MT 4136 3392 LT 4143 3447 LT 4180 3447 LT 4187 3392 LT ST
(fetch2) 23 LC 4201 3392 WT pop 0 originOffset 50 add RSS
4187 3392 MT 4187 3392 LT 4194 3337 LT 4231 3337 LT 4238 3392 LT ST
4187 3392 MT 4187 3392 LT 4194 3447 LT 4231 3447 LT 4238 3392 LT ST
(fetch3) 23 LC 4252 3392 WT pop 0 originOffset 50 add RSS
4238 3392 MT 4238 3392 LT 4245 3337 LT 4282 3337 LT 4289 3392 LT ST
4238 3392 MT 4238 3392 LT 4245 3447 LT 4282 3447 LT 4289 3392 LT ST
(decode) 22 LC 4303 3392 WT pop 0 originOffset 50 add RSS
4289 3392 MT 4289 3392 LT 4296 3337 LT 4332 3337 LT 4339 3392 LT ST
4289 3392 MT 4289 3392 LT 4296 3447 LT 4332 3447 LT 4339 3392 LT ST
(br) 23 LC 4353 3392 WT pop 0 originOffset 50 add RSS
4339 3392 MT 4339 3392 LT 4346 3337 LT 4383 3337 LT 4390 3392 LT ST
4339 3392 MT 4339 3392 LT 4346 3447 LT 4383 3447 LT 4390 3392 LT ST
(br_taken) 23 LC 4404 3392 WT pop 0 originOffset 50 add RSS
4390 3392 MT 4390 3392 LT 4397 3337 LT 4434 3337 LT 4441 3392 LT ST
4390 3392 MT 4390 3392 LT 4397 3447 LT 4434 3447 LT 4441 3392 LT ST
(fetch1) 23 LC 4455 3392 WT pop 0 originOffset 50 add RSS
4441 3392 MT 4441 3392 LT 4448 3337 LT 4485 3337 LT 4492 3392 LT ST
4441 3392 MT 4441 3392 LT 4448 3447 LT 4485 3447 LT 4492 3392 LT ST
(fetch2) 23 LC 4506 3392 WT pop 0 originOffset 50 add RSS
4492 3392 MT 4492 3392 LT 4499 3337 LT 4536 3337 LT 4543 3392 LT ST
4492 3392 MT 4492 3392 LT 4499 3447 LT 4536 3447 LT 4543 3392 LT ST
(fetch3) 23 LC 4557 3392 WT pop 0 originOffset 50 add RSS
4543 3392 MT 4543 3392 LT 4550 3337 LT 4587 3337 LT 4594 3392 LT ST
4543 3392 MT 4543 3392 LT 4550 3447 LT 4587 3447 LT 4594 3392 LT ST
(decode) 23 LC 4608 3392 WT pop 0 originOffset 50 add RSS
4594 3392 MT 4594 3392 LT 4601 3337 LT 4638 3337 LT 4645 3392 LT ST
4594 3392 MT 4594 3392 LT 4601 3447 LT 4638 3447 LT 4645 3392 LT ST
(br) 22 LC 4659 3392 WT pop 0 originOffset 50 add RSS
4645 3392 MT 4645 3392 LT 4652 3337 LT 4688 3337 LT 4695 3392 LT ST
4645 3392 MT 4645 3392 LT 4652 3447 LT 4688 3447 LT 4695 3392 LT ST
(br_taken) 23 LC 4709 3392 WT pop 0 originOffset 50 add RSS
4695 3392 MT 4695 3392 LT 4702 3337 LT 4739 3337 LT 4746 3392 LT ST
4695 3392 MT 4695 3392 LT 4702 3447 LT 4739 3447 LT 4746 3392 LT ST
(fetch1) 23 LC 4760 3392 WT pop 0 originOffset 50 add RSS
4746 3392 MT 4746 3392 LT 4753 3337 LT 4790 3337 LT 4797 3392 LT ST
4746 3392 MT 4746 3392 LT 4753 3447 LT 4790 3447 LT 4797 3392 LT ST
(fetch2) 23 LC 4811 3392 WT pop 0 originOffset 50 add RSS
4797 3392 MT 4797 3392 LT 4804 3337 LT 4841 3337 LT 4848 3392 LT ST
4797 3392 MT 4797 3392 LT 4804 3447 LT 4841 3447 LT 4848 3392 LT ST
(fetch3) 23 LC 4862 3392 WT pop 0 originOffset 50 add RSS
4848 3392 MT 4848 3392 LT 4855 3337 LT 4892 3337 LT 4899 3392 LT ST
4848 3392 MT 4848 3392 LT 4855 3447 LT 4892 3447 LT 4899 3392 LT ST
(decode) 23 LC 4913 3392 WT pop 0 originOffset 50 add RSS
4899 3392 MT 4899 3392 LT 4906 3337 LT 4943 3337 LT 4950 3392 LT ST
4899 3392 MT 4899 3392 LT 4906 3447 LT 4943 3447 LT 4950 3392 LT ST
(br) 23 LC 4964 3392 WT pop 0 originOffset 50 add RSS
4950 3392 MT 4950 3392 LT 4957 3337 LT 4994 3337 LT 5001 3392 LT ST
4950 3392 MT 4950 3392 LT 4957 3447 LT 4994 3447 LT 5001 3392 LT ST
(br_taken) 22 LC 5015 3392 WT pop 0 originOffset 50 add RSS
5001 3392 MT 5001 3392 LT 5008 3337 LT 5044 3337 LT 5051 3392 LT ST
5001 3392 MT 5001 3392 LT 5008 3447 LT 5044 3447 LT 5051 3392 LT ST
(fetch1) 23 LC 5065 3392 WT pop 0 originOffset 50 add RSS
5051 3392 MT 5051 3392 LT 5058 3337 LT 5095 3337 LT 5102 3392 LT ST
5051 3392 MT 5051 3392 LT 5058 3447 LT 5095 3447 LT 5102 3392 LT ST
(fetch2) 23 LC 5116 3392 WT pop 0 originOffset 50 add RSS
5102 3392 MT 5102 3392 LT 5109 3337 LT 5146 3337 LT 5153 3392 LT ST
5102 3392 MT 5102 3392 LT 5109 3447 LT 5146 3447 LT 5153 3392 LT ST
(fetch3) 23 LC 5167 3392 WT pop 0 originOffset 50 add RSS
5153 3392 MT 5153 3392 LT 5160 3337 LT 5197 3337 LT 5204 3392 LT ST
5153 3392 MT 5153 3392 LT 5160 3447 LT 5197 3447 LT 5204 3392 LT ST
(decode) 23 LC 5218 3392 WT pop 0 originOffset 50 add RSS
5204 3392 MT 5204 3392 LT 5211 3337 LT 5248 3337 LT 5255 3392 LT ST
5204 3392 MT 5204 3392 LT 5211 3447 LT 5248 3447 LT 5255 3392 LT ST
(br) 23 LC 5269 3392 WT pop 0 originOffset 50 add RSS
5255 3392 MT 5255 3392 LT 5262 3337 LT 5299 3337 LT 5306 3392 LT ST
5255 3392 MT 5255 3392 LT 5262 3447 LT 5299 3447 LT 5306 3392 LT ST
(br_taken) 23 LC 5320 3392 WT pop 0 originOffset 50 add RSS
5306 3392 MT 5306 3392 LT 5313 3337 LT 5350 3337 LT 5357 3392 LT ST
5306 3392 MT 5306 3392 LT 5313 3447 LT 5350 3447 LT 5357 3392 LT ST
(fetch1) 22 LC 5371 3392 WT pop 0 originOffset 50 add RSS
5357 3392 MT 5357 3392 LT 5364 3337 LT 5400 3337 LT 5407 3392 LT ST
5357 3392 MT 5357 3392 LT 5364 3447 LT 5400 3447 LT 5407 3392 LT ST
(fetch2) 23 LC 5421 3392 WT pop 0 originOffset 50 add RSS
5407 3392 MT 5407 3392 LT 5414 3337 LT 5451 3337 LT 5458 3392 LT ST
5407 3392 MT 5407 3392 LT 5414 3447 LT 5451 3447 LT 5458 3392 LT ST
(fetch3) 23 LC 5472 3392 WT pop 0 originOffset 50 add RSS
5458 3392 MT 5458 3392 LT 5465 3337 LT 5502 3337 LT 5509 3392 LT ST
5458 3392 MT 5458 3392 LT 5465 3447 LT 5502 3447 LT 5509 3392 LT ST
(decode) 23 LC 5523 3392 WT pop 0 originOffset 50 add RSS
5509 3392 MT 5509 3392 LT 5516 3337 LT 5553 3337 LT 5560 3392 LT ST
5509 3392 MT 5509 3392 LT 5516 3447 LT 5553 3447 LT 5560 3392 LT ST
(br) 23 LC 5574 3392 WT pop 0 originOffset 50 add RSS
5560 3392 MT 5560 3392 LT 5567 3337 LT 5604 3337 LT 5611 3392 LT ST
5560 3392 MT 5560 3392 LT 5567 3447 LT 5604 3447 LT 5611 3392 LT ST
(br_taken) 23 LC 5625 3392 WT pop 0 originOffset 50 add RSS
5611 3392 MT 5611 3392 LT 5618 3337 LT 5655 3337 LT 5662 3392 LT ST
5611 3392 MT 5611 3392 LT 5618 3447 LT 5655 3447 LT 5662 3392 LT ST
(fetch1) 23 LC 5676 3392 WT pop 0 originOffset 50 add RSS
5662 3392 MT 5662 3392 LT 5669 3337 LT 5706 3337 LT 5713 3392 LT ST
5662 3392 MT 5662 3392 LT 5669 3447 LT 5706 3447 LT 5713 3392 LT ST
(fetch2) 22 LC 5727 3392 WT pop 0 originOffset 50 add RSS
5713 3392 MT 5713 3392 LT 5720 3337 LT 5756 3337 LT 5763 3392 LT ST
5713 3392 MT 5713 3392 LT 5720 3447 LT 5756 3447 LT 5763 3392 LT ST
(fetch3) 23 LC 5777 3392 WT pop 0 originOffset 50 add RSS
5763 3392 MT 5763 3392 LT 5770 3337 LT 5807 3337 LT 5814 3392 LT ST
5763 3392 MT 5763 3392 LT 5770 3447 LT 5807 3447 LT 5814 3392 LT ST
(decode) 23 LC 5828 3392 WT pop 0 originOffset 50 add RSS
5814 3392 MT 5814 3392 LT 5821 3337 LT 5858 3337 LT 5865 3392 LT ST
5814 3392 MT 5814 3392 LT 5821 3447 LT 5858 3447 LT 5865 3392 LT ST
(br) 23 LC 5879 3392 WT pop 0 originOffset 50 add RSS
5865 3392 MT 5865 3392 LT 5872 3337 LT 5909 3337 LT 5916 3392 LT ST
5865 3392 MT 5865 3392 LT 5872 3447 LT 5909 3447 LT 5916 3392 LT ST
(br_taken) 23 LC 5930 3392 WT pop 0 originOffset 50 add RSS
5916 3392 MT 5916 3392 LT 5923 3337 LT 5960 3337 LT 5967 3392 LT ST
5916 3392 MT 5916 3392 LT 5923 3447 LT 5960 3447 LT 5967 3392 LT ST
(fetch1) 23 LC 5981 3392 WT pop 0 originOffset 50 add RSS
5967 3392 MT 5967 3392 LT 5974 3337 LT 6011 3337 LT 6018 3392 LT ST
5967 3392 MT 5967 3392 LT 5974 3447 LT 6011 3447 LT 6018 3392 LT ST
(fetch2) 23 LC 6032 3392 WT pop 0 originOffset 50 add RSS
6018 3392 MT 6018 3392 LT 6025 3337 LT 6062 3337 LT 6069 3392 LT ST
6018 3392 MT 6018 3392 LT 6025 3447 LT 6062 3447 LT 6069 3392 LT ST
(fetch3) 22 LC 6083 3392 WT pop 0 originOffset 50 add RSS
6069 3392 MT 6069 3392 LT 6076 3337 LT 6112 3337 LT 6119 3392 LT ST
6069 3392 MT 6069 3392 LT 6076 3447 LT 6112 3447 LT 6119 3392 LT ST
(decode) 23 LC 6133 3392 WT pop 0 originOffset 50 add RSS
6119 3392 MT 6119 3392 LT 6126 3337 LT 6163 3337 LT 6170 3392 LT ST
6119 3392 MT 6119 3392 LT 6126 3447 LT 6163 3447 LT 6170 3392 LT ST
(br) 23 LC 6184 3392 WT pop 0 originOffset 50 add RSS
6170 3392 MT 6170 3392 LT 6177 3337 LT 6214 3337 LT 6221 3392 LT ST
6170 3392 MT 6170 3392 LT 6177 3447 LT 6214 3447 LT 6221 3392 LT ST
(br_taken) 23 LC 6235 3392 WT pop 0 originOffset 50 add RSS
6221 3392 MT 6221 3392 LT 6228 3337 LT 6265 3337 LT 6272 3392 LT ST
6221 3392 MT 6221 3392 LT 6228 3447 LT 6265 3447 LT 6272 3392 LT ST
(fetch1) -2 LC 6286 3392 WT pop 0 originOffset 50 add RSS
6272 3392 MT 6272 3392 LT 6279 3337 LT 6298 3337 LT ST
6272 3392 MT 6272 3392 LT 6279 3447 LT 6298 3447 LT ST
% draw timeline
1221 4455 MT 1221 4492 LS
1220 4474 MT 1222 4474 LS
1263 4455 MT 1263 4492 LS
1314 4455 MT 1314 4492 LS
1365 4455 MT 1365 4492 LS
1415 4455 MT 1415 4492 LS
1466 4455 MT 1466 4492 LS
1517 4455 MT 1517 4492 LS
1568 4455 MT 1568 4492 LS
1619 4455 MT 1619 4492 LS
1670 4455 MT 1670 4492 LS
1720 4428 MT 1720 4492 LS
1771 4455 MT 1771 4492 LS
1822 4455 MT 1822 4492 LS
1873 4455 MT 1873 4492 LS
1923 4455 MT 1923 4492 LS
1974 4455 MT 1974 4492 LS
2025 4455 MT 2025 4492 LS
2076 4455 MT 2076 4492 LS
2127 4455 MT 2127 4492 LS
2178 4455 MT 2178 4492 LS
2229 4428 MT 2229 4492 LS
(49200 ns) 9999 LC 2229 4597 WT TS RSS
2280 4455 MT 2280 4492 LS
2331 4455 MT 2331 4492 LS
2382 4455 MT 2382 4492 LS
2432 4455 MT 2432 4492 LS
2483 4455 MT 2483 4492 LS
2534 4455 MT 2534 4492 LS
2585 4455 MT 2585 4492 LS
2636 4455 MT 2636 4492 LS
2687 4455 MT 2687 4492 LS
2737 4428 MT 2737 4492 LS
2788 4455 MT 2788 4492 LS
2839 4455 MT 2839 4492 LS
2890 4455 MT 2890 4492 LS
2940 4455 MT 2940 4492 LS
2991 4455 MT 2991 4492 LS
3042 4455 MT 3042 4492 LS
3093 4455 MT 3093 4492 LS
3144 4455 MT 3144 4492 LS
3195 4455 MT 3195 4492 LS
3246 4428 MT 3246 4492 LS
(49400 ns) 9999 LC 3246 4597 WT TS RSS
3297 4455 MT 3297 4492 LS
3348 4455 MT 3348 4492 LS
3399 4455 MT 3399 4492 LS
3449 4455 MT 3449 4492 LS
3500 4455 MT 3500 4492 LS
3551 4455 MT 3551 4492 LS
3602 4455 MT 3602 4492 LS
3653 4455 MT 3653 4492 LS
3704 4455 MT 3704 4492 LS
3755 4428 MT 3755 4492 LS
3806 4455 MT 3806 4492 LS
3857 4455 MT 3857 4492 LS
3908 4455 MT 3908 4492 LS
3958 4455 MT 3958 4492 LS
4009 4455 MT 4009 4492 LS
4060 4455 MT 4060 4492 LS
4111 4455 MT 4111 4492 LS
4162 4455 MT 4162 4492 LS
4213 4455 MT 4213 4492 LS
4263 4428 MT 4263 4492 LS
(49600 ns) 9999 LC 4263 4597 WT TS RSS
4314 4455 MT 4314 4492 LS
4365 4455 MT 4365 4492 LS
4416 4455 MT 4416 4492 LS
4466 4455 MT 4466 4492 LS
4517 4455 MT 4517 4492 LS
4568 4455 MT 4568 4492 LS
4619 4455 MT 4619 4492 LS
4670 4455 MT 4670 4492 LS
4721 4455 MT 4721 4492 LS
4772 4428 MT 4772 4492 LS
4823 4455 MT 4823 4492 LS
4874 4455 MT 4874 4492 LS
4925 4455 MT 4925 4492 LS
4975 4455 MT 4975 4492 LS
5026 4455 MT 5026 4492 LS
5077 4455 MT 5077 4492 LS
5128 4455 MT 5128 4492 LS
5179 4455 MT 5179 4492 LS
5230 4455 MT 5230 4492 LS
5280 4428 MT 5280 4492 LS
(49800 ns) 9999 LC 5280 4597 WT TS RSS
5331 4455 MT 5331 4492 LS
5382 4455 MT 5382 4492 LS
5433 4455 MT 5433 4492 LS
5483 4455 MT 5483 4492 LS
5534 4455 MT 5534 4492 LS
5585 4455 MT 5585 4492 LS
5636 4455 MT 5636 4492 LS
5687 4455 MT 5687 4492 LS
5738 4455 MT 5738 4492 LS
5789 4428 MT 5789 4492 LS
5840 4455 MT 5840 4492 LS
5891 4455 MT 5891 4492 LS
5942 4455 MT 5942 4492 LS
5992 4455 MT 5992 4492 LS
6043 4455 MT 6043 4492 LS
6094 4455 MT 6094 4492 LS
6145 4455 MT 6145 4492 LS
6196 4455 MT 6196 4492 LS
6247 4455 MT 6247 4492 LS
6298 4428 MT 6298 4492 LS
(50000 ns) 9999 LC 6298 4597 WT TS RSS
6349 4455 MT 6349 4492 LS
6400 4455 MT 6400 4492 LS
6451 4455 MT 6451 4492 LS
6501 4455 MT 6501 4492 LS
6552 4455 MT 6552 4492 LS
6603 4455 MT 6603 4492 LS
6654 4455 MT 6654 4492 LS
6705 4455 MT 6705 4492 LS
6756 4455 MT 6756 4492 LS
% draw grid
1720 300 MT 1720 4428 LS
2229 300 MT 2229 4428 LS
2737 300 MT 2737 4428 LS
3246 300 MT 3246 4428 LS
3755 300 MT 3755 4428 LS
4263 300 MT 4263 4428 LS
4772 300 MT 4772 4428 LS
5280 300 MT 5280 4428 LS
5789 300 MT 5789 4428 LS
6298 300 MT 6298 4428 LS
% draw waveforms
(clk) 9999 LC 1175 443 WT TSE RSS
1713 300 MT 1727 300 LS
2222 300 MT 2236 300 LS
2730 300 MT 2744 300 LS
3239 300 MT 3253 300 LS
3748 300 MT 3762 300 LS
4256 300 MT 4270 300 LS
4765 300 MT 4779 300 LS
5273 300 MT 5287 300 LS
5782 300 MT 5796 300 LS
6291 300 MT 6305 300 LS
1212 444 MT 1212 334 LS
1213 444 MT 1237 444 LS
1237 444 MT 1237 334 LS
1238 334 MT 1262 334 LS
1262 444 MT 1262 334 LS
1263 444 MT 1288 444 LS
1288 444 MT 1288 334 LS
1289 334 MT 1313 334 LS
1313 444 MT 1313 334 LS
1314 444 MT 1339 444 LS
1339 444 MT 1339 334 LS
1340 334 MT 1364 334 LS
1364 444 MT 1364 334 LS
1365 444 MT 1390 444 LS
1390 444 MT 1390 334 LS
1391 334 MT 1415 334 LS
1415 444 MT 1415 334 LS
1416 444 MT 1440 444 LS
1440 444 MT 1440 334 LS
1441 334 MT 1466 334 LS
1466 444 MT 1466 334 LS
1467 444 MT 1491 444 LS
1491 444 MT 1491 334 LS
1492 334 MT 1517 334 LS
1517 444 MT 1517 334 LS
1518 444 MT 1542 444 LS
1542 444 MT 1542 334 LS
1543 334 MT 1568 334 LS
1568 444 MT 1568 334 LS
1569 444 MT 1593 444 LS
1593 444 MT 1593 334 LS
1594 334 MT 1618 334 LS
1618 444 MT 1618 334 LS
1619 444 MT 1644 444 LS
1644 444 MT 1644 334 LS
1645 334 MT 1669 334 LS
1669 444 MT 1669 334 LS
1670 444 MT 1695 444 LS
1695 444 MT 1695 334 LS
1696 334 MT 1720 334 LS
1720 444 MT 1720 334 LS
1721 444 MT 1746 444 LS
1746 444 MT 1746 334 LS
1747 334 MT 1771 334 LS
1771 444 MT 1771 334 LS
1772 444 MT 1796 444 LS
1796 444 MT 1796 334 LS
1797 334 MT 1822 334 LS
1822 444 MT 1822 334 LS
1823 444 MT 1847 444 LS
1847 444 MT 1847 334 LS
1848 334 MT 1873 334 LS
1873 444 MT 1873 334 LS
1874 444 MT 1898 444 LS
1898 444 MT 1898 334 LS
1899 334 MT 1924 334 LS
1924 444 MT 1924 334 LS
1925 444 MT 1949 444 LS
1949 444 MT 1949 334 LS
1950 334 MT 1974 334 LS
1974 444 MT 1974 334 LS
1975 444 MT 2000 444 LS
2000 444 MT 2000 334 LS
2001 334 MT 2025 334 LS
2025 444 MT 2025 334 LS
2026 444 MT 2051 444 LS
2051 444 MT 2051 334 LS
2052 334 MT 2076 334 LS
2076 444 MT 2076 334 LS
2077 444 MT 2102 444 LS
2102 444 MT 2102 334 LS
2103 334 MT 2127 334 LS
2127 444 MT 2127 334 LS
2128 444 MT 2152 444 LS
2152 444 MT 2152 334 LS
2153 334 MT 2178 334 LS
2178 444 MT 2178 334 LS
2179 444 MT 2203 444 LS
2203 444 MT 2203 334 LS
2204 334 MT 2229 334 LS
2229 444 MT 2229 334 LS
2230 444 MT 2254 444 LS
2254 444 MT 2254 334 LS
2255 334 MT 2280 334 LS
2280 444 MT 2280 334 LS
2281 444 MT 2305 444 LS
2305 444 MT 2305 334 LS
2306 334 MT 2330 334 LS
2330 444 MT 2330 334 LS
2331 444 MT 2356 444 LS
2356 444 MT 2356 334 LS
2357 334 MT 2381 334 LS
2381 444 MT 2381 334 LS
2382 444 MT 2407 444 LS
2407 444 MT 2407 334 LS
2408 334 MT 2432 334 LS
2432 444 MT 2432 334 LS
2433 444 MT 2458 444 LS
2458 444 MT 2458 334 LS
2459 334 MT 2483 334 LS
2483 444 MT 2483 334 LS
2484 444 MT 2508 444 LS
2508 444 MT 2508 334 LS
2509 334 MT 2534 334 LS
2534 444 MT 2534 334 LS
2535 444 MT 2559 444 LS
2559 444 MT 2559 334 LS
2560 334 MT 2585 334 LS
2585 444 MT 2585 334 LS
2586 444 MT 2610 444 LS
2610 444 MT 2610 334 LS
2611 334 MT 2636 334 LS
2636 444 MT 2636 334 LS
2637 444 MT 2661 444 LS
2661 444 MT 2661 334 LS
2662 334 MT 2686 334 LS
2686 444 MT 2686 334 LS
2687 444 MT 2712 444 LS
2712 444 MT 2712 334 LS
2713 334 MT 2737 334 LS
2737 444 MT 2737 334 LS
2738 444 MT 2763 444 LS
2763 444 MT 2763 334 LS
2764 334 MT 2788 334 LS
2788 444 MT 2788 334 LS
2789 444 MT 2814 444 LS
2814 444 MT 2814 334 LS
2815 334 MT 2839 334 LS
2839 444 MT 2839 334 LS
2840 444 MT 2864 444 LS
2864 444 MT 2864 334 LS
2865 334 MT 2890 334 LS
2890 444 MT 2890 334 LS
2891 444 MT 2915 444 LS
2915 444 MT 2915 334 LS
2916 334 MT 2941 334 LS
2941 444 MT 2941 334 LS
2942 444 MT 2966 444 LS
2966 444 MT 2966 334 LS
2967 334 MT 2992 334 LS
2992 444 MT 2992 334 LS
2993 444 MT 3017 444 LS
3017 444 MT 3017 334 LS
3018 334 MT 3042 334 LS
3042 444 MT 3042 334 LS
3043 444 MT 3068 444 LS
3068 444 MT 3068 334 LS
3069 334 MT 3093 334 LS
3093 444 MT 3093 334 LS
3094 444 MT 3119 444 LS
3119 444 MT 3119 334 LS
3120 334 MT 3144 334 LS
3144 444 MT 3144 334 LS
3145 444 MT 3170 444 LS
3170 444 MT 3170 334 LS
3171 334 MT 3195 334 LS
3195 444 MT 3195 334 LS
3196 444 MT 3220 444 LS
3220 444 MT 3220 334 LS
3221 334 MT 3246 334 LS
3246 444 MT 3246 334 LS
3247 444 MT 3271 444 LS
3271 444 MT 3271 334 LS
3272 334 MT 3297 334 LS
3297 444 MT 3297 334 LS
3298 444 MT 3322 444 LS
3322 444 MT 3322 334 LS
3323 334 MT 3348 334 LS
3348 444 MT 3348 334 LS
3349 444 MT 3373 444 LS
3373 444 MT 3373 334 LS
3374 334 MT 3398 334 LS
3398 444 MT 3398 334 LS
3399 444 MT 3424 444 LS
3424 444 MT 3424 334 LS
3425 334 MT 3449 334 LS
3449 444 MT 3449 334 LS
3450 444 MT 3475 444 LS
3475 444 MT 3475 334 LS
3476 334 MT 3500 334 LS
3500 444 MT 3500 334 LS
3501 444 MT 3526 444 LS
3526 444 MT 3526 334 LS
3527 334 MT 3551 334 LS
3551 444 MT 3551 334 LS
3552 444 MT 3576 444 LS
3576 444 MT 3576 334 LS
3577 334 MT 3602 334 LS
3602 444 MT 3602 334 LS
3603 444 MT 3627 444 LS
3627 444 MT 3627 334 LS
3628 334 MT 3653 334 LS
3653 444 MT 3653 334 LS
3654 444 MT 3678 444 LS
3678 444 MT 3678 334 LS
3679 334 MT 3704 334 LS
3704 444 MT 3704 334 LS
3705 444 MT 3729 444 LS
3729 444 MT 3729 334 LS
3730 334 MT 3755 334 LS
3755 444 MT 3755 334 LS
3756 444 MT 3780 444 LS
3780 444 MT 3780 334 LS
3781 334 MT 3805 334 LS
3805 444 MT 3805 334 LS
3806 444 MT 3831 444 LS
3831 444 MT 3831 334 LS
3832 334 MT 3856 334 LS
3856 444 MT 3856 334 LS
3857 444 MT 3882 444 LS
3882 444 MT 3882 334 LS
3883 334 MT 3907 334 LS
3907 444 MT 3907 334 LS
3908 444 MT 3933 444 LS
3933 444 MT 3933 334 LS
3934 334 MT 3958 334 LS
3958 444 MT 3958 334 LS
3959 444 MT 3983 444 LS
3983 444 MT 3983 334 LS
3984 334 MT 4009 334 LS
4009 444 MT 4009 334 LS
4010 444 MT 4034 444 LS
4034 444 MT 4034 334 LS
4035 334 MT 4060 334 LS
4060 444 MT 4060 334 LS
4061 444 MT 4085 444 LS
4085 444 MT 4085 334 LS
4086 334 MT 4111 334 LS
4111 444 MT 4111 334 LS
4112 444 MT 4136 444 LS
4136 444 MT 4136 334 LS
4137 334 MT 4161 334 LS
4161 444 MT 4161 334 LS
4162 444 MT 4187 444 LS
4187 444 MT 4187 334 LS
4188 334 MT 4212 334 LS
4212 444 MT 4212 334 LS
4213 444 MT 4238 444 LS
4238 444 MT 4238 334 LS
4239 334 MT 4263 334 LS
4263 444 MT 4263 334 LS
4264 444 MT 4289 444 LS
4289 444 MT 4289 334 LS
4290 334 MT 4314 334 LS
4314 444 MT 4314 334 LS
4315 444 MT 4339 444 LS
4339 444 MT 4339 334 LS
4340 334 MT 4365 334 LS
4365 444 MT 4365 334 LS
4366 444 MT 4390 444 LS
4390 444 MT 4390 334 LS
4391 334 MT 4416 334 LS
4416 444 MT 4416 334 LS
4417 444 MT 4441 444 LS
4441 444 MT 4441 334 LS
4442 334 MT 4467 334 LS
4467 444 MT 4467 334 LS
4468 444 MT 4492 444 LS
4492 444 MT 4492 334 LS
4493 334 MT 4517 334 LS
4517 444 MT 4517 334 LS
4518 444 MT 4543 444 LS
4543 444 MT 4543 334 LS
4544 334 MT 4568 334 LS
4568 444 MT 4568 334 LS
4569 444 MT 4594 444 LS
4594 444 MT 4594 334 LS
4595 334 MT 4619 334 LS
4619 444 MT 4619 334 LS
4620 444 MT 4645 444 LS
4645 444 MT 4645 334 LS
4646 334 MT 4670 334 LS
4670 444 MT 4670 334 LS
4671 444 MT 4695 444 LS
4695 444 MT 4695 334 LS
4696 334 MT 4721 334 LS
4721 444 MT 4721 334 LS
4722 444 MT 4746 444 LS
4746 444 MT 4746 334 LS
4747 334 MT 4772 334 LS
4772 444 MT 4772 334 LS
4773 444 MT 4797 444 LS
4797 444 MT 4797 334 LS
4798 334 MT 4823 334 LS
4823 444 MT 4823 334 LS
4824 444 MT 4848 444 LS
4848 444 MT 4848 334 LS
4849 334 MT 4873 334 LS
4873 444 MT 4873 334 LS
4874 444 MT 4899 444 LS
4899 444 MT 4899 334 LS
4900 334 MT 4924 334 LS
4924 444 MT 4924 334 LS
4925 444 MT 4950 444 LS
4950 444 MT 4950 334 LS
4951 334 MT 4975 334 LS
4975 444 MT 4975 334 LS
4976 444 MT 5001 444 LS
5001 444 MT 5001 334 LS
5002 334 MT 5026 334 LS
5026 444 MT 5026 334 LS
5027 444 MT 5051 444 LS
5051 444 MT 5051 334 LS
5052 334 MT 5077 334 LS
5077 444 MT 5077 334 LS
5078 444 MT 5102 444 LS
5102 444 MT 5102 334 LS
5103 334 MT 5128 334 LS
5128 444 MT 5128 334 LS
5129 444 MT 5153 444 LS
5153 444 MT 5153 334 LS
5154 334 MT 5179 334 LS
5179 444 MT 5179 334 LS
5180 444 MT 5204 444 LS
5204 444 MT 5204 334 LS
5205 334 MT 5229 334 LS
5229 444 MT 5229 334 LS
5230 444 MT 5255 444 LS
5255 444 MT 5255 334 LS
5256 334 MT 5280 334 LS
5280 444 MT 5280 334 LS
5281 444 MT 5306 444 LS
5306 444 MT 5306 334 LS
5307 334 MT 5331 334 LS
5331 444 MT 5331 334 LS
5332 444 MT 5357 444 LS
5357 444 MT 5357 334 LS
5358 334 MT 5382 334 LS
5382 444 MT 5382 334 LS
5383 444 MT 5407 444 LS
5407 444 MT 5407 334 LS
5408 334 MT 5433 334 LS
5433 444 MT 5433 334 LS
5434 444 MT 5458 444 LS
5458 444 MT 5458 334 LS
5459 334 MT 5484 334 LS
5484 444 MT 5484 334 LS
5485 444 MT 5509 444 LS
5509 444 MT 5509 334 LS
5510 334 MT 5535 334 LS
5535 444 MT 5535 334 LS
5536 444 MT 5560 444 LS
5560 444 MT 5560 334 LS
5561 334 MT 5585 334 LS
5585 444 MT 5585 334 LS
5586 444 MT 5611 444 LS
5611 444 MT 5611 334 LS
5612 334 MT 5636 334 LS
5636 444 MT 5636 334 LS
5637 444 MT 5662 444 LS
5662 444 MT 5662 334 LS
5663 334 MT 5687 334 LS
5687 444 MT 5687 334 LS
5688 444 MT 5713 444 LS
5713 444 MT 5713 334 LS
5714 334 MT 5738 334 LS
5738 444 MT 5738 334 LS
5739 444 MT 5763 444 LS
5763 444 MT 5763 334 LS
5764 334 MT 5789 334 LS
5789 444 MT 5789 334 LS
5790 444 MT 5814 444 LS
5814 444 MT 5814 334 LS
5815 334 MT 5840 334 LS
5840 444 MT 5840 334 LS
5841 444 MT 5865 444 LS
5865 444 MT 5865 334 LS
5866 334 MT 5891 334 LS
5891 444 MT 5891 334 LS
5892 444 MT 5916 444 LS
5916 444 MT 5916 334 LS
5917 334 MT 5941 334 LS
5941 444 MT 5941 334 LS
5942 444 MT 5967 444 LS
5967 444 MT 5967 334 LS
5968 334 MT 5992 334 LS
5992 444 MT 5992 334 LS
5993 444 MT 6018 444 LS
6018 444 MT 6018 334 LS
6019 334 MT 6043 334 LS
6043 444 MT 6043 334 LS
6044 444 MT 6069 444 LS
6069 444 MT 6069 334 LS
6070 334 MT 6094 334 LS
6094 444 MT 6094 334 LS
6095 444 MT 6119 444 LS
6119 444 MT 6119 334 LS
6120 334 MT 6145 334 LS
6145 444 MT 6145 334 LS
6146 444 MT 6170 444 LS
6170 444 MT 6170 334 LS
6171 334 MT 6196 334 LS
6196 444 MT 6196 334 LS
6197 444 MT 6221 444 LS
6221 444 MT 6221 334 LS
6222 334 MT 6247 334 LS
6247 444 MT 6247 334 LS
6248 444 MT 6272 444 LS
6272 444 MT 6272 334 LS
6273 334 MT 6298 334 LS
6298 444 MT 6298 334 LS
6298 444 MT 6298 444 LS
(pc_out) 9999 LC 1175 630 WT TSE RSS
1713 487 MT 1727 487 LS
2222 487 MT 2236 487 LS
2730 487 MT 2744 487 LS
3239 487 MT 3253 487 LS
3748 487 MT 3762 487 LS
4256 487 MT 4270 487 LS
4765 487 MT 4779 487 LS
5273 487 MT 5287 487 LS
5782 487 MT 5796 487 LS
6291 487 MT 6305 487 LS
(0110) 150 LC 1226 576 WT pop 0 originOffset 50 add RSS
1212 521 MT 1212 521 LT 1383 521 LT 1390 576 LT ST
1212 631 MT 1212 631 LT 1383 631 LT 1390 576 LT ST
(010e) 22 LC 1404 576 WT pop 0 originOffset 50 add RSS
1390 576 MT 1390 576 LT 1397 521 LT 1433 521 LT 1440 576 LT ST
1390 576 MT 1390 576 LT 1397 631 LT 1433 631 LT 1440 576 LT ST
(0110) 227 LC 1454 576 WT pop 0 originOffset 50 add RSS
1440 576 MT 1440 576 LT 1447 521 LT 1688 521 LT 1695 576 LT ST
1440 576 MT 1440 576 LT 1447 631 LT 1688 631 LT 1695 576 LT ST
(010e) 23 LC 1709 576 WT pop 0 originOffset 50 add RSS
1695 576 MT 1695 576 LT 1702 521 LT 1739 521 LT 1746 576 LT ST
1695 576 MT 1695 576 LT 1702 631 LT 1739 631 LT 1746 576 LT ST
(0110) 226 LC 1760 576 WT pop 0 originOffset 50 add RSS
1746 576 MT 1746 576 LT 1753 521 LT 1993 521 LT 2000 576 LT ST
1746 576 MT 1746 576 LT 1753 631 LT 1993 631 LT 2000 576 LT ST
(010e) 23 LC 2014 576 WT pop 0 originOffset 50 add RSS
2000 576 MT 2000 576 LT 2007 521 LT 2044 521 LT 2051 576 LT ST
2000 576 MT 2000 576 LT 2007 631 LT 2044 631 LT 2051 576 LT ST
(0110) 226 LC 2065 576 WT pop 0 originOffset 50 add RSS
2051 576 MT 2051 576 LT 2058 521 LT 2298 521 LT 2305 576 LT ST
2051 576 MT 2051 576 LT 2058 631 LT 2298 631 LT 2305 576 LT ST
(010e) 23 LC 2319 576 WT pop 0 originOffset 50 add RSS
2305 576 MT 2305 576 LT 2312 521 LT 2349 521 LT 2356 576 LT ST
2305 576 MT 2305 576 LT 2312 631 LT 2349 631 LT 2356 576 LT ST
(0110) 226 LC 2370 576 WT pop 0 originOffset 50 add RSS
2356 576 MT 2356 576 LT 2363 521 LT 2603 521 LT 2610 576 LT ST
2356 576 MT 2356 576 LT 2363 631 LT 2603 631 LT 2610 576 LT ST
(010e) 23 LC 2624 576 WT pop 0 originOffset 50 add RSS
2610 576 MT 2610 576 LT 2617 521 LT 2654 521 LT 2661 576 LT ST
2610 576 MT 2610 576 LT 2617 631 LT 2654 631 LT 2661 576 LT ST
(0110) 226 LC 2675 576 WT pop 0 originOffset 50 add RSS
2661 576 MT 2661 576 LT 2668 521 LT 2908 521 LT 2915 576 LT ST
2661 576 MT 2661 576 LT 2668 631 LT 2908 631 LT 2915 576 LT ST
(010e) 23 LC 2929 576 WT pop 0 originOffset 50 add RSS
2915 576 MT 2915 576 LT 2922 521 LT 2959 521 LT 2966 576 LT ST
2915 576 MT 2915 576 LT 2922 631 LT 2959 631 LT 2966 576 LT ST
(0110) 226 LC 2980 576 WT pop 0 originOffset 50 add RSS
2966 576 MT 2966 576 LT 2973 521 LT 3213 521 LT 3220 576 LT ST
2966 576 MT 2966 576 LT 2973 631 LT 3213 631 LT 3220 576 LT ST
(010e) 23 LC 3234 576 WT pop 0 originOffset 50 add RSS
3220 576 MT 3220 576 LT 3227 521 LT 3264 521 LT 3271 576 LT ST
3220 576 MT 3220 576 LT 3227 631 LT 3264 631 LT 3271 576 LT ST
(0110) 227 LC 3285 576 WT pop 0 originOffset 50 add RSS
3271 576 MT 3271 576 LT 3278 521 LT 3519 521 LT 3526 576 LT ST
3271 576 MT 3271 576 LT 3278 631 LT 3519 631 LT 3526 576 LT ST
(010e) 22 LC 3540 576 WT pop 0 originOffset 50 add RSS
3526 576 MT 3526 576 LT 3533 521 LT 3569 521 LT 3576 576 LT ST
3526 576 MT 3526 576 LT 3533 631 LT 3569 631 LT 3576 576 LT ST
(0110) 227 LC 3590 576 WT pop 0 originOffset 50 add RSS
3576 576 MT 3576 576 LT 3583 521 LT 3824 521 LT 3831 576 LT ST
3576 576 MT 3576 576 LT 3583 631 LT 3824 631 LT 3831 576 LT ST
(010e) 23 LC 3845 576 WT pop 0 originOffset 50 add RSS
3831 576 MT 3831 576 LT 3838 521 LT 3875 521 LT 3882 576 LT ST
3831 576 MT 3831 576 LT 3838 631 LT 3875 631 LT 3882 576 LT ST
(0110) 226 LC 3896 576 WT pop 0 originOffset 50 add RSS
3882 576 MT 3882 576 LT 3889 521 LT 4129 521 LT 4136 576 LT ST
3882 576 MT 3882 576 LT 3889 631 LT 4129 631 LT 4136 576 LT ST
(010e) 23 LC 4150 576 WT pop 0 originOffset 50 add RSS
4136 576 MT 4136 576 LT 4143 521 LT 4180 521 LT 4187 576 LT ST
4136 576 MT 4136 576 LT 4143 631 LT 4180 631 LT 4187 576 LT ST
(0110) 226 LC 4201 576 WT pop 0 originOffset 50 add RSS
4187 576 MT 4187 576 LT 4194 521 LT 4434 521 LT 4441 576 LT ST
4187 576 MT 4187 576 LT 4194 631 LT 4434 631 LT 4441 576 LT ST
(010e) 23 LC 4455 576 WT pop 0 originOffset 50 add RSS
4441 576 MT 4441 576 LT 4448 521 LT 4485 521 LT 4492 576 LT ST
4441 576 MT 4441 576 LT 4448 631 LT 4485 631 LT 4492 576 LT ST
(0110) 226 LC 4506 576 WT pop 0 originOffset 50 add RSS
4492 576 MT 4492 576 LT 4499 521 LT 4739 521 LT 4746 576 LT ST
4492 576 MT 4492 576 LT 4499 631 LT 4739 631 LT 4746 576 LT ST
(010e) 23 LC 4760 576 WT pop 0 originOffset 50 add RSS
4746 576 MT 4746 576 LT 4753 521 LT 4790 521 LT 4797 576 LT ST
4746 576 MT 4746 576 LT 4753 631 LT 4790 631 LT 4797 576 LT ST
(0110) 226 LC 4811 576 WT pop 0 originOffset 50 add RSS
4797 576 MT 4797 576 LT 4804 521 LT 5044 521 LT 5051 576 LT ST
4797 576 MT 4797 576 LT 4804 631 LT 5044 631 LT 5051 576 LT ST
(010e) 23 LC 5065 576 WT pop 0 originOffset 50 add RSS
5051 576 MT 5051 576 LT 5058 521 LT 5095 521 LT 5102 576 LT ST
5051 576 MT 5051 576 LT 5058 631 LT 5095 631 LT 5102 576 LT ST
(0110) 227 LC 5116 576 WT pop 0 originOffset 50 add RSS
5102 576 MT 5102 576 LT 5109 521 LT 5350 521 LT 5357 576 LT ST
5102 576 MT 5102 576 LT 5109 631 LT 5350 631 LT 5357 576 LT ST
(010e) 22 LC 5371 576 WT pop 0 originOffset 50 add RSS
5357 576 MT 5357 576 LT 5364 521 LT 5400 521 LT 5407 576 LT ST
5357 576 MT 5357 576 LT 5364 631 LT 5400 631 LT 5407 576 LT ST
(0110) 227 LC 5421 576 WT pop 0 originOffset 50 add RSS
5407 576 MT 5407 576 LT 5414 521 LT 5655 521 LT 5662 576 LT ST
5407 576 MT 5407 576 LT 5414 631 LT 5655 631 LT 5662 576 LT ST
(010e) 23 LC 5676 576 WT pop 0 originOffset 50 add RSS
5662 576 MT 5662 576 LT 5669 521 LT 5706 521 LT 5713 576 LT ST
5662 576 MT 5662 576 LT 5669 631 LT 5706 631 LT 5713 576 LT ST
(0110) 226 LC 5727 576 WT pop 0 originOffset 50 add RSS
5713 576 MT 5713 576 LT 5720 521 LT 5960 521 LT 5967 576 LT ST
5713 576 MT 5713 576 LT 5720 631 LT 5960 631 LT 5967 576 LT ST
(010e) 23 LC 5981 576 WT pop 0 originOffset 50 add RSS
5967 576 MT 5967 576 LT 5974 521 LT 6011 521 LT 6018 576 LT ST
5967 576 MT 5967 576 LT 5974 631 LT 6011 631 LT 6018 576 LT ST
(0110) 226 LC 6032 576 WT pop 0 originOffset 50 add RSS
6018 576 MT 6018 576 LT 6025 521 LT 6265 521 LT 6272 576 LT ST
6018 576 MT 6018 576 LT 6025 631 LT 6265 631 LT 6272 576 LT ST
(010e) -2 LC 6286 576 WT pop 0 originOffset 50 add RSS
6272 576 MT 6272 576 LT 6279 521 LT 6298 521 LT ST
6272 576 MT 6272 576 LT 6279 631 LT 6298 631 LT ST
(mem_address) 9999 LC 1175 817 WT TSE RSS
1713 674 MT 1727 674 LS
2222 674 MT 2236 674 LS
2730 674 MT 2744 674 LS
3239 674 MT 3253 674 LS
3748 674 MT 3762 674 LS
4256 674 MT 4270 674 LS
4765 674 MT 4779 674 LS
5273 674 MT 5287 674 LS
5782 674 MT 5796 674 LS
6291 674 MT 6305 674 LS
(010e) 5058 LC 1226 763 WT pop 0 originOffset 50 add RSS
1212 708 MT 1212 708 LT 6298 708 LT ST
1212 818 MT 1212 818 LT 6298 818 LT ST
(mem_read) 9999 LC 1175 1004 WT TSE RSS
1713 861 MT 1727 861 LS
2222 861 MT 2236 861 LS
2730 861 MT 2744 861 LS
3239 861 MT 3253 861 LS
3748 861 MT 3762 861 LS
4256 861 MT 4270 861 LS
4765 861 MT 4779 861 LS
5273 861 MT 5287 861 LS
5782 861 MT 5796 861 LS
6291 861 MT 6305 861 LS
1213 1005 MT 1440 1005 LS
1440 1005 MT 1440 895 LS
1441 895 MT 1491 895 LS
1491 1005 MT 1491 895 LS
1492 1005 MT 1746 1005 LS
1746 1005 MT 1746 895 LS
1747 895 MT 1796 895 LS
1796 1005 MT 1796 895 LS
1797 1005 MT 2051 1005 LS
2051 1005 MT 2051 895 LS
2052 895 MT 2102 895 LS
2102 1005 MT 2102 895 LS
2103 1005 MT 2356 1005 LS
2356 1005 MT 2356 895 LS
2357 895 MT 2407 895 LS
2407 1005 MT 2407 895 LS
2408 1005 MT 2661 1005 LS
2661 1005 MT 2661 895 LS
2662 895 MT 2712 895 LS
2712 1005 MT 2712 895 LS
2713 1005 MT 2966 1005 LS
2966 1005 MT 2966 895 LS
2967 895 MT 3017 895 LS
3017 1005 MT 3017 895 LS
3018 1005 MT 3271 1005 LS
3271 1005 MT 3271 895 LS
3272 895 MT 3322 895 LS
3322 1005 MT 3322 895 LS
3323 1005 MT 3576 1005 LS
3576 1005 MT 3576 895 LS
3577 895 MT 3627 895 LS
3627 1005 MT 3627 895 LS
3628 1005 MT 3882 1005 LS
3882 1005 MT 3882 895 LS
3883 895 MT 3933 895 LS
3933 1005 MT 3933 895 LS
3934 1005 MT 4187 1005 LS
4187 1005 MT 4187 895 LS
4188 895 MT 4238 895 LS
4238 1005 MT 4238 895 LS
4239 1005 MT 4492 1005 LS
4492 1005 MT 4492 895 LS
4493 895 MT 4543 895 LS
4543 1005 MT 4543 895 LS
4544 1005 MT 4797 1005 LS
4797 1005 MT 4797 895 LS
4798 895 MT 4848 895 LS
4848 1005 MT 4848 895 LS
4849 1005 MT 5102 1005 LS
5102 1005 MT 5102 895 LS
5103 895 MT 5153 895 LS
5153 1005 MT 5153 895 LS
5154 1005 MT 5407 1005 LS
5407 1005 MT 5407 895 LS
5408 895 MT 5458 895 LS
5458 1005 MT 5458 895 LS
5459 1005 MT 5713 1005 LS
5713 1005 MT 5713 895 LS
5714 895 MT 5763 895 LS
5763 1005 MT 5763 895 LS
5764 1005 MT 6018 1005 LS
6018 1005 MT 6018 895 LS
6019 895 MT 6069 895 LS
6069 1005 MT 6069 895 LS
6070 1005 MT 6298 1005 LS
6298 1005 MT 6298 1005 LS
(mem_rdata) 9999 LC 1175 1191 WT TSE RSS
1713 1048 MT 1727 1048 LS
2222 1048 MT 2236 1048 LS
2730 1048 MT 2744 1048 LS
3239 1048 MT 3253 1048 LS
3748 1048 MT 3762 1048 LS
4256 1048 MT 4270 1048 LS
4765 1048 MT 4779 1048 LS
5273 1048 MT 5287 1048 LS
5782 1048 MT 5796 1048 LS
6291 1048 MT 6305 1048 LS
(0fff) 5058 LC 1226 1137 WT pop 0 originOffset 50 add RSS
1212 1082 MT 1212 1082 LT 6298 1082 LT ST
1212 1192 MT 1212 1192 LT 6298 1192 LT ST
(mem_write) 9999 LC 1175 1378 WT TSE RSS
1713 1235 MT 1727 1235 LS
2222 1235 MT 2236 1235 LS
2730 1235 MT 2744 1235 LS
3239 1235 MT 3253 1235 LS
3748 1235 MT 3762 1235 LS
4256 1235 MT 4270 1235 LS
4765 1235 MT 4779 1235 LS
5273 1235 MT 5287 1235 LS
5782 1235 MT 5796 1235 LS
6291 1235 MT 6305 1235 LS
1213 1379 MT 6298 1379 LS
6298 1379 MT 6298 1379 LS
(mem_byte_enable) 9999 LC 1175 1565 WT TSE RSS
1713 1422 MT 1727 1422 LS
2222 1422 MT 2236 1422 LS
2730 1422 MT 2744 1422 LS
3239 1422 MT 3253 1422 LS
3748 1422 MT 3762 1422 LS
4256 1422 MT 4270 1422 LS
4765 1422 MT 4779 1422 LS
5273 1422 MT 5287 1422 LS
5782 1422 MT 5796 1422 LS
6291 1422 MT 6305 1422 LS
(3) 5058 LC 1226 1511 WT pop 0 originOffset 50 add RSS
1212 1456 MT 1212 1456 LT 6298 1456 LT ST
1212 1566 MT 1212 1566 LT 6298 1566 LT ST
(mem_wdata) 9999 LC 1175 1752 WT TSE RSS
1713 1609 MT 1727 1609 LS
2222 1609 MT 2236 1609 LS
2730 1609 MT 2744 1609 LS
3239 1609 MT 3253 1609 LS
3748 1609 MT 3762 1609 LS
4256 1609 MT 4270 1609 LS
4765 1609 MT 4779 1609 LS
5273 1609 MT 5287 1609 LS
5782 1609 MT 5796 1609 LS
6291 1609 MT 6305 1609 LS
(0fff) 5058 LC 1226 1698 WT pop 0 originOffset 50 add RSS
1212 1643 MT 1212 1643 LT 6298 1643 LT ST
1212 1753 MT 1212 1753 LT 6298 1753 LT ST
(regfile) 9999 LC 1175 1939 WT TSE RSS
1713 1796 MT 1727 1796 LS
2222 1796 MT 2236 1796 LS
2730 1796 MT 2744 1796 LS
3239 1796 MT 3253 1796 LS
3748 1796 MT 3762 1796 LS
4256 1796 MT 4270 1796 LS
4765 1796 MT 4779 1796 LS
5273 1796 MT 5287 1796 LS
5782 1796 MT 5796 1796 LS
6291 1796 MT 6305 1796 LS
(00b0 000d 5220 baad 0000 0130 00b0 0030) 5058 LC 1226 1885 WT pop 0 originOffset 50 add RSS
1212 1830 MT 1212 1830 LT 6298 1830 LT ST
1212 1940 MT 1212 1940 LT 6298 1940 LT ST
([7]) 9999 LC 1175 2115 WT TSE RSS
1713 1983 MT 1727 1983 LS
2222 1983 MT 2236 1983 LS
2730 1983 MT 2744 1983 LS
3239 1983 MT 3253 1983 LS
3748 1983 MT 3762 1983 LS
4256 1983 MT 4270 1983 LS
4765 1983 MT 4779 1983 LS
5273 1983 MT 5287 1983 LS
5782 1983 MT 5796 1983 LS
6291 1983 MT 6305 1983 LS
(00b0) 5058 LC 1226 2061 WT pop 0 originOffset 50 add RSS
1212 2006 MT 1212 2006 LT 6298 2006 LT ST
1212 2116 MT 1212 2116 LT 6298 2116 LT ST
([6]) 9999 LC 1175 2280 WT TSE RSS
1713 2148 MT 1727 2148 LS
2222 2148 MT 2236 2148 LS
2730 2148 MT 2744 2148 LS
3239 2148 MT 3253 2148 LS
3748 2148 MT 3762 2148 LS
4256 2148 MT 4270 2148 LS
4765 2148 MT 4779 2148 LS
5273 2148 MT 5287 2148 LS
5782 2148 MT 5796 2148 LS
6291 2148 MT 6305 2148 LS
(000d) 5058 LC 1226 2226 WT pop 0 originOffset 50 add RSS
1212 2171 MT 1212 2171 LT 6298 2171 LT ST
1212 2281 MT 1212 2281 LT 6298 2281 LT ST
([5]) 9999 LC 1175 2445 WT TSE RSS
1713 2313 MT 1727 2313 LS
2222 2313 MT 2236 2313 LS
2730 2313 MT 2744 2313 LS
3239 2313 MT 3253 2313 LS
3748 2313 MT 3762 2313 LS
4256 2313 MT 4270 2313 LS
4765 2313 MT 4779 2313 LS
5273 2313 MT 5287 2313 LS
5782 2313 MT 5796 2313 LS
6291 2313 MT 6305 2313 LS
(5220) 5058 LC 1226 2391 WT pop 0 originOffset 50 add RSS
1212 2336 MT 1212 2336 LT 6298 2336 LT ST
1212 2446 MT 1212 2446 LT 6298 2446 LT ST
([4]) 9999 LC 1175 2610 WT TSE RSS
1713 2478 MT 1727 2478 LS
2222 2478 MT 2236 2478 LS
2730 2478 MT 2744 2478 LS
3239 2478 MT 3253 2478 LS
3748 2478 MT 3762 2478 LS
4256 2478 MT 4270 2478 LS
4765 2478 MT 4779 2478 LS
5273 2478 MT 5287 2478 LS
5782 2478 MT 5796 2478 LS
6291 2478 MT 6305 2478 LS
(baad) 5058 LC 1226 2556 WT pop 0 originOffset 50 add RSS
1212 2501 MT 1212 2501 LT 6298 2501 LT ST
1212 2611 MT 1212 2611 LT 6298 2611 LT ST
([3]) 9999 LC 1175 2775 WT TSE RSS
1713 2643 MT 1727 2643 LS
2222 2643 MT 2236 2643 LS
2730 2643 MT 2744 2643 LS
3239 2643 MT 3253 2643 LS
3748 2643 MT 3762 2643 LS
4256 2643 MT 4270 2643 LS
4765 2643 MT 4779 2643 LS
5273 2643 MT 5287 2643 LS
5782 2643 MT 5796 2643 LS
6291 2643 MT 6305 2643 LS
(0000) 5058 LC 1226 2721 WT pop 0 originOffset 50 add RSS
1212 2666 MT 1212 2666 LT 6298 2666 LT ST
1212 2776 MT 1212 2776 LT 6298 2776 LT ST
([2]) 9999 LC 1175 2940 WT TSE RSS
1713 2808 MT 1727 2808 LS
2222 2808 MT 2236 2808 LS
2730 2808 MT 2744 2808 LS
3239 2808 MT 3253 2808 LS
3748 2808 MT 3762 2808 LS
4256 2808 MT 4270 2808 LS
4765 2808 MT 4779 2808 LS
5273 2808 MT 5287 2808 LS
5782 2808 MT 5796 2808 LS
6291 2808 MT 6305 2808 LS
(0130) 5058 LC 1226 2886 WT pop 0 originOffset 50 add RSS
1212 2831 MT 1212 2831 LT 6298 2831 LT ST
1212 2941 MT 1212 2941 LT 6298 2941 LT ST
([1]) 9999 LC 1175 3105 WT TSE RSS
1713 2973 MT 1727 2973 LS
2222 2973 MT 2236 2973 LS
2730 2973 MT 2744 2973 LS
3239 2973 MT 3253 2973 LS
3748 2973 MT 3762 2973 LS
4256 2973 MT 4270 2973 LS
4765 2973 MT 4779 2973 LS
5273 2973 MT 5287 2973 LS
5782 2973 MT 5796 2973 LS
6291 2973 MT 6305 2973 LS
(00b0) 5058 LC 1226 3051 WT pop 0 originOffset 50 add RSS
1212 2996 MT 1212 2996 LT 6298 2996 LT ST
1212 3106 MT 1212 3106 LT 6298 3106 LT ST
([0]) 9999 LC 1175 3270 WT TSE RSS
1713 3138 MT 1727 3138 LS
2222 3138 MT 2236 3138 LS
2730 3138 MT 2744 3138 LS
3239 3138 MT 3253 3138 LS
3748 3138 MT 3762 3138 LS
4256 3138 MT 4270 3138 LS
4765 3138 MT 4779 3138 LS
5273 3138 MT 5287 3138 LS
5782 3138 MT 5796 3138 LS
6291 3138 MT 6305 3138 LS
(0030) 5058 LC 1226 3216 WT pop 0 originOffset 50 add RSS
1212 3161 MT 1212 3161 LT 6298 3161 LT ST
1212 3271 MT 1212 3271 LT 6298 3271 LT ST
(state) 9999 LC 1175 3446 WT TSE RSS
1713 3303 MT 1727 3303 LS
2222 3303 MT 2236 3303 LS
2730 3303 MT 2744 3303 LS
3239 3303 MT 3253 3303 LS
3748 3303 MT 3762 3303 LS
4256 3303 MT 4270 3303 LS
4765 3303 MT 4779 3303 LS
5273 3303 MT 5287 3303 LS
5782 3303 MT 5796 3303 LS
6291 3303 MT 6305 3303 LS
(fetch3) -3 LC 1226 3392 WT pop 0 originOffset 50 add RSS
1212 3337 MT 1212 3337 LT 1230 3337 LT 1237 3392 LT ST
1212 3447 MT 1212 3447 LT 1230 3447 LT 1237 3392 LT ST
(decode) 23 LC 1251 3392 WT pop 0 originOffset 50 add RSS
1237 3392 MT 1237 3392 LT 1244 3337 LT 1281 3337 LT 1288 3392 LT ST
1237 3392 MT 1237 3392 LT 1244 3447 LT 1281 3447 LT 1288 3392 LT ST
(br) 23 LC 1302 3392 WT pop 0 originOffset 50 add RSS
1288 3392 MT 1288 3392 LT 1295 3337 LT 1332 3337 LT 1339 3392 LT ST
1288 3392 MT 1288 3392 LT 1295 3447 LT 1332 3447 LT 1339 3392 LT ST
(br_taken) 23 LC 1353 3392 WT pop 0 originOffset 50 add RSS
1339 3392 MT 1339 3392 LT 1346 3337 LT 1383 3337 LT 1390 3392 LT ST
1339 3392 MT 1339 3392 LT 1346 3447 LT 1383 3447 LT 1390 3392 LT ST
(fetch1) 22 LC 1404 3392 WT pop 0 originOffset 50 add RSS
1390 3392 MT 1390 3392 LT 1397 3337 LT 1433 3337 LT 1440 3392 LT ST
1390 3392 MT 1390 3392 LT 1397 3447 LT 1433 3447 LT 1440 3392 LT ST
(fetch2) 23 LC 1454 3392 WT pop 0 originOffset 50 add RSS
1440 3392 MT 1440 3392 LT 1447 3337 LT 1484 3337 LT 1491 3392 LT ST
1440 3392 MT 1440 3392 LT 1447 3447 LT 1484 3447 LT 1491 3392 LT ST
(fetch3) 23 LC 1505 3392 WT pop 0 originOffset 50 add RSS
1491 3392 MT 1491 3392 LT 1498 3337 LT 1535 3337 LT 1542 3392 LT ST
1491 3392 MT 1491 3392 LT 1498 3447 LT 1535 3447 LT 1542 3392 LT ST
(decode) 23 LC 1556 3392 WT pop 0 originOffset 50 add RSS
1542 3392 MT 1542 3392 LT 1549 3337 LT 1586 3337 LT 1593 3392 LT ST
1542 3392 MT 1542 3392 LT 1549 3447 LT 1586 3447 LT 1593 3392 LT ST
(br) 23 LC 1607 3392 WT pop 0 originOffset 50 add RSS
1593 3392 MT 1593 3392 LT 1600 3337 LT 1637 3337 LT 1644 3392 LT ST
1593 3392 MT 1593 3392 LT 1600 3447 LT 1637 3447 LT 1644 3392 LT ST
(br_taken) 23 LC 1658 3392 WT pop 0 originOffset 50 add RSS
1644 3392 MT 1644 3392 LT 1651 3337 LT 1688 3337 LT 1695 3392 LT ST
1644 3392 MT 1644 3392 LT 1651 3447 LT 1688 3447 LT 1695 3392 LT ST
(fetch1) 23 LC 1709 3392 WT pop 0 originOffset 50 add RSS
1695 3392 MT 1695 3392 LT 1702 3337 LT 1739 3337 LT 1746 3392 LT ST
1695 3392 MT 1695 3392 LT 1702 3447 LT 1739 3447 LT 1746 3392 LT ST
(fetch2) 22 LC 1760 3392 WT pop 0 originOffset 50 add RSS
1746 3392 MT 1746 3392 LT 1753 3337 LT 1789 3337 LT 1796 3392 LT ST
1746 3392 MT 1746 3392 LT 1753 3447 LT 1789 3447 LT 1796 3392 LT ST
(fetch3) 23 LC 1810 3392 WT pop 0 originOffset 50 add RSS
1796 3392 MT 1796 3392 LT 1803 3337 LT 1840 3337 LT 1847 3392 LT ST
1796 3392 MT 1796 3392 LT 1803 3447 LT 1840 3447 LT 1847 3392 LT ST
(decode) 23 LC 1861 3392 WT pop 0 originOffset 50 add RSS
1847 3392 MT 1847 3392 LT 1854 3337 LT 1891 3337 LT 1898 3392 LT ST
1847 3392 MT 1847 3392 LT 1854 3447 LT 1891 3447 LT 1898 3392 LT ST
(br) 23 LC 1912 3392 WT pop 0 originOffset 50 add RSS
1898 3392 MT 1898 3392 LT 1905 3337 LT 1942 3337 LT 1949 3392 LT ST
1898 3392 MT 1898 3392 LT 1905 3447 LT 1942 3447 LT 1949 3392 LT ST
(br_taken) 23 LC 1963 3392 WT pop 0 originOffset 50 add RSS
1949 3392 MT 1949 3392 LT 1956 3337 LT 1993 3337 LT 2000 3392 LT ST
1949 3392 MT 1949 3392 LT 1956 3447 LT 1993 3447 LT 2000 3392 LT ST
(fetch1) 23 LC 2014 3392 WT pop 0 originOffset 50 add RSS
2000 3392 MT 2000 3392 LT 2007 3337 LT 2044 3337 LT 2051 3392 LT ST
2000 3392 MT 2000 3392 LT 2007 3447 LT 2044 3447 LT 2051 3392 LT ST
(fetch2) 23 LC 2065 3392 WT pop 0 originOffset 50 add RSS
2051 3392 MT 2051 3392 LT 2058 3337 LT 2095 3337 LT 2102 3392 LT ST
2051 3392 MT 2051 3392 LT 2058 3447 LT 2095 3447 LT 2102 3392 LT ST
(fetch3) 22 LC 2116 3392 WT pop 0 originOffset 50 add RSS
2102 3392 MT 2102 3392 LT 2109 3337 LT 2145 3337 LT 2152 3392 LT ST
2102 3392 MT 2102 3392 LT 2109 3447 LT 2145 3447 LT 2152 3392 LT ST
(decode) 23 LC 2166 3392 WT pop 0 originOffset 50 add RSS
2152 3392 MT 2152 3392 LT 2159 3337 LT 2196 3337 LT 2203 3392 LT ST
2152 3392 MT 2152 3392 LT 2159 3447 LT 2196 3447 LT 2203 3392 LT ST
(br) 23 LC 2217 3392 WT pop 0 originOffset 50 add RSS
2203 3392 MT 2203 3392 LT 2210 3337 LT 2247 3337 LT 2254 3392 LT ST
2203 3392 MT 2203 3392 LT 2210 3447 LT 2247 3447 LT 2254 3392 LT ST
(br_taken) 23 LC 2268 3392 WT pop 0 originOffset 50 add RSS
2254 3392 MT 2254 3392 LT 2261 3337 LT 2298 3337 LT 2305 3392 LT ST
2254 3392 MT 2254 3392 LT 2261 3447 LT 2298 3447 LT 2305 3392 LT ST
(fetch1) 23 LC 2319 3392 WT pop 0 originOffset 50 add RSS
2305 3392 MT 2305 3392 LT 2312 3337 LT 2349 3337 LT 2356 3392 LT ST
2305 3392 MT 2305 3392 LT 2312 3447 LT 2349 3447 LT 2356 3392 LT ST
(fetch2) 23 LC 2370 3392 WT pop 0 originOffset 50 add RSS
2356 3392 MT 2356 3392 LT 2363 3337 LT 2400 3337 LT 2407 3392 LT ST
2356 3392 MT 2356 3392 LT 2363 3447 LT 2400 3447 LT 2407 3392 LT ST
(fetch3) 23 LC 2421 3392 WT pop 0 originOffset 50 add RSS
2407 3392 MT 2407 3392 LT 2414 3337 LT 2451 3337 LT 2458 3392 LT ST
2407 3392 MT 2407 3392 LT 2414 3447 LT 2451 3447 LT 2458 3392 LT ST
(decode) 22 LC 2472 3392 WT pop 0 originOffset 50 add RSS
2458 3392 MT 2458 3392 LT 2465 3337 LT 2501 3337 LT 2508 3392 LT ST
2458 3392 MT 2458 3392 LT 2465 3447 LT 2501 3447 LT 2508 3392 LT ST
(br) 23 LC 2522 3392 WT pop 0 originOffset 50 add RSS
2508 3392 MT 2508 3392 LT 2515 3337 LT 2552 3337 LT 2559 3392 LT ST
2508 3392 MT 2508 3392 LT 2515 3447 LT 2552 3447 LT 2559 3392 LT ST
(br_taken) 23 LC 2573 3392 WT pop 0 originOffset 50 add RSS
2559 3392 MT 2559 3392 LT 2566 3337 LT 2603 3337 LT 2610 3392 LT ST
2559 3392 MT 2559 3392 LT 2566 3447 LT 2603 3447 LT 2610 3392 LT ST
(fetch1) 23 LC 2624 3392 WT pop 0 originOffset 50 add RSS
2610 3392 MT 2610 3392 LT 2617 3337 LT 2654 3337 LT 2661 3392 LT ST
2610 3392 MT 2610 3392 LT 2617 3447 LT 2654 3447 LT 2661 3392 LT ST
(fetch2) 23 LC 2675 3392 WT pop 0 originOffset 50 add RSS
2661 3392 MT 2661 3392 LT 2668 3337 LT 2705 3337 LT 2712 3392 LT ST
2661 3392 MT 2661 3392 LT 2668 3447 LT 2705 3447 LT 2712 3392 LT ST
(fetch3) 23 LC 2726 3392 WT pop 0 originOffset 50 add RSS
2712 3392 MT 2712 3392 LT 2719 3337 LT 2756 3337 LT 2763 3392 LT ST
2712 3392 MT 2712 3392 LT 2719 3447 LT 2756 3447 LT 2763 3392 LT ST
(decode) 23 LC 2777 3392 WT pop 0 originOffset 50 add RSS
2763 3392 MT 2763 3392 LT 2770 3337 LT 2807 3337 LT 2814 3392 LT ST
2763 3392 MT 2763 3392 LT 2770 3447 LT 2807 3447 LT 2814 3392 LT ST
(br) 22 LC 2828 3392 WT pop 0 originOffset 50 add RSS
2814 3392 MT 2814 3392 LT 2821 3337 LT 2857 3337 LT 2864 3392 LT ST
2814 3392 MT 2814 3392 LT 2821 3447 LT 2857 3447 LT 2864 3392 LT ST
(br_taken) 23 LC 2878 3392 WT pop 0 originOffset 50 add RSS
2864 3392 MT 2864 3392 LT 2871 3337 LT 2908 3337 LT 2915 3392 LT ST
2864 3392 MT 2864 3392 LT 2871 3447 LT 2908 3447 LT 2915 3392 LT ST
(fetch1) 23 LC 2929 3392 WT pop 0 originOffset 50 add RSS
2915 3392 MT 2915 3392 LT 2922 3337 LT 2959 3337 LT 2966 3392 LT ST
2915 3392 MT 2915 3392 LT 2922 3447 LT 2959 3447 LT 2966 3392 LT ST
(fetch2) 23 LC 2980 3392 WT pop 0 originOffset 50 add RSS
2966 3392 MT 2966 3392 LT 2973 3337 LT 3010 3337 LT 3017 3392 LT ST
2966 3392 MT 2966 3392 LT 2973 3447 LT 3010 3447 LT 3017 3392 LT ST
(fetch3) 23 LC 3031 3392 WT pop 0 originOffset 50 add RSS
3017 3392 MT 3017 3392 LT 3024 3337 LT 3061 3337 LT 3068 3392 LT ST
3017 3392 MT 3017 3392 LT 3024 3447 LT 3061 3447 LT 3068 3392 LT ST
(decode) 23 LC 3082 3392 WT pop 0 originOffset 50 add RSS
3068 3392 MT 3068 3392 LT 3075 3337 LT 3112 3337 LT 3119 3392 LT ST
3068 3392 MT 3068 3392 LT 3075 3447 LT 3112 3447 LT 3119 3392 LT ST
(br) 23 LC 3133 3392 WT pop 0 originOffset 50 add RSS
3119 3392 MT 3119 3392 LT 3126 3337 LT 3163 3337 LT 3170 3392 LT ST
3119 3392 MT 3119 3392 LT 3126 3447 LT 3163 3447 LT 3170 3392 LT ST
(br_taken) 22 LC 3184 3392 WT pop 0 originOffset 50 add RSS
3170 3392 MT 3170 3392 LT 3177 3337 LT 3213 3337 LT 3220 3392 LT ST
3170 3392 MT 3170 3392 LT 3177 3447 LT 3213 3447 LT 3220 3392 LT ST
(fetch1) 23 LC 3234 3392 WT pop 0 originOffset 50 add RSS
3220 3392 MT 3220 3392 LT 3227 3337 LT 3264 3337 LT 3271 3392 LT ST
3220 3392 MT 3220 3392 LT 3227 3447 LT 3264 3447 LT 3271 3392 LT ST
(fetch2) 23 LC 3285 3392 WT pop 0 originOffset 50 add RSS
3271 3392 MT 3271 3392 LT 3278 3337 LT 3315 3337 LT 3322 3392 LT ST
3271 3392 MT 3271 3392 LT 3278 3447 LT 3315 3447 LT 3322 3392 LT ST
(fetch3) 23 LC 3336 3392 WT pop 0 originOffset 50 add RSS
3322 3392 MT 3322 3392 LT 3329 3337 LT 3366 3337 LT 3373 3392 LT ST
3322 3392 MT 3322 3392 LT 3329 3447 LT 3366 3447 LT 3373 3392 LT ST
(decode) 23 LC 3387 3392 WT pop 0 originOffset 50 add RSS
3373 3392 MT 3373 3392 LT 3380 3337 LT 3417 3337 LT 3424 3392 LT ST
3373 3392 MT 3373 3392 LT 3380 3447 LT 3417 3447 LT 3424 3392 LT ST
(br) 23 LC 3438 3392 WT pop 0 originOffset 50 add RSS
3424 3392 MT 3424 3392 LT 3431 3337 LT 3468 3337 LT 3475 3392 LT ST
3424 3392 MT 3424 3392 LT 3431 3447 LT 3468 3447 LT 3475 3392 LT ST
(br_taken) 23 LC 3489 3392 WT pop 0 originOffset 50 add RSS
3475 3392 MT 3475 3392 LT 3482 3337 LT 3519 3337 LT 3526 3392 LT ST
3475 3392 MT 3475 3392 LT 3482 3447 LT 3519 3447 LT 3526 3392 LT ST
(fetch1) 22 LC 3540 3392 WT pop 0 originOffset 50 add RSS
3526 3392 MT 3526 3392 LT 3533 3337 LT 3569 3337 LT 3576 3392 LT ST
3526 3392 MT 3526 3392 LT 3533 3447 LT 3569 3447 LT 3576 3392 LT ST
(fetch2) 23 LC 3590 3392 WT pop 0 originOffset 50 add RSS
3576 3392 MT 3576 3392 LT 3583 3337 LT 3620 3337 LT 3627 3392 LT ST
3576 3392 MT 3576 3392 LT 3583 3447 LT 3620 3447 LT 3627 3392 LT ST
(fetch3) 23 LC 3641 3392 WT pop 0 originOffset 50 add RSS
3627 3392 MT 3627 3392 LT 3634 3337 LT 3671 3337 LT 3678 3392 LT ST
3627 3392 MT 3627 3392 LT 3634 3447 LT 3671 3447 LT 3678 3392 LT ST
(decode) 23 LC 3692 3392 WT pop 0 originOffset 50 add RSS
3678 3392 MT 3678 3392 LT 3685 3337 LT 3722 3337 LT 3729 3392 LT ST
3678 3392 MT 3678 3392 LT 3685 3447 LT 3722 3447 LT 3729 3392 LT ST
(br) 23 LC 3743 3392 WT pop 0 originOffset 50 add RSS
3729 3392 MT 3729 3392 LT 3736 3337 LT 3773 3337 LT 3780 3392 LT ST
3729 3392 MT 3729 3392 LT 3736 3447 LT 3773 3447 LT 3780 3392 LT ST
(br_taken) 23 LC 3794 3392 WT pop 0 originOffset 50 add RSS
3780 3392 MT 3780 3392 LT 3787 3337 LT 3824 3337 LT 3831 3392 LT ST
3780 3392 MT 3780 3392 LT 3787 3447 LT 3824 3447 LT 3831 3392 LT ST
(fetch1) 23 LC 3845 3392 WT pop 0 originOffset 50 add RSS
3831 3392 MT 3831 3392 LT 3838 3337 LT 3875 3337 LT 3882 3392 LT ST
3831 3392 MT 3831 3392 LT 3838 3447 LT 3875 3447 LT 3882 3392 LT ST
(fetch2) 23 LC 3896 3392 WT pop 0 originOffset 50 add RSS
3882 3392 MT 3882 3392 LT 3889 3337 LT 3926 3337 LT 3933 3392 LT ST
3882 3392 MT 3882 3392 LT 3889 3447 LT 3926 3447 LT 3933 3392 LT ST
(fetch3) 22 LC 3947 3392 WT pop 0 originOffset 50 add RSS
3933 3392 MT 3933 3392 LT 3940 3337 LT 3976 3337 LT 3983 3392 LT ST
3933 3392 MT 3933 3392 LT 3940 3447 LT 3976 3447 LT 3983 3392 LT ST
(decode) 23 LC 3997 3392 WT pop 0 originOffset 50 add RSS
3983 3392 MT 3983 3392 LT 3990 3337 LT 4027 3337 LT 4034 3392 LT ST
3983 3392 MT 3983 3392 LT 3990 3447 LT 4027 3447 LT 4034 3392 LT ST
(br) 23 LC 4048 3392 WT pop 0 originOffset 50 add RSS
4034 3392 MT 4034 3392 LT 4041 3337 LT 4078 3337 LT 4085 3392 LT ST
4034 3392 MT 4034 3392 LT 4041 3447 LT 4078 3447 LT 4085 3392 LT ST
(br_taken) 23 LC 4099 3392 WT pop 0 originOffset 50 add RSS
4085 3392 MT 4085 3392 LT 4092 3337 LT 4129 3337 LT 4136 3392 LT ST
4085 3392 MT 4085 3392 LT 4092 3447 LT 4129 3447 LT 4136 3392 LT ST
(fetch1) 23 LC 4150 3392 WT pop 0 originOffset 50 add RSS
4136 3392 MT 4136 3392 LT 4143 3337 LT 4180 3337 LT 4187 3392 LT ST
4136 3392 MT 4136 3392 LT 4143 3447 LT 4180 3447 LT 4187 3392 LT ST
(fetch2) 23 LC 4201 3392 WT pop 0 originOffset 50 add RSS
4187 3392 MT 4187 3392 LT 4194 3337 LT 4231 3337 LT 4238 3392 LT ST
4187 3392 MT 4187 3392 LT 4194 3447 LT 4231 3447 LT 4238 3392 LT ST
(fetch3) 23 LC 4252 3392 WT pop 0 originOffset 50 add RSS
4238 3392 MT 4238 3392 LT 4245 3337 LT 4282 3337 LT 4289 3392 LT ST
4238 3392 MT 4238 3392 LT 4245 3447 LT 4282 3447 LT 4289 3392 LT ST
(decode) 22 LC 4303 3392 WT pop 0 originOffset 50 add RSS
4289 3392 MT 4289 3392 LT 4296 3337 LT 4332 3337 LT 4339 3392 LT ST
4289 3392 MT 4289 3392 LT 4296 3447 LT 4332 3447 LT 4339 3392 LT ST
(br) 23 LC 4353 3392 WT pop 0 originOffset 50 add RSS
4339 3392 MT 4339 3392 LT 4346 3337 LT 4383 3337 LT 4390 3392 LT ST
4339 3392 MT 4339 3392 LT 4346 3447 LT 4383 3447 LT 4390 3392 LT ST
(br_taken) 23 LC 4404 3392 WT pop 0 originOffset 50 add RSS
4390 3392 MT 4390 3392 LT 4397 3337 LT 4434 3337 LT 4441 3392 LT ST
4390 3392 MT 4390 3392 LT 4397 3447 LT 4434 3447 LT 4441 3392 LT ST
(fetch1) 23 LC 4455 3392 WT pop 0 originOffset 50 add RSS
4441 3392 MT 4441 3392 LT 4448 3337 LT 4485 3337 LT 4492 3392 LT ST
4441 3392 MT 4441 3392 LT 4448 3447 LT 4485 3447 LT 4492 3392 LT ST
(fetch2) 23 LC 4506 3392 WT pop 0 originOffset 50 add RSS
4492 3392 MT 4492 3392 LT 4499 3337 LT 4536 3337 LT 4543 3392 LT ST
4492 3392 MT 4492 3392 LT 4499 3447 LT 4536 3447 LT 4543 3392 LT ST
(fetch3) 23 LC 4557 3392 WT pop 0 originOffset 50 add RSS
4543 3392 MT 4543 3392 LT 4550 3337 LT 4587 3337 LT 4594 3392 LT ST
4543 3392 MT 4543 3392 LT 4550 3447 LT 4587 3447 LT 4594 3392 LT ST
(decode) 23 LC 4608 3392 WT pop 0 originOffset 50 add RSS
4594 3392 MT 4594 3392 LT 4601 3337 LT 4638 3337 LT 4645 3392 LT ST
4594 3392 MT 4594 3392 LT 4601 3447 LT 4638 3447 LT 4645 3392 LT ST
(br) 22 LC 4659 3392 WT pop 0 originOffset 50 add RSS
4645 3392 MT 4645 3392 LT 4652 3337 LT 4688 3337 LT 4695 3392 LT ST
4645 3392 MT 4645 3392 LT 4652 3447 LT 4688 3447 LT 4695 3392 LT ST
(br_taken) 23 LC 4709 3392 WT pop 0 originOffset 50 add RSS
4695 3392 MT 4695 3392 LT 4702 3337 LT 4739 3337 LT 4746 3392 LT ST
4695 3392 MT 4695 3392 LT 4702 3447 LT 4739 3447 LT 4746 3392 LT ST
(fetch1) 23 LC 4760 3392 WT pop 0 originOffset 50 add RSS
4746 3392 MT 4746 3392 LT 4753 3337 LT 4790 3337 LT 4797 3392 LT ST
4746 3392 MT 4746 3392 LT 4753 3447 LT 4790 3447 LT 4797 3392 LT ST
(fetch2) 23 LC 4811 3392 WT pop 0 originOffset 50 add RSS
4797 3392 MT 4797 3392 LT 4804 3337 LT 4841 3337 LT 4848 3392 LT ST
4797 3392 MT 4797 3392 LT 4804 3447 LT 4841 3447 LT 4848 3392 LT ST
(fetch3) 23 LC 4862 3392 WT pop 0 originOffset 50 add RSS
4848 3392 MT 4848 3392 LT 4855 3337 LT 4892 3337 LT 4899 3392 LT ST
4848 3392 MT 4848 3392 LT 4855 3447 LT 4892 3447 LT 4899 3392 LT ST
(decode) 23 LC 4913 3392 WT pop 0 originOffset 50 add RSS
4899 3392 MT 4899 3392 LT 4906 3337 LT 4943 3337 LT 4950 3392 LT ST
4899 3392 MT 4899 3392 LT 4906 3447 LT 4943 3447 LT 4950 3392 LT ST
(br) 23 LC 4964 3392 WT pop 0 originOffset 50 add RSS
4950 3392 MT 4950 3392 LT 4957 3337 LT 4994 3337 LT 5001 3392 LT ST
4950 3392 MT 4950 3392 LT 4957 3447 LT 4994 3447 LT 5001 3392 LT ST
(br_taken) 22 LC 5015 3392 WT pop 0 originOffset 50 add RSS
5001 3392 MT 5001 3392 LT 5008 3337 LT 5044 3337 LT 5051 3392 LT ST
5001 3392 MT 5001 3392 LT 5008 3447 LT 5044 3447 LT 5051 3392 LT ST
(fetch1) 23 LC 5065 3392 WT pop 0 originOffset 50 add RSS
5051 3392 MT 5051 3392 LT 5058 3337 LT 5095 3337 LT 5102 3392 LT ST
5051 3392 MT 5051 3392 LT 5058 3447 LT 5095 3447 LT 5102 3392 LT ST
(fetch2) 23 LC 5116 3392 WT pop 0 originOffset 50 add RSS
5102 3392 MT 5102 3392 LT 5109 3337 LT 5146 3337 LT 5153 3392 LT ST
5102 3392 MT 5102 3392 LT 5109 3447 LT 5146 3447 LT 5153 3392 LT ST
(fetch3) 23 LC 5167 3392 WT pop 0 originOffset 50 add RSS
5153 3392 MT 5153 3392 LT 5160 3337 LT 5197 3337 LT 5204 3392 LT ST
5153 3392 MT 5153 3392 LT 5160 3447 LT 5197 3447 LT 5204 3392 LT ST
(decode) 23 LC 5218 3392 WT pop 0 originOffset 50 add RSS
5204 3392 MT 5204 3392 LT 5211 3337 LT 5248 3337 LT 5255 3392 LT ST
5204 3392 MT 5204 3392 LT 5211 3447 LT 5248 3447 LT 5255 3392 LT ST
(br) 23 LC 5269 3392 WT pop 0 originOffset 50 add RSS
5255 3392 MT 5255 3392 LT 5262 3337 LT 5299 3337 LT 5306 3392 LT ST
5255 3392 MT 5255 3392 LT 5262 3447 LT 5299 3447 LT 5306 3392 LT ST
(br_taken) 23 LC 5320 3392 WT pop 0 originOffset 50 add RSS
5306 3392 MT 5306 3392 LT 5313 3337 LT 5350 3337 LT 5357 3392 LT ST
5306 3392 MT 5306 3392 LT 5313 3447 LT 5350 3447 LT 5357 3392 LT ST
(fetch1) 22 LC 5371 3392 WT pop 0 originOffset 50 add RSS
5357 3392 MT 5357 3392 LT 5364 3337 LT 5400 3337 LT 5407 3392 LT ST
5357 3392 MT 5357 3392 LT 5364 3447 LT 5400 3447 LT 5407 3392 LT ST
(fetch2) 23 LC 5421 3392 WT pop 0 originOffset 50 add RSS
5407 3392 MT 5407 3392 LT 5414 3337 LT 5451 3337 LT 5458 3392 LT ST
5407 3392 MT 5407 3392 LT 5414 3447 LT 5451 3447 LT 5458 3392 LT ST
(fetch3) 23 LC 5472 3392 WT pop 0 originOffset 50 add RSS
5458 3392 MT 5458 3392 LT 5465 3337 LT 5502 3337 LT 5509 3392 LT ST
5458 3392 MT 5458 3392 LT 5465 3447 LT 5502 3447 LT 5509 3392 LT ST
(decode) 23 LC 5523 3392 WT pop 0 originOffset 50 add RSS
5509 3392 MT 5509 3392 LT 5516 3337 LT 5553 3337 LT 5560 3392 LT ST
5509 3392 MT 5509 3392 LT 5516 3447 LT 5553 3447 LT 5560 3392 LT ST
(br) 23 LC 5574 3392 WT pop 0 originOffset 50 add RSS
5560 3392 MT 5560 3392 LT 5567 3337 LT 5604 3337 LT 5611 3392 LT ST
5560 3392 MT 5560 3392 LT 5567 3447 LT 5604 3447 LT 5611 3392 LT ST
(br_taken) 23 LC 5625 3392 WT pop 0 originOffset 50 add RSS
5611 3392 MT 5611 3392 LT 5618 3337 LT 5655 3337 LT 5662 3392 LT ST
5611 3392 MT 5611 3392 LT 5618 3447 LT 5655 3447 LT 5662 3392 LT ST
(fetch1) 23 LC 5676 3392 WT pop 0 originOffset 50 add RSS
5662 3392 MT 5662 3392 LT 5669 3337 LT 5706 3337 LT 5713 3392 LT ST
5662 3392 MT 5662 3392 LT 5669 3447 LT 5706 3447 LT 5713 3392 LT ST
(fetch2) 22 LC 5727 3392 WT pop 0 originOffset 50 add RSS
5713 3392 MT 5713 3392 LT 5720 3337 LT 5756 3337 LT 5763 3392 LT ST
5713 3392 MT 5713 3392 LT 5720 3447 LT 5756 3447 LT 5763 3392 LT ST
(fetch3) 23 LC 5777 3392 WT pop 0 originOffset 50 add RSS
5763 3392 MT 5763 3392 LT 5770 3337 LT 5807 3337 LT 5814 3392 LT ST
5763 3392 MT 5763 3392 LT 5770 3447 LT 5807 3447 LT 5814 3392 LT ST
(decode) 23 LC 5828 3392 WT pop 0 originOffset 50 add RSS
5814 3392 MT 5814 3392 LT 5821 3337 LT 5858 3337 LT 5865 3392 LT ST
5814 3392 MT 5814 3392 LT 5821 3447 LT 5858 3447 LT 5865 3392 LT ST
(br) 23 LC 5879 3392 WT pop 0 originOffset 50 add RSS
5865 3392 MT 5865 3392 LT 5872 3337 LT 5909 3337 LT 5916 3392 LT ST
5865 3392 MT 5865 3392 LT 5872 3447 LT 5909 3447 LT 5916 3392 LT ST
(br_taken) 23 LC 5930 3392 WT pop 0 originOffset 50 add RSS
5916 3392 MT 5916 3392 LT 5923 3337 LT 5960 3337 LT 5967 3392 LT ST
5916 3392 MT 5916 3392 LT 5923 3447 LT 5960 3447 LT 5967 3392 LT ST
(fetch1) 23 LC 5981 3392 WT pop 0 originOffset 50 add RSS
5967 3392 MT 5967 3392 LT 5974 3337 LT 6011 3337 LT 6018 3392 LT ST
5967 3392 MT 5967 3392 LT 5974 3447 LT 6011 3447 LT 6018 3392 LT ST
(fetch2) 23 LC 6032 3392 WT pop 0 originOffset 50 add RSS
6018 3392 MT 6018 3392 LT 6025 3337 LT 6062 3337 LT 6069 3392 LT ST
6018 3392 MT 6018 3392 LT 6025 3447 LT 6062 3447 LT 6069 3392 LT ST
(fetch3) 22 LC 6083 3392 WT pop 0 originOffset 50 add RSS
6069 3392 MT 6069 3392 LT 6076 3337 LT 6112 3337 LT 6119 3392 LT ST
6069 3392 MT 6069 3392 LT 6076 3447 LT 6112 3447 LT 6119 3392 LT ST
(decode) 23 LC 6133 3392 WT pop 0 originOffset 50 add RSS
6119 3392 MT 6119 3392 LT 6126 3337 LT 6163 3337 LT 6170 3392 LT ST
6119 3392 MT 6119 3392 LT 6126 3447 LT 6163 3447 LT 6170 3392 LT ST
(br) 23 LC 6184 3392 WT pop 0 originOffset 50 add RSS
6170 3392 MT 6170 3392 LT 6177 3337 LT 6214 3337 LT 6221 3392 LT ST
6170 3392 MT 6170 3392 LT 6177 3447 LT 6214 3447 LT 6221 3392 LT ST
(br_taken) 23 LC 6235 3392 WT pop 0 originOffset 50 add RSS
6221 3392 MT 6221 3392 LT 6228 3337 LT 6265 3337 LT 6272 3392 LT ST
6221 3392 MT 6221 3392 LT 6228 3447 LT 6265 3447 LT 6272 3392 LT ST
(fetch1) -2 LC 6286 3392 WT pop 0 originOffset 50 add RSS
6272 3392 MT 6272 3392 LT 6279 3337 LT 6298 3337 LT ST
6272 3392 MT 6272 3392 LT 6279 3447 LT 6298 3447 LT ST
% draw footer
(Entity:mp2_tb  Architecture:  Date: Sun Oct 08 15:08:15 CDT 2017   Row: 1 Page: 1) 9999 LC 300 4799 WT TSW RSS
grestore
showpage
%%EOF
