%!PS-Adobe-3.0
%%Creator: Model Technology ModelSim ALTERA STARTER EDITION vsim 10.1d Simulator 2012.11 Nov  2 2012
%%Title: mp2_last1000way1.ps
%%CreationDate: 2017-10-08 03:14:32 PM
%%DocumentData: Clean8Bit
%%DocumentNeededResources: font Helvetica
%%Orientation: Landscape
%%PageOrder: ascend
%%Pages: 1
%%EndComments
%%BeginSetup
%%BeginFeature: *PageSize 8.5x11.0
<< /PageSize [612.0 792.0]
/ImagingBBox null
>> setpagedevice
%%EndFeature
%%EndSetup
%%Page: 1 1
gsave
90 rotate 0.12 dup neg scale
% dump string table
/NP {newpath} def/SD {setdash} def/CL {setrgbcolor} def/GR {setgray} def
/SX {exch LEdge sub XScale mul MaxLabelWidth add LMargin add LEdge LabelWidth sub add exch} def/CSX {exch dup LabelWidth gt {exch SX} {exch} ifelse} def
/MT {SX moveto} def/LS {SX lineto stroke} def/LT {SX lineto} def/LFS {SX lineto fill stroke} def/RSS {rmoveto show stroke} def/ST {stroke} def/WT {CSX moveto dup stringwidth pop} def/TSW {pop 0 originOffset} def
/TSE {MaxLabelWidth LabelWidth sub LMargin add 0 rmoveto neg originOffset} def/TS {-2 div originOffset CSX} def
/MLW {stringwidth pop dup MaxLabelWidth gt {/MaxLabelWidth exch def}{pop} ifelse XS} def
/XS {/XScale LabelWidth LMargin sub MaxLabelWidth LEdge LabelWidth sub add sub REdge LEdge sub div 1 add def} def
/ARC {5 -2 roll SX 5 2 roll arc} def/LC {1 index stringwidth pop lt {pop ()} if} def
/SW {stringwidth pop} def
/ESTR {   dup 3 add string   /CurrentStr exch def   exch 0 2 index getinterval   0 1 3 index 1 sub {     dup     2 index exch get exch     CurrentStr exch 3 -1 roll put   } for   pop   dup 1 2 2 index add {     CurrentStr exch 46 put   } for   pop} def
/LC {   exch  dup dup /CurrentStr exch def   SW 2 index gt {     CurrentStr length     dup     {       2 div cvi       3 index       CurrentStr SW       sub       dup 0 lt {         1 index         4 -1 roll         exch sub         3 1 roll       }       {         dup 5 index gt {           1 index 4 -1 roll add 3 1 roll         }         {           exit         } ifelse       } ifelse       3 index 2 index ESTR       1 index 0 eq {         exit       } if       pop     } loop     pop pop pop pop pop     CurrentStr   }   {     CurrentStr   } ifelse} def
/XScale 1 def/MaxLabelWidth 0 def/LMargin 300 def/LEdge 1037 def/REdge 5699 def/LabelWidth 1000 def
/Helvetica findfont [100 0 0 -100 0 0] makefont setfont
/originOffset   currentfont   /FontBBox get 1 get   currentfont  /FontMatrix get 3 get   mul   currentfont   /FontType get   42 eq {     1000000 div   } {     neg   } ifelse def
(data \(way 1\)) MLW
([7]) MLW
([6]) MLW
([5]) MLW
([4]) MLW
([3]) MLW
([2]) MLW
([1]) MLW
([0]) MLW
(tag \(way 1\)) MLW
([7]) MLW
([6]) MLW
([5]) MLW
([4]) MLW
([3]) MLW
([2]) MLW
([1]) MLW
([0]) MLW
(pc_out) MLW
% draw waveform shading
0 0 0 CL
(52205220522052205220522052205220 6ddd6ccd6bbd6aad699d688d677d6660 600d600d600d0130600d600d600d0030 bbcc99aa7788556633441122014800c2 600d600d0060600d600d600d600d60fa 00000e29e002390a186134007242324a 6a83784428466a816c8c6c8c6c8c6c4f 0fff03f916ff68862c046c0068016a42) 5233 LC 1051 389 WT pop 0 originOffset 50 add RSS
[] 0 SD
3 setlinewidth
0 setlinejoin
0 setlinecap
1037 334 MT 1037 334 LT 6298 334 LT ST
1037 444 MT 1037 444 LT 6298 444 LT ST
(52205220522052205220522052205220) 5233 LC 1051 576 WT pop 0 originOffset 50 add RSS
1037 521 MT 1037 521 LT 6298 521 LT ST
1037 631 MT 1037 631 LT 6298 631 LT ST
(6ddd6ccd6bbd6aad699d688d677d6660) 5233 LC 1051 763 WT pop 0 originOffset 50 add RSS
1037 708 MT 1037 708 LT 6298 708 LT ST
1037 818 MT 1037 818 LT 6298 818 LT ST
(600d600d600d0130600d600d600d0030) 5233 LC 1051 950 WT pop 0 originOffset 50 add RSS
1037 895 MT 1037 895 LT 6298 895 LT ST
1037 1005 MT 1037 1005 LT 6298 1005 LT ST
(bbcc99aa7788556633441122014800c2) 5233 LC 1051 1137 WT pop 0 originOffset 50 add RSS
1037 1082 MT 1037 1082 LT 6298 1082 LT ST
1037 1192 MT 1037 1192 LT 6298 1192 LT ST
(600d600d0060600d600d600d600d60fa) 5233 LC 1051 1324 WT pop 0 originOffset 50 add RSS
1037 1269 MT 1037 1269 LT 6298 1269 LT ST
1037 1379 MT 1037 1379 LT 6298 1379 LT ST
(00000e29e002390a186134007242324a) 5233 LC 1051 1511 WT pop 0 originOffset 50 add RSS
1037 1456 MT 1037 1456 LT 6298 1456 LT ST
1037 1566 MT 1037 1566 LT 6298 1566 LT ST
(6a83784428466a816c8c6c8c6c8c6c4f) 5233 LC 1051 1698 WT pop 0 originOffset 50 add RSS
1037 1643 MT 1037 1643 LT 6298 1643 LT ST
1037 1753 MT 1037 1753 LT 6298 1753 LT ST
(0fff03f916ff68862c046c0068016a42) 5233 LC 1051 1885 WT pop 0 originOffset 50 add RSS
1037 1830 MT 1037 1830 LT 6298 1830 LT ST
1037 1940 MT 1037 1940 LT 6298 1940 LT ST
(001 000 000 000 000 000 000 002) 5233 LC 1051 2072 WT pop 0 originOffset 50 add RSS
1037 2017 MT 1037 2017 LT 6298 2017 LT ST
1037 2127 MT 1037 2127 LT 6298 2127 LT ST
(001) 5233 LC 1051 2259 WT pop 0 originOffset 50 add RSS
1037 2204 MT 1037 2204 LT 6298 2204 LT ST
1037 2314 MT 1037 2314 LT 6298 2314 LT ST
(000) 5233 LC 1051 2446 WT pop 0 originOffset 50 add RSS
1037 2391 MT 1037 2391 LT 6298 2391 LT ST
1037 2501 MT 1037 2501 LT 6298 2501 LT ST
(000) 5233 LC 1051 2633 WT pop 0 originOffset 50 add RSS
1037 2578 MT 1037 2578 LT 6298 2578 LT ST
1037 2688 MT 1037 2688 LT 6298 2688 LT ST
(000) 5233 LC 1051 2820 WT pop 0 originOffset 50 add RSS
1037 2765 MT 1037 2765 LT 6298 2765 LT ST
1037 2875 MT 1037 2875 LT 6298 2875 LT ST
(000) 5233 LC 1051 3007 WT pop 0 originOffset 50 add RSS
1037 2952 MT 1037 2952 LT 6298 2952 LT ST
1037 3062 MT 1037 3062 LT 6298 3062 LT ST
(000) 5233 LC 1051 3194 WT pop 0 originOffset 50 add RSS
1037 3139 MT 1037 3139 LT 6298 3139 LT ST
1037 3249 MT 1037 3249 LT 6298 3249 LT ST
(000) 5233 LC 1051 3381 WT pop 0 originOffset 50 add RSS
1037 3326 MT 1037 3326 LT 6298 3326 LT ST
1037 3436 MT 1037 3436 LT 6298 3436 LT ST
(002) 5233 LC 1051 3568 WT pop 0 originOffset 50 add RSS
1037 3513 MT 1037 3513 LT 6298 3513 LT ST
1037 3623 MT 1037 3623 LT 6298 3623 LT ST
(0110) 156 LC 1051 3755 WT pop 0 originOffset 50 add RSS
1037 3700 MT 1037 3700 LT 1214 3700 LT 1221 3755 LT ST
1037 3810 MT 1037 3810 LT 1214 3810 LT 1221 3755 LT ST
(010e) 24 LC 1235 3755 WT pop 0 originOffset 50 add RSS
1221 3755 MT 1221 3755 LT 1228 3700 LT 1266 3700 LT 1273 3755 LT ST
1221 3755 MT 1221 3755 LT 1228 3810 LT 1266 3810 LT 1273 3755 LT ST
(0110) 235 LC 1287 3755 WT pop 0 originOffset 50 add RSS
1273 3755 MT 1273 3755 LT 1280 3700 LT 1529 3700 LT 1536 3755 LT ST
1273 3755 MT 1273 3755 LT 1280 3810 LT 1529 3810 LT 1536 3755 LT ST
(010e) 25 LC 1550 3755 WT pop 0 originOffset 50 add RSS
1536 3755 MT 1536 3755 LT 1543 3700 LT 1582 3700 LT 1589 3755 LT ST
1536 3755 MT 1536 3755 LT 1543 3810 LT 1582 3810 LT 1589 3755 LT ST
(0110) 235 LC 1603 3755 WT pop 0 originOffset 50 add RSS
1589 3755 MT 1589 3755 LT 1596 3700 LT 1845 3700 LT 1852 3755 LT ST
1589 3755 MT 1589 3755 LT 1596 3810 LT 1845 3810 LT 1852 3755 LT ST
(010e) 25 LC 1866 3755 WT pop 0 originOffset 50 add RSS
1852 3755 MT 1852 3755 LT 1859 3700 LT 1898 3700 LT 1905 3755 LT ST
1852 3755 MT 1852 3755 LT 1859 3810 LT 1898 3810 LT 1905 3755 LT ST
(0110) 235 LC 1919 3755 WT pop 0 originOffset 50 add RSS
1905 3755 MT 1905 3755 LT 1912 3700 LT 2161 3700 LT 2168 3755 LT ST
1905 3755 MT 1905 3755 LT 1912 3810 LT 2161 3810 LT 2168 3755 LT ST
(010e) 24 LC 2182 3755 WT pop 0 originOffset 50 add RSS
2168 3755 MT 2168 3755 LT 2175 3700 LT 2213 3700 LT 2220 3755 LT ST
2168 3755 MT 2168 3755 LT 2175 3810 LT 2213 3810 LT 2220 3755 LT ST
(0110) 235 LC 2234 3755 WT pop 0 originOffset 50 add RSS
2220 3755 MT 2220 3755 LT 2227 3700 LT 2476 3700 LT 2483 3755 LT ST
2220 3755 MT 2220 3755 LT 2227 3810 LT 2476 3810 LT 2483 3755 LT ST
(010e) 25 LC 2497 3755 WT pop 0 originOffset 50 add RSS
2483 3755 MT 2483 3755 LT 2490 3700 LT 2529 3700 LT 2536 3755 LT ST
2483 3755 MT 2483 3755 LT 2490 3810 LT 2529 3810 LT 2536 3755 LT ST
(0110) 235 LC 2550 3755 WT pop 0 originOffset 50 add RSS
2536 3755 MT 2536 3755 LT 2543 3700 LT 2792 3700 LT 2799 3755 LT ST
2536 3755 MT 2536 3755 LT 2543 3810 LT 2792 3810 LT 2799 3755 LT ST
(010e) 25 LC 2813 3755 WT pop 0 originOffset 50 add RSS
2799 3755 MT 2799 3755 LT 2806 3700 LT 2845 3700 LT 2852 3755 LT ST
2799 3755 MT 2799 3755 LT 2806 3810 LT 2845 3810 LT 2852 3755 LT ST
(0110) 235 LC 2866 3755 WT pop 0 originOffset 50 add RSS
2852 3755 MT 2852 3755 LT 2859 3700 LT 3108 3700 LT 3115 3755 LT ST
2852 3755 MT 2852 3755 LT 2859 3810 LT 3108 3810 LT 3115 3755 LT ST
(010e) 24 LC 3129 3755 WT pop 0 originOffset 50 add RSS
3115 3755 MT 3115 3755 LT 3122 3700 LT 3160 3700 LT 3167 3755 LT ST
3115 3755 MT 3115 3755 LT 3122 3810 LT 3160 3810 LT 3167 3755 LT ST
(0110) 235 LC 3181 3755 WT pop 0 originOffset 50 add RSS
3167 3755 MT 3167 3755 LT 3174 3700 LT 3423 3700 LT 3430 3755 LT ST
3167 3755 MT 3167 3755 LT 3174 3810 LT 3423 3810 LT 3430 3755 LT ST
(010e) 25 LC 3444 3755 WT pop 0 originOffset 50 add RSS
3430 3755 MT 3430 3755 LT 3437 3700 LT 3476 3700 LT 3483 3755 LT ST
3430 3755 MT 3430 3755 LT 3437 3810 LT 3476 3810 LT 3483 3755 LT ST
(0110) 235 LC 3497 3755 WT pop 0 originOffset 50 add RSS
3483 3755 MT 3483 3755 LT 3490 3700 LT 3739 3700 LT 3746 3755 LT ST
3483 3755 MT 3483 3755 LT 3490 3810 LT 3739 3810 LT 3746 3755 LT ST
(010e) 25 LC 3760 3755 WT pop 0 originOffset 50 add RSS
3746 3755 MT 3746 3755 LT 3753 3700 LT 3792 3700 LT 3799 3755 LT ST
3746 3755 MT 3746 3755 LT 3753 3810 LT 3792 3810 LT 3799 3755 LT ST
(0110) 235 LC 3813 3755 WT pop 0 originOffset 50 add RSS
3799 3755 MT 3799 3755 LT 3806 3700 LT 4055 3700 LT 4062 3755 LT ST
3799 3755 MT 3799 3755 LT 3806 3810 LT 4055 3810 LT 4062 3755 LT ST
(010e) 24 LC 4076 3755 WT pop 0 originOffset 50 add RSS
4062 3755 MT 4062 3755 LT 4069 3700 LT 4107 3700 LT 4114 3755 LT ST
4062 3755 MT 4062 3755 LT 4069 3810 LT 4107 3810 LT 4114 3755 LT ST
(0110) 235 LC 4128 3755 WT pop 0 originOffset 50 add RSS
4114 3755 MT 4114 3755 LT 4121 3700 LT 4370 3700 LT 4377 3755 LT ST
4114 3755 MT 4114 3755 LT 4121 3810 LT 4370 3810 LT 4377 3755 LT ST
(010e) 25 LC 4391 3755 WT pop 0 originOffset 50 add RSS
4377 3755 MT 4377 3755 LT 4384 3700 LT 4423 3700 LT 4430 3755 LT ST
4377 3755 MT 4377 3755 LT 4384 3810 LT 4423 3810 LT 4430 3755 LT ST
(0110) 235 LC 4444 3755 WT pop 0 originOffset 50 add RSS
4430 3755 MT 4430 3755 LT 4437 3700 LT 4686 3700 LT 4693 3755 LT ST
4430 3755 MT 4430 3755 LT 4437 3810 LT 4686 3810 LT 4693 3755 LT ST
(010e) 25 LC 4707 3755 WT pop 0 originOffset 50 add RSS
4693 3755 MT 4693 3755 LT 4700 3700 LT 4739 3700 LT 4746 3755 LT ST
4693 3755 MT 4693 3755 LT 4700 3810 LT 4739 3810 LT 4746 3755 LT ST
(0110) 235 LC 4760 3755 WT pop 0 originOffset 50 add RSS
4746 3755 MT 4746 3755 LT 4753 3700 LT 5002 3700 LT 5009 3755 LT ST
4746 3755 MT 4746 3755 LT 4753 3810 LT 5002 3810 LT 5009 3755 LT ST
(010e) 24 LC 5023 3755 WT pop 0 originOffset 50 add RSS
5009 3755 MT 5009 3755 LT 5016 3700 LT 5054 3700 LT 5061 3755 LT ST
5009 3755 MT 5009 3755 LT 5016 3810 LT 5054 3810 LT 5061 3755 LT ST
(0110) 235 LC 5075 3755 WT pop 0 originOffset 50 add RSS
5061 3755 MT 5061 3755 LT 5068 3700 LT 5317 3700 LT 5324 3755 LT ST
5061 3755 MT 5061 3755 LT 5068 3810 LT 5317 3810 LT 5324 3755 LT ST
(010e) 25 LC 5338 3755 WT pop 0 originOffset 50 add RSS
5324 3755 MT 5324 3755 LT 5331 3700 LT 5370 3700 LT 5377 3755 LT ST
5324 3755 MT 5324 3755 LT 5331 3810 LT 5370 3810 LT 5377 3755 LT ST
(0110) 235 LC 5391 3755 WT pop 0 originOffset 50 add RSS
5377 3755 MT 5377 3755 LT 5384 3700 LT 5633 3700 LT 5640 3755 LT ST
5377 3755 MT 5377 3755 LT 5384 3810 LT 5633 3810 LT 5640 3755 LT ST
(010e) 24 LC 5654 3755 WT pop 0 originOffset 50 add RSS
5640 3755 MT 5640 3755 LT 5647 3700 LT 5685 3700 LT 5692 3755 LT ST
5640 3755 MT 5640 3755 LT 5647 3810 LT 5685 3810 LT 5692 3755 LT ST
(0110) 236 LC 5706 3755 WT pop 0 originOffset 50 add RSS
5692 3755 MT 5692 3755 LT 5699 3700 LT 5949 3700 LT 5956 3755 LT ST
5692 3755 MT 5692 3755 LT 5699 3810 LT 5949 3810 LT 5956 3755 LT ST
(010e) 24 LC 5970 3755 WT pop 0 originOffset 50 add RSS
5956 3755 MT 5956 3755 LT 5963 3700 LT 6001 3700 LT 6008 3755 LT ST
5956 3755 MT 5956 3755 LT 5963 3810 LT 6001 3810 LT 6008 3755 LT ST
(0110) 235 LC 6022 3755 WT pop 0 originOffset 50 add RSS
6008 3755 MT 6008 3755 LT 6015 3700 LT 6264 3700 LT 6271 3755 LT ST
6008 3755 MT 6008 3755 LT 6015 3810 LT 6264 3810 LT 6271 3755 LT ST
(010e) -1 LC 6285 3755 WT pop 0 originOffset 50 add RSS
6271 3755 MT 6271 3755 LT 6278 3700 LT 6298 3700 LT ST
6271 3755 MT 6271 3755 LT 6278 3810 LT 6298 3810 LT ST
% draw timeline
1052 4455 MT 1052 4492 LS
1051 4474 MT 1053 4474 LS
(+20 ) 9999 LC 1052 4597 WT TS RSS
1090 4455 MT 1090 4492 LS
1142 4455 MT 1142 4492 LS
1195 4455 MT 1195 4492 LS
1247 4455 MT 1247 4492 LS
1300 4455 MT 1300 4492 LS
1353 4455 MT 1353 4492 LS
1405 4455 MT 1405 4492 LS
1458 4455 MT 1458 4492 LS
1510 4455 MT 1510 4492 LS
1563 4428 MT 1563 4492 LS
1616 4455 MT 1616 4492 LS
1668 4455 MT 1668 4492 LS
1721 4455 MT 1721 4492 LS
1773 4455 MT 1773 4492 LS
1826 4455 MT 1826 4492 LS
1879 4455 MT 1879 4492 LS
1931 4455 MT 1931 4492 LS
1984 4455 MT 1984 4492 LS
2036 4455 MT 2036 4492 LS
2089 4428 MT 2089 4492 LS
(49200 ns) 9999 LC 2089 4597 WT TS RSS
2142 4455 MT 2142 4492 LS
2194 4455 MT 2194 4492 LS
2247 4455 MT 2247 4492 LS
2299 4455 MT 2299 4492 LS
2352 4455 MT 2352 4492 LS
2405 4455 MT 2405 4492 LS
2457 4455 MT 2457 4492 LS
2510 4455 MT 2510 4492 LS
2562 4455 MT 2562 4492 LS
2615 4428 MT 2615 4492 LS
2668 4455 MT 2668 4492 LS
2720 4455 MT 2720 4492 LS
2773 4455 MT 2773 4492 LS
2825 4455 MT 2825 4492 LS
2878 4455 MT 2878 4492 LS
2931 4455 MT 2931 4492 LS
2983 4455 MT 2983 4492 LS
3036 4455 MT 3036 4492 LS
3088 4455 MT 3088 4492 LS
3141 4428 MT 3141 4492 LS
(49400 ns) 9999 LC 3141 4597 WT TS RSS
3194 4455 MT 3194 4492 LS
3246 4455 MT 3246 4492 LS
3299 4455 MT 3299 4492 LS
3351 4455 MT 3351 4492 LS
3404 4455 MT 3404 4492 LS
3457 4455 MT 3457 4492 LS
3509 4455 MT 3509 4492 LS
3562 4455 MT 3562 4492 LS
3614 4455 MT 3614 4492 LS
3667 4428 MT 3667 4492 LS
3720 4455 MT 3720 4492 LS
3772 4455 MT 3772 4492 LS
3825 4455 MT 3825 4492 LS
3877 4455 MT 3877 4492 LS
3930 4455 MT 3930 4492 LS
3983 4455 MT 3983 4492 LS
4035 4455 MT 4035 4492 LS
4088 4455 MT 4088 4492 LS
4140 4455 MT 4140 4492 LS
4193 4428 MT 4193 4492 LS
(49600 ns) 9999 LC 4193 4597 WT TS RSS
4246 4455 MT 4246 4492 LS
4298 4455 MT 4298 4492 LS
4351 4455 MT 4351 4492 LS
4403 4455 MT 4403 4492 LS
4456 4455 MT 4456 4492 LS
4509 4455 MT 4509 4492 LS
4561 4455 MT 4561 4492 LS
4614 4455 MT 4614 4492 LS
4666 4455 MT 4666 4492 LS
4719 4428 MT 4719 4492 LS
4772 4455 MT 4772 4492 LS
4824 4455 MT 4824 4492 LS
4877 4455 MT 4877 4492 LS
4929 4455 MT 4929 4492 LS
4982 4455 MT 4982 4492 LS
5035 4455 MT 5035 4492 LS
5087 4455 MT 5087 4492 LS
5140 4455 MT 5140 4492 LS
5192 4455 MT 5192 4492 LS
5245 4428 MT 5245 4492 LS
(49800 ns) 9999 LC 5245 4597 WT TS RSS
5298 4455 MT 5298 4492 LS
5350 4455 MT 5350 4492 LS
5403 4455 MT 5403 4492 LS
5455 4455 MT 5455 4492 LS
5508 4455 MT 5508 4492 LS
5561 4455 MT 5561 4492 LS
5613 4455 MT 5613 4492 LS
5666 4455 MT 5666 4492 LS
5718 4455 MT 5718 4492 LS
5771 4428 MT 5771 4492 LS
5824 4455 MT 5824 4492 LS
5876 4455 MT 5876 4492 LS
5929 4455 MT 5929 4492 LS
5981 4455 MT 5981 4492 LS
6034 4455 MT 6034 4492 LS
6087 4455 MT 6087 4492 LS
6139 4455 MT 6139 4492 LS
6192 4455 MT 6192 4492 LS
6244 4455 MT 6244 4492 LS
6298 4428 MT 6298 4492 LS
(50000 ns) 9999 LC 6298 4597 WT TS RSS
6351 4455 MT 6351 4492 LS
6403 4455 MT 6403 4492 LS
6456 4455 MT 6456 4492 LS
6508 4455 MT 6508 4492 LS
6561 4455 MT 6561 4492 LS
6614 4455 MT 6614 4492 LS
6666 4455 MT 6666 4492 LS
6719 4455 MT 6719 4492 LS
6771 4455 MT 6771 4492 LS
% draw grid
1563 300 MT 1563 4428 LS
2089 300 MT 2089 4428 LS
2615 300 MT 2615 4428 LS
3141 300 MT 3141 4428 LS
3667 300 MT 3667 4428 LS
4193 300 MT 4193 4428 LS
4719 300 MT 4719 4428 LS
5245 300 MT 5245 4428 LS
5771 300 MT 5771 4428 LS
6298 300 MT 6298 4428 LS
% draw waveforms
(data \(way 1\)) 9999 LC 1000 443 WT TSE RSS
1556 300 MT 1570 300 LS
2082 300 MT 2096 300 LS
2608 300 MT 2622 300 LS
3134 300 MT 3148 300 LS
3660 300 MT 3674 300 LS
4186 300 MT 4200 300 LS
4712 300 MT 4726 300 LS
5238 300 MT 5252 300 LS
5764 300 MT 5778 300 LS
6291 300 MT 6305 300 LS
(52205220522052205220522052205220 6ddd6ccd6bbd6aad699d688d677d6660 600d600d600d0130600d600d600d0030 bbcc99aa7788556633441122014800c2 600d600d0060600d600d600d600d60fa 00000e29e002390a186134007242324a 6a83784428466a816c8c6c8c6c8c6c4f 0fff03f916ff68862c046c0068016a42) 5233 LC 1051 389 WT pop 0 originOffset 50 add RSS
1037 334 MT 1037 334 LT 6298 334 LT ST
1037 444 MT 1037 444 LT 6298 444 LT ST
([7]) 9999 LC 1000 630 WT TSE RSS
1556 487 MT 1570 487 LS
2082 487 MT 2096 487 LS
2608 487 MT 2622 487 LS
3134 487 MT 3148 487 LS
3660 487 MT 3674 487 LS
4186 487 MT 4200 487 LS
4712 487 MT 4726 487 LS
5238 487 MT 5252 487 LS
5764 487 MT 5778 487 LS
6291 487 MT 6305 487 LS
(52205220522052205220522052205220) 5233 LC 1051 576 WT pop 0 originOffset 50 add RSS
1037 521 MT 1037 521 LT 6298 521 LT ST
1037 631 MT 1037 631 LT 6298 631 LT ST
([6]) 9999 LC 1000 817 WT TSE RSS
1556 674 MT 1570 674 LS
2082 674 MT 2096 674 LS
2608 674 MT 2622 674 LS
3134 674 MT 3148 674 LS
3660 674 MT 3674 674 LS
4186 674 MT 4200 674 LS
4712 674 MT 4726 674 LS
5238 674 MT 5252 674 LS
5764 674 MT 5778 674 LS
6291 674 MT 6305 674 LS
(6ddd6ccd6bbd6aad699d688d677d6660) 5233 LC 1051 763 WT pop 0 originOffset 50 add RSS
1037 708 MT 1037 708 LT 6298 708 LT ST
1037 818 MT 1037 818 LT 6298 818 LT ST
([5]) 9999 LC 1000 1004 WT TSE RSS
1556 861 MT 1570 861 LS
2082 861 MT 2096 861 LS
2608 861 MT 2622 861 LS
3134 861 MT 3148 861 LS
3660 861 MT 3674 861 LS
4186 861 MT 4200 861 LS
4712 861 MT 4726 861 LS
5238 861 MT 5252 861 LS
5764 861 MT 5778 861 LS
6291 861 MT 6305 861 LS
(600d600d600d0130600d600d600d0030) 5233 LC 1051 950 WT pop 0 originOffset 50 add RSS
1037 895 MT 1037 895 LT 6298 895 LT ST
1037 1005 MT 1037 1005 LT 6298 1005 LT ST
([4]) 9999 LC 1000 1191 WT TSE RSS
1556 1048 MT 1570 1048 LS
2082 1048 MT 2096 1048 LS
2608 1048 MT 2622 1048 LS
3134 1048 MT 3148 1048 LS
3660 1048 MT 3674 1048 LS
4186 1048 MT 4200 1048 LS
4712 1048 MT 4726 1048 LS
5238 1048 MT 5252 1048 LS
5764 1048 MT 5778 1048 LS
6291 1048 MT 6305 1048 LS
(bbcc99aa7788556633441122014800c2) 5233 LC 1051 1137 WT pop 0 originOffset 50 add RSS
1037 1082 MT 1037 1082 LT 6298 1082 LT ST
1037 1192 MT 1037 1192 LT 6298 1192 LT ST
([3]) 9999 LC 1000 1378 WT TSE RSS
1556 1235 MT 1570 1235 LS
2082 1235 MT 2096 1235 LS
2608 1235 MT 2622 1235 LS
3134 1235 MT 3148 1235 LS
3660 1235 MT 3674 1235 LS
4186 1235 MT 4200 1235 LS
4712 1235 MT 4726 1235 LS
5238 1235 MT 5252 1235 LS
5764 1235 MT 5778 1235 LS
6291 1235 MT 6305 1235 LS
(600d600d0060600d600d600d600d60fa) 5233 LC 1051 1324 WT pop 0 originOffset 50 add RSS
1037 1269 MT 1037 1269 LT 6298 1269 LT ST
1037 1379 MT 1037 1379 LT 6298 1379 LT ST
([2]) 9999 LC 1000 1565 WT TSE RSS
1556 1422 MT 1570 1422 LS
2082 1422 MT 2096 1422 LS
2608 1422 MT 2622 1422 LS
3134 1422 MT 3148 1422 LS
3660 1422 MT 3674 1422 LS
4186 1422 MT 4200 1422 LS
4712 1422 MT 4726 1422 LS
5238 1422 MT 5252 1422 LS
5764 1422 MT 5778 1422 LS
6291 1422 MT 6305 1422 LS
(00000e29e002390a186134007242324a) 5233 LC 1051 1511 WT pop 0 originOffset 50 add RSS
1037 1456 MT 1037 1456 LT 6298 1456 LT ST
1037 1566 MT 1037 1566 LT 6298 1566 LT ST
([1]) 9999 LC 1000 1752 WT TSE RSS
1556 1609 MT 1570 1609 LS
2082 1609 MT 2096 1609 LS
2608 1609 MT 2622 1609 LS
3134 1609 MT 3148 1609 LS
3660 1609 MT 3674 1609 LS
4186 1609 MT 4200 1609 LS
4712 1609 MT 4726 1609 LS
5238 1609 MT 5252 1609 LS
5764 1609 MT 5778 1609 LS
6291 1609 MT 6305 1609 LS
(6a83784428466a816c8c6c8c6c8c6c4f) 5233 LC 1051 1698 WT pop 0 originOffset 50 add RSS
1037 1643 MT 1037 1643 LT 6298 1643 LT ST
1037 1753 MT 1037 1753 LT 6298 1753 LT ST
([0]) 9999 LC 1000 1939 WT TSE RSS
1556 1796 MT 1570 1796 LS
2082 1796 MT 2096 1796 LS
2608 1796 MT 2622 1796 LS
3134 1796 MT 3148 1796 LS
3660 1796 MT 3674 1796 LS
4186 1796 MT 4200 1796 LS
4712 1796 MT 4726 1796 LS
5238 1796 MT 5252 1796 LS
5764 1796 MT 5778 1796 LS
6291 1796 MT 6305 1796 LS
(0fff03f916ff68862c046c0068016a42) 5233 LC 1051 1885 WT pop 0 originOffset 50 add RSS
1037 1830 MT 1037 1830 LT 6298 1830 LT ST
1037 1940 MT 1037 1940 LT 6298 1940 LT ST
(tag \(way 1\)) 9999 LC 1000 2126 WT TSE RSS
1556 1983 MT 1570 1983 LS
2082 1983 MT 2096 1983 LS
2608 1983 MT 2622 1983 LS
3134 1983 MT 3148 1983 LS
3660 1983 MT 3674 1983 LS
4186 1983 MT 4200 1983 LS
4712 1983 MT 4726 1983 LS
5238 1983 MT 5252 1983 LS
5764 1983 MT 5778 1983 LS
6291 1983 MT 6305 1983 LS
(001 000 000 000 000 000 000 002) 5233 LC 1051 2072 WT pop 0 originOffset 50 add RSS
1037 2017 MT 1037 2017 LT 6298 2017 LT ST
1037 2127 MT 1037 2127 LT 6298 2127 LT ST
([7]) 9999 LC 1000 2313 WT TSE RSS
1556 2170 MT 1570 2170 LS
2082 2170 MT 2096 2170 LS
2608 2170 MT 2622 2170 LS
3134 2170 MT 3148 2170 LS
3660 2170 MT 3674 2170 LS
4186 2170 MT 4200 2170 LS
4712 2170 MT 4726 2170 LS
5238 2170 MT 5252 2170 LS
5764 2170 MT 5778 2170 LS
6291 2170 MT 6305 2170 LS
(001) 5233 LC 1051 2259 WT pop 0 originOffset 50 add RSS
1037 2204 MT 1037 2204 LT 6298 2204 LT ST
1037 2314 MT 1037 2314 LT 6298 2314 LT ST
([6]) 9999 LC 1000 2500 WT TSE RSS
1556 2357 MT 1570 2357 LS
2082 2357 MT 2096 2357 LS
2608 2357 MT 2622 2357 LS
3134 2357 MT 3148 2357 LS
3660 2357 MT 3674 2357 LS
4186 2357 MT 4200 2357 LS
4712 2357 MT 4726 2357 LS
5238 2357 MT 5252 2357 LS
5764 2357 MT 5778 2357 LS
6291 2357 MT 6305 2357 LS
(000) 5233 LC 1051 2446 WT pop 0 originOffset 50 add RSS
1037 2391 MT 1037 2391 LT 6298 2391 LT ST
1037 2501 MT 1037 2501 LT 6298 2501 LT ST
([5]) 9999 LC 1000 2687 WT TSE RSS
1556 2544 MT 1570 2544 LS
2082 2544 MT 2096 2544 LS
2608 2544 MT 2622 2544 LS
3134 2544 MT 3148 2544 LS
3660 2544 MT 3674 2544 LS
4186 2544 MT 4200 2544 LS
4712 2544 MT 4726 2544 LS
5238 2544 MT 5252 2544 LS
5764 2544 MT 5778 2544 LS
6291 2544 MT 6305 2544 LS
(000) 5233 LC 1051 2633 WT pop 0 originOffset 50 add RSS
1037 2578 MT 1037 2578 LT 6298 2578 LT ST
1037 2688 MT 1037 2688 LT 6298 2688 LT ST
([4]) 9999 LC 1000 2874 WT TSE RSS
1556 2731 MT 1570 2731 LS
2082 2731 MT 2096 2731 LS
2608 2731 MT 2622 2731 LS
3134 2731 MT 3148 2731 LS
3660 2731 MT 3674 2731 LS
4186 2731 MT 4200 2731 LS
4712 2731 MT 4726 2731 LS
5238 2731 MT 5252 2731 LS
5764 2731 MT 5778 2731 LS
6291 2731 MT 6305 2731 LS
(000) 5233 LC 1051 2820 WT pop 0 originOffset 50 add RSS
1037 2765 MT 1037 2765 LT 6298 2765 LT ST
1037 2875 MT 1037 2875 LT 6298 2875 LT ST
([3]) 9999 LC 1000 3061 WT TSE RSS
1556 2918 MT 1570 2918 LS
2082 2918 MT 2096 2918 LS
2608 2918 MT 2622 2918 LS
3134 2918 MT 3148 2918 LS
3660 2918 MT 3674 2918 LS
4186 2918 MT 4200 2918 LS
4712 2918 MT 4726 2918 LS
5238 2918 MT 5252 2918 LS
5764 2918 MT 5778 2918 LS
6291 2918 MT 6305 2918 LS
(000) 5233 LC 1051 3007 WT pop 0 originOffset 50 add RSS
1037 2952 MT 1037 2952 LT 6298 2952 LT ST
1037 3062 MT 1037 3062 LT 6298 3062 LT ST
([2]) 9999 LC 1000 3248 WT TSE RSS
1556 3105 MT 1570 3105 LS
2082 3105 MT 2096 3105 LS
2608 3105 MT 2622 3105 LS
3134 3105 MT 3148 3105 LS
3660 3105 MT 3674 3105 LS
4186 3105 MT 4200 3105 LS
4712 3105 MT 4726 3105 LS
5238 3105 MT 5252 3105 LS
5764 3105 MT 5778 3105 LS
6291 3105 MT 6305 3105 LS
(000) 5233 LC 1051 3194 WT pop 0 originOffset 50 add RSS
1037 3139 MT 1037 3139 LT 6298 3139 LT ST
1037 3249 MT 1037 3249 LT 6298 3249 LT ST
([1]) 9999 LC 1000 3435 WT TSE RSS
1556 3292 MT 1570 3292 LS
2082 3292 MT 2096 3292 LS
2608 3292 MT 2622 3292 LS
3134 3292 MT 3148 3292 LS
3660 3292 MT 3674 3292 LS
4186 3292 MT 4200 3292 LS
4712 3292 MT 4726 3292 LS
5238 3292 MT 5252 3292 LS
5764 3292 MT 5778 3292 LS
6291 3292 MT 6305 3292 LS
(000) 5233 LC 1051 3381 WT pop 0 originOffset 50 add RSS
1037 3326 MT 1037 3326 LT 6298 3326 LT ST
1037 3436 MT 1037 3436 LT 6298 3436 LT ST
([0]) 9999 LC 1000 3622 WT TSE RSS
1556 3479 MT 1570 3479 LS
2082 3479 MT 2096 3479 LS
2608 3479 MT 2622 3479 LS
3134 3479 MT 3148 3479 LS
3660 3479 MT 3674 3479 LS
4186 3479 MT 4200 3479 LS
4712 3479 MT 4726 3479 LS
5238 3479 MT 5252 3479 LS
5764 3479 MT 5778 3479 LS
6291 3479 MT 6305 3479 LS
(002) 5233 LC 1051 3568 WT pop 0 originOffset 50 add RSS
1037 3513 MT 1037 3513 LT 6298 3513 LT ST
1037 3623 MT 1037 3623 LT 6298 3623 LT ST
(pc_out) 9999 LC 1000 3809 WT TSE RSS
1556 3666 MT 1570 3666 LS
2082 3666 MT 2096 3666 LS
2608 3666 MT 2622 3666 LS
3134 3666 MT 3148 3666 LS
3660 3666 MT 3674 3666 LS
4186 3666 MT 4200 3666 LS
4712 3666 MT 4726 3666 LS
5238 3666 MT 5252 3666 LS
5764 3666 MT 5778 3666 LS
6291 3666 MT 6305 3666 LS
(0110) 156 LC 1051 3755 WT pop 0 originOffset 50 add RSS
1037 3700 MT 1037 3700 LT 1214 3700 LT 1221 3755 LT ST
1037 3810 MT 1037 3810 LT 1214 3810 LT 1221 3755 LT ST
(010e) 24 LC 1235 3755 WT pop 0 originOffset 50 add RSS
1221 3755 MT 1221 3755 LT 1228 3700 LT 1266 3700 LT 1273 3755 LT ST
1221 3755 MT 1221 3755 LT 1228 3810 LT 1266 3810 LT 1273 3755 LT ST
(0110) 235 LC 1287 3755 WT pop 0 originOffset 50 add RSS
1273 3755 MT 1273 3755 LT 1280 3700 LT 1529 3700 LT 1536 3755 LT ST
1273 3755 MT 1273 3755 LT 1280 3810 LT 1529 3810 LT 1536 3755 LT ST
(010e) 25 LC 1550 3755 WT pop 0 originOffset 50 add RSS
1536 3755 MT 1536 3755 LT 1543 3700 LT 1582 3700 LT 1589 3755 LT ST
1536 3755 MT 1536 3755 LT 1543 3810 LT 1582 3810 LT 1589 3755 LT ST
(0110) 235 LC 1603 3755 WT pop 0 originOffset 50 add RSS
1589 3755 MT 1589 3755 LT 1596 3700 LT 1845 3700 LT 1852 3755 LT ST
1589 3755 MT 1589 3755 LT 1596 3810 LT 1845 3810 LT 1852 3755 LT ST
(010e) 25 LC 1866 3755 WT pop 0 originOffset 50 add RSS
1852 3755 MT 1852 3755 LT 1859 3700 LT 1898 3700 LT 1905 3755 LT ST
1852 3755 MT 1852 3755 LT 1859 3810 LT 1898 3810 LT 1905 3755 LT ST
(0110) 235 LC 1919 3755 WT pop 0 originOffset 50 add RSS
1905 3755 MT 1905 3755 LT 1912 3700 LT 2161 3700 LT 2168 3755 LT ST
1905 3755 MT 1905 3755 LT 1912 3810 LT 2161 3810 LT 2168 3755 LT ST
(010e) 24 LC 2182 3755 WT pop 0 originOffset 50 add RSS
2168 3755 MT 2168 3755 LT 2175 3700 LT 2213 3700 LT 2220 3755 LT ST
2168 3755 MT 2168 3755 LT 2175 3810 LT 2213 3810 LT 2220 3755 LT ST
(0110) 235 LC 2234 3755 WT pop 0 originOffset 50 add RSS
2220 3755 MT 2220 3755 LT 2227 3700 LT 2476 3700 LT 2483 3755 LT ST
2220 3755 MT 2220 3755 LT 2227 3810 LT 2476 3810 LT 2483 3755 LT ST
(010e) 25 LC 2497 3755 WT pop 0 originOffset 50 add RSS
2483 3755 MT 2483 3755 LT 2490 3700 LT 2529 3700 LT 2536 3755 LT ST
2483 3755 MT 2483 3755 LT 2490 3810 LT 2529 3810 LT 2536 3755 LT ST
(0110) 235 LC 2550 3755 WT pop 0 originOffset 50 add RSS
2536 3755 MT 2536 3755 LT 2543 3700 LT 2792 3700 LT 2799 3755 LT ST
2536 3755 MT 2536 3755 LT 2543 3810 LT 2792 3810 LT 2799 3755 LT ST
(010e) 25 LC 2813 3755 WT pop 0 originOffset 50 add RSS
2799 3755 MT 2799 3755 LT 2806 3700 LT 2845 3700 LT 2852 3755 LT ST
2799 3755 MT 2799 3755 LT 2806 3810 LT 2845 3810 LT 2852 3755 LT ST
(0110) 235 LC 2866 3755 WT pop 0 originOffset 50 add RSS
2852 3755 MT 2852 3755 LT 2859 3700 LT 3108 3700 LT 3115 3755 LT ST
2852 3755 MT 2852 3755 LT 2859 3810 LT 3108 3810 LT 3115 3755 LT ST
(010e) 24 LC 3129 3755 WT pop 0 originOffset 50 add RSS
3115 3755 MT 3115 3755 LT 3122 3700 LT 3160 3700 LT 3167 3755 LT ST
3115 3755 MT 3115 3755 LT 3122 3810 LT 3160 3810 LT 3167 3755 LT ST
(0110) 235 LC 3181 3755 WT pop 0 originOffset 50 add RSS
3167 3755 MT 3167 3755 LT 3174 3700 LT 3423 3700 LT 3430 3755 LT ST
3167 3755 MT 3167 3755 LT 3174 3810 LT 3423 3810 LT 3430 3755 LT ST
(010e) 25 LC 3444 3755 WT pop 0 originOffset 50 add RSS
3430 3755 MT 3430 3755 LT 3437 3700 LT 3476 3700 LT 3483 3755 LT ST
3430 3755 MT 3430 3755 LT 3437 3810 LT 3476 3810 LT 3483 3755 LT ST
(0110) 235 LC 3497 3755 WT pop 0 originOffset 50 add RSS
3483 3755 MT 3483 3755 LT 3490 3700 LT 3739 3700 LT 3746 3755 LT ST
3483 3755 MT 3483 3755 LT 3490 3810 LT 3739 3810 LT 3746 3755 LT ST
(010e) 25 LC 3760 3755 WT pop 0 originOffset 50 add RSS
3746 3755 MT 3746 3755 LT 3753 3700 LT 3792 3700 LT 3799 3755 LT ST
3746 3755 MT 3746 3755 LT 3753 3810 LT 3792 3810 LT 3799 3755 LT ST
(0110) 235 LC 3813 3755 WT pop 0 originOffset 50 add RSS
3799 3755 MT 3799 3755 LT 3806 3700 LT 4055 3700 LT 4062 3755 LT ST
3799 3755 MT 3799 3755 LT 3806 3810 LT 4055 3810 LT 4062 3755 LT ST
(010e) 24 LC 4076 3755 WT pop 0 originOffset 50 add RSS
4062 3755 MT 4062 3755 LT 4069 3700 LT 4107 3700 LT 4114 3755 LT ST
4062 3755 MT 4062 3755 LT 4069 3810 LT 4107 3810 LT 4114 3755 LT ST
(0110) 235 LC 4128 3755 WT pop 0 originOffset 50 add RSS
4114 3755 MT 4114 3755 LT 4121 3700 LT 4370 3700 LT 4377 3755 LT ST
4114 3755 MT 4114 3755 LT 4121 3810 LT 4370 3810 LT 4377 3755 LT ST
(010e) 25 LC 4391 3755 WT pop 0 originOffset 50 add RSS
4377 3755 MT 4377 3755 LT 4384 3700 LT 4423 3700 LT 4430 3755 LT ST
4377 3755 MT 4377 3755 LT 4384 3810 LT 4423 3810 LT 4430 3755 LT ST
(0110) 235 LC 4444 3755 WT pop 0 originOffset 50 add RSS
4430 3755 MT 4430 3755 LT 4437 3700 LT 4686 3700 LT 4693 3755 LT ST
4430 3755 MT 4430 3755 LT 4437 3810 LT 4686 3810 LT 4693 3755 LT ST
(010e) 25 LC 4707 3755 WT pop 0 originOffset 50 add RSS
4693 3755 MT 4693 3755 LT 4700 3700 LT 4739 3700 LT 4746 3755 LT ST
4693 3755 MT 4693 3755 LT 4700 3810 LT 4739 3810 LT 4746 3755 LT ST
(0110) 235 LC 4760 3755 WT pop 0 originOffset 50 add RSS
4746 3755 MT 4746 3755 LT 4753 3700 LT 5002 3700 LT 5009 3755 LT ST
4746 3755 MT 4746 3755 LT 4753 3810 LT 5002 3810 LT 5009 3755 LT ST
(010e) 24 LC 5023 3755 WT pop 0 originOffset 50 add RSS
5009 3755 MT 5009 3755 LT 5016 3700 LT 5054 3700 LT 5061 3755 LT ST
5009 3755 MT 5009 3755 LT 5016 3810 LT 5054 3810 LT 5061 3755 LT ST
(0110) 235 LC 5075 3755 WT pop 0 originOffset 50 add RSS
5061 3755 MT 5061 3755 LT 5068 3700 LT 5317 3700 LT 5324 3755 LT ST
5061 3755 MT 5061 3755 LT 5068 3810 LT 5317 3810 LT 5324 3755 LT ST
(010e) 25 LC 5338 3755 WT pop 0 originOffset 50 add RSS
5324 3755 MT 5324 3755 LT 5331 3700 LT 5370 3700 LT 5377 3755 LT ST
5324 3755 MT 5324 3755 LT 5331 3810 LT 5370 3810 LT 5377 3755 LT ST
(0110) 235 LC 5391 3755 WT pop 0 originOffset 50 add RSS
5377 3755 MT 5377 3755 LT 5384 3700 LT 5633 3700 LT 5640 3755 LT ST
5377 3755 MT 5377 3755 LT 5384 3810 LT 5633 3810 LT 5640 3755 LT ST
(010e) 24 LC 5654 3755 WT pop 0 originOffset 50 add RSS
5640 3755 MT 5640 3755 LT 5647 3700 LT 5685 3700 LT 5692 3755 LT ST
5640 3755 MT 5640 3755 LT 5647 3810 LT 5685 3810 LT 5692 3755 LT ST
(0110) 236 LC 5706 3755 WT pop 0 originOffset 50 add RSS
5692 3755 MT 5692 3755 LT 5699 3700 LT 5949 3700 LT 5956 3755 LT ST
5692 3755 MT 5692 3755 LT 5699 3810 LT 5949 3810 LT 5956 3755 LT ST
(010e) 24 LC 5970 3755 WT pop 0 originOffset 50 add RSS
5956 3755 MT 5956 3755 LT 5963 3700 LT 6001 3700 LT 6008 3755 LT ST
5956 3755 MT 5956 3755 LT 5963 3810 LT 6001 3810 LT 6008 3755 LT ST
(0110) 235 LC 6022 3755 WT pop 0 originOffset 50 add RSS
6008 3755 MT 6008 3755 LT 6015 3700 LT 6264 3700 LT 6271 3755 LT ST
6008 3755 MT 6008 3755 LT 6015 3810 LT 6264 3810 LT 6271 3755 LT ST
(010e) -1 LC 6285 3755 WT pop 0 originOffset 50 add RSS
6271 3755 MT 6271 3755 LT 6278 3700 LT 6298 3700 LT ST
6271 3755 MT 6271 3755 LT 6278 3810 LT 6298 3810 LT ST
% draw footer
(Entity:mp2_tb  Architecture:  Date: Sun Oct 08 15:14:32 CDT 2017   Row: 1 Page: 1) 9999 LC 300 4799 WT TSW RSS
grestore
showpage
%%EOF
