250481 786821 509
710672 946668 525
19272 404903 443
22713 251318 443
344671 520644 470
274196 561033 470
140040 543857 470
521916 857078 525
419371 499775 444
249169 744281 509
239277 320065 407
164833 910501 525
198320 245533 443
715893 967825 525
80708 769432 509
257262 459925 449
583883 777046 509
438100 950301 525
322289 532406 470
45540 256359 443
504977 696239 509
91219 907120 525
30915 152037 375
620412 981521 525
298767 361325 441
297847 480969 449
285188 924194 525
628903 755032 504
713893 722758 411
69838 486835 449
88861 759623 509
423818 596983 470
86417 272962 443
222136 623808 470
225448 434141 449
210990 987308 525
284115 853215 525
366720 836366 509
859905 935148 476
22079 490911 449
362118 736445 509
422953 519371 470
29033 909242 525
112180 980167 525
487331 687829 509
588670 735909 509
455645 528452 470
828304 870393 525
491490 969531 525
138265 888796 525
343911 436551 449
118928 548245 470
32402 759026 509
101608 586929 470
695038 791824 504
849987 875282 432
605491 953565 525
867071 990865 507
604655 644112 509
466999 912690 525
79142 904334 525
147312 827347 509
668871 807171 504
138648 672333 509
832426 956865 525
355726 629749 509
63319 323225 443
256985 280541 407
73619 87516 351
100668 130691 354
311976 627887 509
951291 972836 458
201725 726121 509
567180 676286 509
210137 718358 509
746571 748944 362
116882 894202 525
26553 654267 509
285752 611838 470
281168 365702 441
711231 868727 525
122479 887005 525
595385 795094 509
567173 988584 525
506296 962750 525
719542 793390 468
116004 402188 443
341088 831381 509
236615 811923 509
458106 934162 525
749791 852860 525
369666 644393 509
589800 843262 525
5707 186587 383
297123 338690 384
725961 994564 525
767029 901857 525
128813 279317 443
128373 888838 525
400797 805795 509
297176 527364 470
812785 917667 525
517832 600164 452
477926 833824 509
329164 592250 470
467030 826142 509
266564 807500 509
127923 367725 443
19554 124019 354
161772 434842 449
85954 691681 509
618904 987140 525
236674 371177 441
36874 158938 383
99441 683944 509
787105 952126 525
235789 364010 441
362999 934142 525
200987 998866 525
552796 697383 509
86116 692115 509
286333 358345 441
94321 943607 525
472191 519763 470
152076 387435 443
98937 165290 383
473452 583938 470
544446 649411 509
316061 931878 525
777138 989908 525
225179 790953 509
43964 384339 443
301090 669920 509
113724 321522 443
330190 690942 509
782776 798767 468
7178 751892 509
399689 420478 449
205705 700266 509
141306 776294 509
170088 748577 509
771516 913581 525
125407 559648 470
311554 756531 509
370268 725176 509
4438 95124 351
602823 745415 509
200414 815662 509
55554 832283 509
129494 372525 443
573825 960691 525
523856 590796 452
94169 277406 443
569106 915304 525
104139 414355 449
74273 613574 470
187052 367357 443
428072 509631 444
15246 775392 509
56143 521955 470
50964 697087 509
63444 114007 354
356116 531008 470
198587 636770 509
293188 527771 470
234416 489905 449
188345 580880 470
314094 720755 509
395352 590133 470
579444 937673 525
242227 740410 509
113886 519524 470
207918 633607 509
118415 140094 344
590951 962900 525
802339 972132 525
92379 880039 525
156735 979988 525
128102 320076 443
474761 908875 525
200951 810924 509
521726 558257 452
307232 370185 441
568274 728633 509
311208 654764 509
754300 911216 525
893328 998629 507
693482 779627 504
358894 651893 509
328 909053 525
39033 559026 470
349182 535271 470
409708 862113 525
492912 955541 525
16307 841278 525
168979 746042 509
254932 781073 509
404979 971619 525
198656 955519 525
257457 832432 509
