(module LOGO (layer F.Cu)
  (at 0 0)
 (fp_text reference "G***" (at 0 0) (layer F.SilkS) hide
  (effects (font (thickness 0.3)))
  )
  (fp_text value "LOGO" (at 0.75 0) (layer F.SilkS) hide
  (effects (font (thickness 0.3)))
  )
  (fp_poly (pts (xy 7.408333 7.408333) (xy -7.408333 7.408333) (xy -7.408333 2.836333) (xy -5.545667 2.836333) (xy -5.545667 5.503333) (xy -2.878667 5.503333) (xy -2.878667 2.836333) (xy -5.545667 2.836333)
     (xy -7.408333 2.836333) (xy -7.408333 0.550333) (xy -5.545667 0.550333) (xy -5.545667 2.455333) (xy -5.164667 2.455333) (xy -5.164667 1.693333) (xy -4.783667 1.693333) (xy -4.783667 2.455333)
     (xy -4.021667 2.455333) (xy -4.021667 2.074333) (xy -3.259667 2.074333) (xy -3.259667 2.455333) (xy -2.878667 2.455333) (xy -2.878667 2.074333) (xy -3.259667 2.074333) (xy -4.021667 2.074333)
     (xy -4.402667 2.074333) (xy -4.402667 1.693333) (xy -4.783667 1.693333) (xy -5.164667 1.693333) (xy -5.164667 1.312333) (xy -4.783667 1.312333) (xy -4.402667 1.312333) (xy -4.402667 1.693333)
     (xy -4.021667 1.693333) (xy -4.021667 1.312333) (xy -4.402667 1.312333) (xy -4.783667 1.312333) (xy -4.783667 0.550333) (xy -5.545667 0.550333) (xy -7.408333 0.550333) (xy -7.408333 -0.211667)
     (xy -5.545667 -0.211667) (xy -5.545667 0.169333) (xy -5.164667 0.169333) (xy -5.164667 -0.211667) (xy -5.545667 -0.211667) (xy -7.408333 -0.211667) (xy -7.408333 -0.592667) (xy -5.164667 -0.592667)
     (xy -5.164667 -0.211667) (xy -4.783667 -0.211667) (xy -4.783667 -0.592667) (xy -5.164667 -0.592667) (xy -7.408333 -0.592667) (xy -7.408333 -2.497667) (xy -5.545667 -2.497667) (xy -5.545667 -1.735667)
     (xy -4.783667 -1.735667) (xy -4.783667 -1.354667) (xy -5.164667 -1.354667) (xy -5.164667 -0.973667) (xy -4.402667 -0.973667) (xy -4.402667 -0.592667) (xy -4.021667 -0.592667) (xy -4.021667 -0.211667)
     (xy -4.402667 -0.211667) (xy -4.402667 0.931333) (xy -4.021667 0.931333) (xy -4.021667 1.312333) (xy -3.640667 1.312333) (xy -3.640667 1.693333) (xy -2.878667 1.693333) (xy -2.878667 2.074333)
     (xy -2.497667 2.074333) (xy -2.497667 3.217333) (xy -1.735667 3.217333) (xy -1.735667 3.598333) (xy -2.497667 3.598333) (xy -2.497667 5.503333) (xy -2.116667 5.503333) (xy -2.116667 5.122333)
     (xy -1.735667 5.122333) (xy -1.735667 5.503333) (xy -1.354667 5.503333) (xy -1.354667 5.122333) (xy -0.973667 5.122333) (xy -0.973667 4.741333) (xy 0.550333 4.741333) (xy 0.550333 5.122333)
     (xy 0.169333 5.122333) (xy 0.169333 5.503333) (xy 0.931333 5.503333) (xy 0.931333 5.122333) (xy 1.693333 5.122333) (xy 1.693333 5.503333) (xy 3.217333 5.503333) (xy 3.217333 5.122333)
     (xy 3.598333 5.122333) (xy 3.598333 5.503333) (xy 4.741333 5.503333) (xy 4.741333 4.741333) (xy 5.122333 4.741333) (xy 5.122333 5.122333) (xy 5.503333 5.122333) (xy 5.503333 4.741333)
     (xy 5.122333 4.741333) (xy 5.122333 4.360333) (xy 4.360333 4.360333) (xy 4.360333 4.741333) (xy 3.979333 4.741333) (xy 3.979333 5.122333) (xy 3.598333 5.122333) (xy 3.217333 5.122333)
     (xy 2.836333 5.122333) (xy 2.836333 4.741333) (xy 3.598333 4.741333) (xy 3.598333 3.979333) (xy 3.979333 3.979333) (xy 3.979333 3.217333) (xy 4.360333 3.217333) (xy 4.360333 3.979333)
     (xy 5.503333 3.979333) (xy 5.503333 3.217333) (xy 4.741333 3.217333) (xy 4.741333 2.836333) (xy 5.122333 2.836333) (xy 5.122333 2.074333) (xy 5.503333 2.074333) (xy 5.503333 1.693333)
     (xy 5.122333 1.693333) (xy 5.122333 1.312333) (xy 5.503333 1.312333) (xy 5.503333 0.931333) (xy 4.741333 0.931333) (xy 4.741333 1.312333) (xy 4.360333 1.312333) (xy 4.360333 0.931333)
     (xy 3.598333 0.931333) (xy 3.598333 0.550333) (xy 3.979333 0.550333) (xy 3.979333 0.169333) (xy 4.741333 0.169333) (xy 4.741333 0.550333) (xy 5.503333 0.550333) (xy 5.503333 -0.211667)
     (xy 5.122333 -0.211667) (xy 5.122333 -0.592667) (xy 4.741333 -0.592667) (xy 4.741333 -0.211667) (xy 4.360333 -0.211667) (xy 4.360333 -0.592667) (xy 3.979333 -0.592667) (xy 3.979333 -0.973667)
     (xy 4.360333 -0.973667) (xy 4.360333 -1.354667) (xy 4.741333 -1.354667) (xy 5.122333 -1.354667) (xy 5.122333 -0.973667) (xy 5.503333 -0.973667) (xy 5.503333 -1.354667) (xy 5.122333 -1.354667)
     (xy 4.741333 -1.354667) (xy 4.741333 -1.735667) (xy 4.360333 -1.735667) (xy 4.360333 -2.497667) (xy 4.741333 -2.497667) (xy 4.741333 -1.735667) (xy 5.122333 -1.735667) (xy 5.122333 -2.497667)
     (xy 4.741333 -2.497667) (xy 4.360333 -2.497667) (xy 3.979333 -2.497667) (xy 3.979333 -2.116667) (xy 3.598333 -2.116667) (xy 3.598333 -2.497667) (xy 3.217333 -2.497667) (xy 3.217333 -1.354667)
     (xy 2.455333 -1.354667) (xy 2.455333 -0.973667) (xy 2.074333 -0.973667) (xy 2.074333 -1.735667) (xy 2.836333 -1.735667) (xy 2.836333 -2.497667) (xy 2.455333 -2.497667) (xy 2.455333 -3.259667)
     (xy 2.074333 -3.259667) (xy 2.074333 -2.878667) (xy 1.693333 -2.878667) (xy 1.693333 -3.259667) (xy 1.312333 -3.259667) (xy 1.312333 -3.640667) (xy 0.931333 -3.640667) (xy 0.931333 -4.402667)
     (xy 2.074333 -4.402667) (xy 2.074333 -4.021667) (xy 2.455333 -4.021667) (xy 2.455333 -4.783667) (xy 1.312333 -4.783667) (xy 1.312333 -5.164667) (xy 0.931333 -5.164667) (xy 0.931333 -4.783667)
     (xy 0.550333 -4.783667) (xy 0.550333 -5.545667) (xy 2.836333 -5.545667) (xy 2.836333 -2.878667) (xy 5.503333 -2.878667) (xy 5.503333 -5.545667) (xy 2.836333 -5.545667) (xy 0.550333 -5.545667)
     (xy -0.211667 -5.545667) (xy -0.211667 -5.164667) (xy -0.592667 -5.164667) (xy -0.592667 -4.783667) (xy -1.735667 -4.783667) (xy -1.735667 -4.402667) (xy -2.497667 -4.402667) (xy -2.497667 -4.021667)
     (xy -2.116667 -4.021667) (xy -2.116667 -3.640667) (xy -2.497667 -3.640667) (xy -2.497667 -2.878667) (xy -2.116667 -2.878667) (xy -2.116667 -2.497667) (xy -3.259667 -2.497667) (xy -3.259667 -2.116667)
     (xy -3.640667 -2.116667) (xy -3.640667 -2.497667) (xy -5.545667 -2.497667) (xy -7.408333 -2.497667) (xy -7.408333 -5.545667) (xy -5.545667 -5.545667) (xy -5.545667 -2.878667) (xy -2.878667 -2.878667)
     (xy -2.878667 -5.164667) (xy -2.497667 -5.164667) (xy -2.497667 -4.783667) (xy -2.116667 -4.783667) (xy -2.116667 -5.164667) (xy -2.497667 -5.164667) (xy -2.878667 -5.164667) (xy -2.878667 -5.545667)
     (xy -2.116667 -5.545667) (xy -2.116667 -5.164667) (xy -1.354667 -5.164667) (xy -1.354667 -5.545667) (xy -0.973667 -5.545667) (xy -0.973667 -5.164667) (xy -0.592667 -5.164667) (xy -0.592667 -5.545667)
     (xy -0.973667 -5.545667) (xy -1.354667 -5.545667) (xy -2.116667 -5.545667) (xy -2.878667 -5.545667) (xy -5.545667 -5.545667) (xy -7.408333 -5.545667) (xy -7.408333 -7.408333) (xy 7.408333 -7.408333)
     (xy 7.408333 7.408333) )(layer F.SilkS) (width  0.010000)
  )
  (fp_poly (pts (xy -3.259667 5.122333) (xy -5.164667 5.122333) (xy -5.164667 3.598333) (xy -4.783667 3.598333) (xy -4.783667 4.741333) (xy -3.640667 4.741333) (xy -3.640667 3.598333) (xy -4.783667 3.598333)
     (xy -5.164667 3.598333) (xy -5.164667 3.217333) (xy -3.259667 3.217333) (xy -3.259667 5.122333) )(layer F.SilkS) (width  0.010000)
  )
  (fp_poly (pts (xy -2.878667 1.312333) (xy -3.259667 1.312333) (xy -3.259667 0.931333) (xy -2.878667 0.931333) (xy -2.878667 1.312333) )(layer F.SilkS) (width  0.010000)
  )
  (fp_poly (pts (xy -3.259667 0.169333) (xy -3.640667 0.169333) (xy -3.640667 0.931333) (xy -4.021667 0.931333) (xy -4.021667 -0.211667) (xy -3.259667 -0.211667) (xy -3.259667 0.169333) )(layer F.SilkS) (width  0.010000)
  )
  (fp_poly (pts (xy -3.259667 -0.592667) (xy -2.878667 -0.592667) (xy -2.878667 -0.211667) (xy -3.259667 -0.211667) (xy -3.259667 -0.592667) )(layer F.SilkS) (width  0.010000)
  )
  (fp_poly (pts (xy -1.735667 2.074333) (xy -2.497667 2.074333) (xy -2.497667 0.931333) (xy -2.878667 0.931333) (xy -2.878667 0.550333) (xy -3.259667 0.550333) (xy -3.259667 0.169333) (xy -2.878667 0.169333)
     (xy -2.878667 0.550333) (xy -2.497667 0.550333) (xy -2.497667 0.169333) (xy -2.878667 0.169333) (xy -2.878667 -0.211667) (xy -2.116667 -0.211667) (xy -2.116667 1.693333) (xy -1.735667 1.693333)
     (xy -1.735667 2.074333) )(layer F.SilkS) (width  0.010000)
  )
  (fp_poly (pts (xy 2.074333 4.360333) (xy 2.455333 4.360333) (xy 2.455333 4.741333) (xy 2.074333 4.741333) (xy 2.074333 4.360333) )(layer F.SilkS) (width  0.010000)
  )
  (fp_poly (pts (xy 1.693333 2.074333) (xy 2.074333 2.074333) (xy 2.074333 2.455333) (xy 1.693333 2.455333) (xy 1.693333 2.074333) )(layer F.SilkS) (width  0.010000)
  )
  (fp_poly (pts (xy 2.074333 5.122333) (xy 1.693333 5.122333) (xy 1.693333 4.741333) (xy 2.074333 4.741333) (xy 2.074333 5.122333) )(layer F.SilkS) (width  0.010000)
  )
  (fp_poly (pts (xy 1.693333 3.217333) (xy 2.074333 3.217333) (xy 2.074333 4.360333) (xy 1.693333 4.360333) (xy 1.693333 4.741333) (xy 1.312333 4.741333) (xy 1.312333 4.360333) (xy 0.931333 4.360333)
     (xy 0.931333 4.741333) (xy 0.550333 4.741333) (xy 0.550333 4.360333) (xy 0.931333 4.360333) (xy 0.931333 3.979333) (xy 1.312333 3.979333) (xy 1.693333 3.979333) (xy 1.693333 3.217333)
     (xy 1.312333 3.217333) (xy 1.312333 3.979333) (xy 0.931333 3.979333) (xy 0.550333 3.979333) (xy 0.550333 4.360333) (xy -0.973667 4.360333) (xy -0.973667 4.741333) (xy -2.116667 4.741333)
     (xy -2.116667 3.979333) (xy -1.735667 3.979333) (xy -1.735667 4.360333) (xy -1.354667 4.360333) (xy -1.354667 3.979333) (xy -1.735667 3.979333) (xy -1.735667 3.598333) (xy -0.973667 3.598333)
     (xy -0.973667 3.979333) (xy -0.211667 3.979333) (xy -0.211667 3.598333) (xy 0.169333 3.598333) (xy 0.169333 3.979333) (xy 0.550333 3.979333) (xy 0.550333 3.598333) (xy 0.169333 3.598333)
     (xy -0.211667 3.598333) (xy -0.973667 3.598333) (xy -0.973667 3.217333) (xy -1.735667 3.217333) (xy -1.735667 2.836333) (xy -0.973667 2.836333) (xy -0.973667 3.217333) (xy 1.312333 3.217333)
     (xy 1.312333 2.836333) (xy 0.169333 2.836333) (xy 0.169333 2.455333) (xy 0.550333 2.455333) (xy 0.550333 2.074333) (xy -0.211667 2.074333) (xy -0.211667 2.836333) (xy -0.973667 2.836333)
     (xy -0.973667 2.455333) (xy -1.354667 2.455333) (xy -1.354667 2.074333) (xy -0.973667 2.074333) (xy -0.973667 1.693333) (xy -1.735667 1.693333) (xy -1.735667 1.312333) (xy -1.354667 1.312333)
     (xy -0.973667 1.312333) (xy -0.973667 1.693333) (xy -0.592667 1.693333) (xy -0.592667 2.074333) (xy -0.211667 2.074333) (xy -0.211667 1.312333) (xy -0.973667 1.312333) (xy -1.354667 1.312333)
     (xy -1.354667 0.931333) (xy -1.735667 0.931333) (xy -1.735667 0.550333) (xy -0.592667 0.550333) (xy -0.592667 0.931333) (xy 0.169333 0.931333) (xy 0.169333 1.693333) (xy 1.312333 1.693333)
     (xy 1.312333 1.312333) (xy 0.550333 1.312333) (xy 0.550333 0.550333) (xy -0.592667 0.550333) (xy -0.592667 0.169333) (xy 0.931333 0.169333) (xy 0.931333 0.931333) (xy 1.312333 0.931333)
     (xy 1.312333 0.550333) (xy 2.074333 0.550333) (xy 2.074333 0.931333) (xy 1.693333 0.931333) (xy 1.693333 1.693333) (xy 1.312333 1.693333) (xy 1.312333 2.455333) (xy 1.693333 2.455333)
     (xy 1.693333 3.217333) )(layer F.SilkS) (width  0.010000)
  )
  (fp_poly (pts (xy 3.217333 4.360333) (xy 2.836333 4.360333) (xy 2.836333 3.979333) (xy 3.217333 3.979333) (xy 3.217333 4.360333) )(layer F.SilkS) (width  0.010000)
  )
  (fp_poly (pts (xy 3.598333 3.598333) (xy 2.455333 3.598333) (xy 2.455333 2.836333) (xy 2.836333 2.836333) (xy 2.836333 3.217333) (xy 3.217333 3.217333) (xy 3.217333 2.836333) (xy 2.836333 2.836333)
     (xy 2.455333 2.836333) (xy 2.455333 2.455333) (xy 3.598333 2.455333) (xy 3.598333 3.598333) )(layer F.SilkS) (width  0.010000)
  )
  (fp_poly (pts (xy 4.741333 2.836333) (xy 3.979333 2.836333) (xy 3.979333 2.455333) (xy 4.741333 2.455333) (xy 4.741333 2.836333) )(layer F.SilkS) (width  0.010000)
  )
  (fp_poly (pts (xy 5.122333 1.693333) (xy 5.122333 2.074333) (xy 3.979333 2.074333) (xy 3.979333 1.693333) (xy 5.122333 1.693333) )(layer F.SilkS) (width  0.010000)
  )
  (fp_poly (pts (xy 2.074333 1.693333) (xy 2.074333 1.312333) (xy 2.455333 1.312333) (xy 2.455333 0.931333) (xy 2.836333 0.931333) (xy 2.836333 0.550333) (xy 3.217333 0.550333) (xy 3.217333 1.312333)
     (xy 3.979333 1.312333) (xy 3.979333 1.693333) (xy 2.074333 1.693333) )(layer F.SilkS) (width  0.010000)
  )
  (fp_poly (pts (xy 1.312333 -0.211667) (xy 0.550333 -0.211667) (xy 0.550333 -0.592667) (xy 1.312333 -0.592667) (xy 1.312333 -0.211667) )(layer F.SilkS) (width  0.010000)
  )
  (fp_poly (pts (xy 0.931333 -3.259667) (xy 1.312333 -3.259667) (xy 1.312333 -2.878667) (xy 0.931333 -2.878667) (xy 0.931333 -3.259667) )(layer F.SilkS) (width  0.010000)
  )
  (fp_poly (pts (xy 2.455333 -0.592667) (xy 2.455333 -0.973667) (xy 2.836333 -0.973667) (xy 2.836333 -0.592667) (xy 2.455333 -0.592667) )(layer F.SilkS) (width  0.010000)
  )
  (fp_poly (pts (xy -0.592667 -4.783667) (xy 0.550333 -4.783667) (xy 0.550333 -4.402667) (xy 0.169333 -4.402667) (xy 0.169333 -4.021667) (xy -0.211667 -4.021667) (xy -0.211667 -3.640667) (xy -0.592667 -3.640667)
     (xy -0.592667 -4.783667) )(layer F.SilkS) (width  0.010000)
  )
  (fp_poly (pts (xy -1.735667 -3.640667) (xy -1.354667 -3.640667) (xy -1.354667 -4.021667) (xy -1.735667 -4.021667) (xy -1.735667 -4.402667) (xy -0.973667 -4.402667) (xy -0.973667 -3.640667) (xy -0.592667 -3.640667)
     (xy -0.592667 -3.259667) (xy -0.973667 -3.259667) (xy -0.973667 -2.878667) (xy -1.354667 -2.878667) (xy -1.354667 -3.259667) (xy -1.735667 -3.259667) (xy -1.735667 -3.640667) )(layer F.SilkS) (width  0.010000)
  )
  (fp_poly (pts (xy -2.116667 -2.878667) (xy -2.116667 -3.259667) (xy -1.735667 -3.259667) (xy -1.735667 -2.878667) (xy -2.116667 -2.878667) )(layer F.SilkS) (width  0.010000)
  )
  (fp_poly (pts (xy -2.116667 -0.973667) (xy -2.116667 -1.354667) (xy -2.878667 -1.354667) (xy -2.878667 -0.973667) (xy -3.259667 -0.973667) (xy -3.259667 -1.354667) (xy -3.640667 -1.354667) (xy -3.640667 -0.973667)
     (xy -4.402667 -0.973667) (xy -4.402667 -1.735667) (xy -4.021667 -1.735667) (xy -4.021667 -1.354667) (xy -3.640667 -1.354667) (xy -3.640667 -1.735667) (xy -4.021667 -1.735667) (xy -4.402667 -1.735667)
     (xy -4.402667 -2.116667) (xy -3.640667 -2.116667) (xy -3.640667 -1.735667) (xy -3.259667 -1.735667) (xy -3.259667 -1.354667) (xy -2.878667 -1.354667) (xy -2.878667 -1.735667) (xy -3.259667 -1.735667)
     (xy -3.259667 -2.116667) (xy -2.497667 -2.116667) (xy -2.497667 -1.735667) (xy -2.116667 -1.735667) (xy -2.116667 -2.116667) (xy -1.735667 -2.116667) (xy -1.735667 -2.878667) (xy -1.354667 -2.878667)
     (xy -1.354667 -2.497667) (xy -0.973667 -2.497667) (xy -0.973667 -2.116667) (xy -1.354667 -2.116667) (xy -1.354667 -1.735667) (xy -1.735667 -1.735667) (xy -1.735667 -1.354667) (xy -1.354667 -1.354667)
     (xy -1.354667 -0.973667) (xy -2.116667 -0.973667) )(layer F.SilkS) (width  0.010000)
  )
  (fp_poly (pts (xy -0.211667 -0.211667) (xy -1.735667 -0.211667) (xy -1.735667 -0.592667) (xy -1.354667 -0.592667) (xy -1.354667 -0.973667) (xy -0.211667 -0.973667) (xy -0.211667 -0.211667) )(layer F.SilkS) (width  0.010000)
  )
  (fp_poly (pts (xy 2.074333 -2.497667) (xy 2.074333 -2.116667) (xy 1.693333 -2.116667) (xy 1.693333 -1.354667) (xy 1.312333 -1.354667) (xy 1.312333 -0.973667) (xy -0.211667 -0.973667) (xy -0.211667 -1.354667)
     (xy 0.169333 -1.354667) (xy 0.169333 -1.735667) (xy 0.550333 -1.735667) (xy 0.550333 -1.354667) (xy 1.312333 -1.354667) (xy 1.312333 -1.735667) (xy 0.550333 -1.735667) (xy 0.550333 -2.116667)
     (xy 0.931333 -2.116667) (xy 0.931333 -2.497667) (xy 2.074333 -2.497667) )(layer F.SilkS) (width  0.010000)
  )
  (fp_poly (pts (xy 0.931333 -2.497667) (xy -0.211667 -2.497667) (xy -0.211667 -2.878667) (xy 0.169333 -2.878667) (xy 0.169333 -4.021667) (xy 0.550333 -4.021667) (xy 0.550333 -3.640667) (xy 0.931333 -3.640667)
     (xy 0.931333 -3.259667) (xy 0.550333 -3.259667) (xy 0.550333 -2.878667) (xy 0.931333 -2.878667) (xy 0.931333 -2.497667) )(layer F.SilkS) (width  0.010000)
  )
  (fp_poly (pts (xy 1.693333 -0.211667) (xy 1.693333 -0.592667) (xy 1.312333 -0.592667) (xy 1.312333 -0.973667) (xy 2.074333 -0.973667) (xy 2.074333 -0.211667) (xy 1.693333 -0.211667) )(layer F.SilkS) (width  0.010000)
  )
  (fp_poly (pts (xy 3.979333 -0.592667) (xy 3.979333 0.169333) (xy 2.074333 0.169333) (xy 2.074333 -0.211667) (xy 2.836333 -0.211667) (xy 2.836333 -0.592667) (xy 3.979333 -0.592667) )(layer F.SilkS) (width  0.010000)
  )
  (fp_poly (pts (xy 3.979333 -1.354667) (xy 3.598333 -1.354667) (xy 3.598333 -1.735667) (xy 3.979333 -1.735667) (xy 3.979333 -1.354667) )(layer F.SilkS) (width  0.010000)
  )
  (fp_poly (pts (xy -3.259667 -3.259667) (xy -5.164667 -3.259667) (xy -5.164667 -4.783667) (xy -4.783667 -4.783667) (xy -4.783667 -3.640667) (xy -3.640667 -3.640667) (xy -3.640667 -4.783667) (xy -4.783667 -4.783667)
     (xy -5.164667 -4.783667) (xy -5.164667 -5.164667) (xy -3.259667 -5.164667) (xy -3.259667 -3.259667) )(layer F.SilkS) (width  0.010000)
  )
  (fp_poly (pts (xy 5.122333 -3.259667) (xy 3.217333 -3.259667) (xy 3.217333 -4.783667) (xy 3.598333 -4.783667) (xy 3.598333 -3.640667) (xy 4.741333 -3.640667) (xy 4.741333 -4.783667) (xy 3.598333 -4.783667)
     (xy 3.217333 -4.783667) (xy 3.217333 -5.164667) (xy 5.122333 -5.164667) (xy 5.122333 -3.259667) )(layer F.SilkS) (width  0.010000)
  )
  (fp_poly (pts (xy -0.592667 -1.354667) (xy -1.354667 -1.354667) (xy -1.354667 -1.735667) (xy -0.592667 -1.735667) (xy -0.592667 -1.354667) )(layer F.SilkS) (width  0.010000)
  )
  (fp_poly (pts (xy -0.592667 -2.497667) (xy -0.211667 -2.497667) (xy -0.211667 -1.735667) (xy -0.592667 -1.735667) (xy -0.592667 -2.497667) )(layer F.SilkS) (width  0.010000)
  )
  (fp_poly (pts (xy -0.211667 -2.878667) (xy -0.592667 -2.878667) (xy -0.592667 -3.259667) (xy -0.211667 -3.259667) (xy -0.211667 -2.878667) )(layer F.SilkS) (width  0.010000)
  )
)
