EESchema Schematic File Version 4
EELAYER 26 0
EELAYER END
$Descr A4 11693 8268
encoding utf-8
Sheet 2 2
Title ""
Date ""
Rev ""
Comp ""
Comment1 ""
Comment2 ""
Comment3 ""
Comment4 ""
$EndDescr
Text Notes 700  1000 0    50   ~ 0
Y0
Text Notes 1000 700  0    50   ~ 0
X0
$Comp
L Device:LED D1000
U 1 1 000003E8
P 1000 1000
F 0 "D1000" H 992 933 20  0000 C CNN
F 1 "LED" H 992 933 50  0001 C CNN
F 2 "LED_SMD:LED_0402_1005Metric" H 1000 1000 50  0001 C CNN
F 3 "~" H 1000 1000 50  0001 C CNN
	1    1000 1000
	-1   0    0    1   
$EndComp
Text HLabel 850  1000 3    20   Input ~ 0
L15
Text HLabel 1150 1000 3    20   Input ~ 0
L1
Text Notes 1400 700  0    50   ~ 0
X1
$Comp
L Device:LED D1001
U 1 1 000003E9
P 1400 1000
F 0 "D1001" H 1392 933 20  0000 C CNN
F 1 "LED" H 1392 933 50  0001 C CNN
F 2 "LED_SMD:LED_0402_1005Metric" H 1400 1000 50  0001 C CNN
F 3 "~" H 1400 1000 50  0001 C CNN
	1    1400 1000
	-1   0    0    1   
$EndComp
Text HLabel 1250 1000 3    20   Input ~ 0
L15
Text HLabel 1550 1000 3    20   Input ~ 0
L2
Text Notes 1800 700  0    50   ~ 0
X2
$Comp
L Device:LED D1002
U 1 1 000003EA
P 1800 1000
F 0 "D1002" H 1792 933 20  0000 C CNN
F 1 "LED" H 1792 933 50  0001 C CNN
F 2 "LED_SMD:LED_0402_1005Metric" H 1800 1000 50  0001 C CNN
F 3 "~" H 1800 1000 50  0001 C CNN
	1    1800 1000
	-1   0    0    1   
$EndComp
Text HLabel 1650 1000 3    20   Input ~ 0
L1
Text HLabel 1950 1000 3    20   Input ~ 0
L3
Text Notes 2200 700  0    50   ~ 0
X3
$Comp
L Device:LED D1003
U 1 1 000003EB
P 2200 1000
F 0 "D1003" H 2192 933 20  0000 C CNN
F 1 "LED" H 2192 933 50  0001 C CNN
F 2 "LED_SMD:LED_0402_1005Metric" H 2200 1000 50  0001 C CNN
F 3 "~" H 2200 1000 50  0001 C CNN
	1    2200 1000
	-1   0    0    1   
$EndComp
Text HLabel 2050 1000 3    20   Input ~ 0
L1
Text HLabel 2350 1000 3    20   Input ~ 0
L4
Text Notes 2600 700  0    50   ~ 0
X4
$Comp
L Device:LED D1004
U 1 1 000003EC
P 2600 1000
F 0 "D1004" H 2592 933 20  0000 C CNN
F 1 "LED" H 2592 933 50  0001 C CNN
F 2 "LED_SMD:LED_0402_1005Metric" H 2600 1000 50  0001 C CNN
F 3 "~" H 2600 1000 50  0001 C CNN
	1    2600 1000
	-1   0    0    1   
$EndComp
Text HLabel 2450 1000 3    20   Input ~ 0
L2
Text HLabel 2750 1000 3    20   Input ~ 0
L5
Text Notes 3000 700  0    50   ~ 0
X5
$Comp
L Device:LED D1005
U 1 1 000003ED
P 3000 1000
F 0 "D1005" H 2992 933 20  0000 C CNN
F 1 "LED" H 2992 933 50  0001 C CNN
F 2 "LED_SMD:LED_0402_1005Metric" H 3000 1000 50  0001 C CNN
F 3 "~" H 3000 1000 50  0001 C CNN
	1    3000 1000
	-1   0    0    1   
$EndComp
Text HLabel 2850 1000 3    20   Input ~ 0
L2
Text HLabel 3150 1000 3    20   Input ~ 0
L6
Text Notes 3400 700  0    50   ~ 0
X6
$Comp
L Device:LED D1006
U 1 1 000003EE
P 3400 1000
F 0 "D1006" H 3392 933 20  0000 C CNN
F 1 "LED" H 3392 933 50  0001 C CNN
F 2 "LED_SMD:LED_0402_1005Metric" H 3400 1000 50  0001 C CNN
F 3 "~" H 3400 1000 50  0001 C CNN
	1    3400 1000
	-1   0    0    1   
$EndComp
Text HLabel 3250 1000 3    20   Input ~ 0
L3
Text HLabel 3550 1000 3    20   Input ~ 0
L7
Text Notes 3800 700  0    50   ~ 0
X7
$Comp
L Device:LED D1007
U 1 1 000003EF
P 3800 1000
F 0 "D1007" H 3792 933 20  0000 C CNN
F 1 "LED" H 3792 933 50  0001 C CNN
F 2 "LED_SMD:LED_0402_1005Metric" H 3800 1000 50  0001 C CNN
F 3 "~" H 3800 1000 50  0001 C CNN
	1    3800 1000
	-1   0    0    1   
$EndComp
Text HLabel 3650 1000 3    20   Input ~ 0
L3
Text HLabel 3950 1000 3    20   Input ~ 0
L8
Text Notes 4200 700  0    50   ~ 0
X8
$Comp
L Device:LED D1008
U 1 1 000003F0
P 4200 1000
F 0 "D1008" H 4192 933 20  0000 C CNN
F 1 "LED" H 4192 933 50  0001 C CNN
F 2 "LED_SMD:LED_0402_1005Metric" H 4200 1000 50  0001 C CNN
F 3 "~" H 4200 1000 50  0001 C CNN
	1    4200 1000
	-1   0    0    1   
$EndComp
Text HLabel 4050 1000 3    20   Input ~ 0
L4
Text HLabel 4350 1000 3    20   Input ~ 0
L9
Text Notes 4600 700  0    50   ~ 0
X9
$Comp
L Device:LED D1009
U 1 1 000003F1
P 4600 1000
F 0 "D1009" H 4592 933 20  0000 C CNN
F 1 "LED" H 4592 933 50  0001 C CNN
F 2 "LED_SMD:LED_0402_1005Metric" H 4600 1000 50  0001 C CNN
F 3 "~" H 4600 1000 50  0001 C CNN
	1    4600 1000
	-1   0    0    1   
$EndComp
Text HLabel 4450 1000 3    20   Input ~ 0
L4
Text HLabel 4750 1000 3    20   Input ~ 0
L10
Text Notes 5000 700  0    50   ~ 0
X10
$Comp
L Device:LED D1010
U 1 1 000003F2
P 5000 1000
F 0 "D1010" H 4992 933 20  0000 C CNN
F 1 "LED" H 4992 933 50  0001 C CNN
F 2 "LED_SMD:LED_0402_1005Metric" H 5000 1000 50  0001 C CNN
F 3 "~" H 5000 1000 50  0001 C CNN
	1    5000 1000
	-1   0    0    1   
$EndComp
Text HLabel 4850 1000 3    20   Input ~ 0
L5
Text HLabel 5150 1000 3    20   Input ~ 0
L11
Text Notes 5400 700  0    50   ~ 0
X11
$Comp
L Device:LED D1011
U 1 1 000003F3
P 5400 1000
F 0 "D1011" H 5392 933 20  0000 C CNN
F 1 "LED" H 5392 933 50  0001 C CNN
F 2 "LED_SMD:LED_0402_1005Metric" H 5400 1000 50  0001 C CNN
F 3 "~" H 5400 1000 50  0001 C CNN
	1    5400 1000
	-1   0    0    1   
$EndComp
Text HLabel 5250 1000 3    20   Input ~ 0
L5
Text HLabel 5550 1000 3    20   Input ~ 0
L12
Text Notes 5800 700  0    50   ~ 0
X12
$Comp
L Device:LED D1012
U 1 1 000003F4
P 5800 1000
F 0 "D1012" H 5792 933 20  0000 C CNN
F 1 "LED" H 5792 933 50  0001 C CNN
F 2 "LED_SMD:LED_0402_1005Metric" H 5800 1000 50  0001 C CNN
F 3 "~" H 5800 1000 50  0001 C CNN
	1    5800 1000
	-1   0    0    1   
$EndComp
Text HLabel 5650 1000 3    20   Input ~ 0
L6
Text HLabel 5950 1000 3    20   Input ~ 0
L13
Text Notes 6200 700  0    50   ~ 0
X13
$Comp
L Device:LED D1013
U 1 1 000003F5
P 6200 1000
F 0 "D1013" H 6192 933 20  0000 C CNN
F 1 "LED" H 6192 933 50  0001 C CNN
F 2 "LED_SMD:LED_0402_1005Metric" H 6200 1000 50  0001 C CNN
F 3 "~" H 6200 1000 50  0001 C CNN
	1    6200 1000
	-1   0    0    1   
$EndComp
Text HLabel 6050 1000 3    20   Input ~ 0
L6
Text HLabel 6350 1000 3    20   Input ~ 0
L14
Text Notes 6600 700  0    50   ~ 0
X14
$Comp
L Device:LED D1014
U 1 1 000003F6
P 6600 1000
F 0 "D1014" H 6592 933 20  0000 C CNN
F 1 "LED" H 6592 933 50  0001 C CNN
F 2 "LED_SMD:LED_0402_1005Metric" H 6600 1000 50  0001 C CNN
F 3 "~" H 6600 1000 50  0001 C CNN
	1    6600 1000
	-1   0    0    1   
$EndComp
Text HLabel 6450 1000 3    20   Input ~ 0
L7
Text HLabel 6750 1000 3    20   Input ~ 0
L15
Text Notes 7000 700  0    50   ~ 0
X15
$Comp
L Device:LED D1015
U 1 1 000003F7
P 7000 1000
F 0 "D1015" H 6992 933 20  0000 C CNN
F 1 "LED" H 6992 933 50  0001 C CNN
F 2 "LED_SMD:LED_0402_1005Metric" H 7000 1000 50  0001 C CNN
F 3 "~" H 7000 1000 50  0001 C CNN
	1    7000 1000
	-1   0    0    1   
$EndComp
Text HLabel 6850 1000 3    20   Input ~ 0
L7
Text HLabel 7150 1000 3    20   Input ~ 0
L1
Text Notes 7400 700  0    50   ~ 0
X16
$Comp
L Device:LED D1016
U 1 1 000003F8
P 7400 1000
F 0 "D1016" H 7392 933 20  0000 C CNN
F 1 "LED" H 7392 933 50  0001 C CNN
F 2 "LED_SMD:LED_0402_1005Metric" H 7400 1000 50  0001 C CNN
F 3 "~" H 7400 1000 50  0001 C CNN
	1    7400 1000
	-1   0    0    1   
$EndComp
Text HLabel 7250 1000 3    20   Input ~ 0
L8
Text HLabel 7550 1000 3    20   Input ~ 0
L2
Text Notes 7800 700  0    50   ~ 0
X17
$Comp
L Device:LED D1017
U 1 1 000003F9
P 7800 1000
F 0 "D1017" H 7792 933 20  0000 C CNN
F 1 "LED" H 7792 933 50  0001 C CNN
F 2 "LED_SMD:LED_0402_1005Metric" H 7800 1000 50  0001 C CNN
F 3 "~" H 7800 1000 50  0001 C CNN
	1    7800 1000
	-1   0    0    1   
$EndComp
Text HLabel 7650 1000 3    20   Input ~ 0
L8
Text HLabel 7950 1000 3    20   Input ~ 0
L3
Text Notes 8200 700  0    50   ~ 0
X18
$Comp
L Device:LED D1018
U 1 1 000003FA
P 8200 1000
F 0 "D1018" H 8192 933 20  0000 C CNN
F 1 "LED" H 8192 933 50  0001 C CNN
F 2 "LED_SMD:LED_0402_1005Metric" H 8200 1000 50  0001 C CNN
F 3 "~" H 8200 1000 50  0001 C CNN
	1    8200 1000
	-1   0    0    1   
$EndComp
Text HLabel 8050 1000 3    20   Input ~ 0
L9
Text HLabel 8350 1000 3    20   Input ~ 0
L4
Text Notes 8600 700  0    50   ~ 0
X19
$Comp
L Device:LED D1019
U 1 1 000003FB
P 8600 1000
F 0 "D1019" H 8592 933 20  0000 C CNN
F 1 "LED" H 8592 933 50  0001 C CNN
F 2 "LED_SMD:LED_0402_1005Metric" H 8600 1000 50  0001 C CNN
F 3 "~" H 8600 1000 50  0001 C CNN
	1    8600 1000
	-1   0    0    1   
$EndComp
Text HLabel 8450 1000 3    20   Input ~ 0
L9
Text HLabel 8750 1000 3    20   Input ~ 0
L5
Text Notes 9000 700  0    50   ~ 0
X20
$Comp
L Device:LED D1020
U 1 1 000003FC
P 9000 1000
F 0 "D1020" H 8992 933 20  0000 C CNN
F 1 "LED" H 8992 933 50  0001 C CNN
F 2 "LED_SMD:LED_0402_1005Metric" H 9000 1000 50  0001 C CNN
F 3 "~" H 9000 1000 50  0001 C CNN
	1    9000 1000
	-1   0    0    1   
$EndComp
Text HLabel 8850 1000 3    20   Input ~ 0
L10
Text HLabel 9150 1000 3    20   Input ~ 0
L6
Text Notes 9400 700  0    50   ~ 0
X21
$Comp
L Device:LED D1021
U 1 1 000003FD
P 9400 1000
F 0 "D1021" H 9392 933 20  0000 C CNN
F 1 "LED" H 9392 933 50  0001 C CNN
F 2 "LED_SMD:LED_0402_1005Metric" H 9400 1000 50  0001 C CNN
F 3 "~" H 9400 1000 50  0001 C CNN
	1    9400 1000
	-1   0    0    1   
$EndComp
Text HLabel 9250 1000 3    20   Input ~ 0
L10
Text HLabel 9550 1000 3    20   Input ~ 0
L7
Text Notes 9800 700  0    50   ~ 0
X22
$Comp
L Device:LED D1022
U 1 1 000003FE
P 9800 1000
F 0 "D1022" H 9792 933 20  0000 C CNN
F 1 "LED" H 9792 933 50  0001 C CNN
F 2 "LED_SMD:LED_0402_1005Metric" H 9800 1000 50  0001 C CNN
F 3 "~" H 9800 1000 50  0001 C CNN
	1    9800 1000
	-1   0    0    1   
$EndComp
Text HLabel 9650 1000 3    20   Input ~ 0
L11
Text HLabel 9950 1000 3    20   Input ~ 0
L8
Text Notes 10200 700  0    50   ~ 0
X23
$Comp
L Device:LED D1023
U 1 1 000003FF
P 10200 1000
F 0 "D1023" H 10192 933 20  0000 C CNN
F 1 "LED" H 10192 933 50  0001 C CNN
F 2 "LED_SMD:LED_0402_1005Metric" H 10200 1000 50  0001 C CNN
F 3 "~" H 10200 1000 50  0001 C CNN
	1    10200 1000
	-1   0    0    1   
$EndComp
Text HLabel 10050 1000 3    20   Input ~ 0
L11
Text HLabel 10350 1000 3    20   Input ~ 0
L9
Text Notes 10600 700  0    50   ~ 0
X24
$Comp
L Device:LED D1024
U 1 1 00000400
P 10600 1000
F 0 "D1024" H 10592 933 20  0000 C CNN
F 1 "LED" H 10592 933 50  0001 C CNN
F 2 "LED_SMD:LED_0402_1005Metric" H 10600 1000 50  0001 C CNN
F 3 "~" H 10600 1000 50  0001 C CNN
	1    10600 1000
	-1   0    0    1   
$EndComp
Text HLabel 10450 1000 3    20   Input ~ 0
L12
Text HLabel 10750 1000 3    20   Input ~ 0
L10
Text Notes 11000 700  0    50   ~ 0
X25
$Comp
L Device:LED D1025
U 1 1 00000401
P 11000 1000
F 0 "D1025" H 10992 933 20  0000 C CNN
F 1 "LED" H 10992 933 50  0001 C CNN
F 2 "LED_SMD:LED_0402_1005Metric" H 11000 1000 50  0001 C CNN
F 3 "~" H 11000 1000 50  0001 C CNN
	1    11000 1000
	-1   0    0    1   
$EndComp
Text HLabel 10850 1000 3    20   Input ~ 0
L12
Text HLabel 11150 1000 3    20   Input ~ 0
L11
Text Notes 11400 700  0    50   ~ 0
X26
$Comp
L Device:LED D1026
U 1 1 00000402
P 11400 1000
F 0 "D1026" H 11392 933 20  0000 C CNN
F 1 "LED" H 11392 933 50  0001 C CNN
F 2 "LED_SMD:LED_0402_1005Metric" H 11400 1000 50  0001 C CNN
F 3 "~" H 11400 1000 50  0001 C CNN
	1    11400 1000
	-1   0    0    1   
$EndComp
Text HLabel 11250 1000 3    20   Input ~ 0
L13
Text HLabel 11550 1000 3    20   Input ~ 0
L12
Text Notes 11800 700  0    50   ~ 0
X27
$Comp
L Device:LED D1027
U 1 1 00000403
P 11800 1000
F 0 "D1027" H 11792 933 20  0000 C CNN
F 1 "LED" H 11792 933 50  0001 C CNN
F 2 "LED_SMD:LED_0402_1005Metric" H 11800 1000 50  0001 C CNN
F 3 "~" H 11800 1000 50  0001 C CNN
	1    11800 1000
	-1   0    0    1   
$EndComp
Text HLabel 11650 1000 3    20   Input ~ 0
L13
Text HLabel 11950 1000 3    20   Input ~ 0
L13
Text Notes 12200 700  0    50   ~ 0
X28
$Comp
L Device:LED D1028
U 1 1 00000404
P 12200 1000
F 0 "D1028" H 12192 933 20  0000 C CNN
F 1 "LED" H 12192 933 50  0001 C CNN
F 2 "LED_SMD:LED_0402_1005Metric" H 12200 1000 50  0001 C CNN
F 3 "~" H 12200 1000 50  0001 C CNN
	1    12200 1000
	-1   0    0    1   
$EndComp
Text HLabel 12050 1000 3    20   Input ~ 0
L14
Text HLabel 12350 1000 3    20   Input ~ 0
L14
Text Notes 12600 700  0    50   ~ 0
X29
$Comp
L Device:LED D1029
U 1 1 00000405
P 12600 1000
F 0 "D1029" H 12592 933 20  0000 C CNN
F 1 "LED" H 12592 933 50  0001 C CNN
F 2 "LED_SMD:LED_0402_1005Metric" H 12600 1000 50  0001 C CNN
F 3 "~" H 12600 1000 50  0001 C CNN
	1    12600 1000
	-1   0    0    1   
$EndComp
Text HLabel 12450 1000 3    20   Input ~ 0
L14
Text HLabel 12750 1000 3    20   Input ~ 0
L15
Text Notes 700  1200 0    50   ~ 0
Y1
Text Notes 1000 700  0    50   ~ 0
X0
$Comp
L Device:LED D1030
U 1 1 00000406
P 1000 1200
F 0 "D1030" H 992 1133 20  0000 C CNN
F 1 "LED" H 992 1133 50  0001 C CNN
F 2 "LED_SMD:LED_0402_1005Metric" H 1000 1200 50  0001 C CNN
F 3 "~" H 1000 1200 50  0001 C CNN
	1    1000 1200
	-1   0    0    1   
$EndComp
Text HLabel 850  1200 3    20   Input ~ 0
L14
Text HLabel 1150 1200 3    20   Input ~ 0
L2
Text Notes 1400 700  0    50   ~ 0
X1
$Comp
L Device:LED D1031
U 1 1 00000407
P 1400 1200
F 0 "D1031" H 1392 1133 20  0000 C CNN
F 1 "LED" H 1392 1133 50  0001 C CNN
F 2 "LED_SMD:LED_0402_1005Metric" H 1400 1200 50  0001 C CNN
F 3 "~" H 1400 1200 50  0001 C CNN
	1    1400 1200
	-1   0    0    1   
$EndComp
Text HLabel 1250 1200 3    20   Input ~ 0
L14
Text HLabel 1550 1200 3    20   Input ~ 0
L3
Text Notes 1800 700  0    50   ~ 0
X2
$Comp
L Device:LED D1032
U 1 1 00000408
P 1800 1200
F 0 "D1032" H 1792 1133 20  0000 C CNN
F 1 "LED" H 1792 1133 50  0001 C CNN
F 2 "LED_SMD:LED_0402_1005Metric" H 1800 1200 50  0001 C CNN
F 3 "~" H 1800 1200 50  0001 C CNN
	1    1800 1200
	-1   0    0    1   
$EndComp
Text HLabel 1650 1200 3    20   Input ~ 0
L15
Text HLabel 1950 1200 3    20   Input ~ 0
L4
Text Notes 2200 700  0    50   ~ 0
X3
$Comp
L Device:LED D1033
U 1 1 00000409
P 2200 1200
F 0 "D1033" H 2192 1133 20  0000 C CNN
F 1 "LED" H 2192 1133 50  0001 C CNN
F 2 "LED_SMD:LED_0402_1005Metric" H 2200 1200 50  0001 C CNN
F 3 "~" H 2200 1200 50  0001 C CNN
	1    2200 1200
	-1   0    0    1   
$EndComp
Text HLabel 2050 1200 3    20   Input ~ 0
L15
Text HLabel 2350 1200 3    20   Input ~ 0
L5
Text Notes 2600 700  0    50   ~ 0
X4
$Comp
L Device:LED D1034
U 1 1 0000040A
P 2600 1200
F 0 "D1034" H 2592 1133 20  0000 C CNN
F 1 "LED" H 2592 1133 50  0001 C CNN
F 2 "LED_SMD:LED_0402_1005Metric" H 2600 1200 50  0001 C CNN
F 3 "~" H 2600 1200 50  0001 C CNN
	1    2600 1200
	-1   0    0    1   
$EndComp
Text HLabel 2450 1200 3    20   Input ~ 0
L1
Text HLabel 2750 1200 3    20   Input ~ 0
L6
Text Notes 3000 700  0    50   ~ 0
X5
$Comp
L Device:LED D1035
U 1 1 0000040B
P 3000 1200
F 0 "D1035" H 2992 1133 20  0000 C CNN
F 1 "LED" H 2992 1133 50  0001 C CNN
F 2 "LED_SMD:LED_0402_1005Metric" H 3000 1200 50  0001 C CNN
F 3 "~" H 3000 1200 50  0001 C CNN
	1    3000 1200
	-1   0    0    1   
$EndComp
Text HLabel 2850 1200 3    20   Input ~ 0
L1
Text HLabel 3150 1200 3    20   Input ~ 0
L7
Text Notes 3400 700  0    50   ~ 0
X6
$Comp
L Device:LED D1036
U 1 1 0000040C
P 3400 1200
F 0 "D1036" H 3392 1133 20  0000 C CNN
F 1 "LED" H 3392 1133 50  0001 C CNN
F 2 "LED_SMD:LED_0402_1005Metric" H 3400 1200 50  0001 C CNN
F 3 "~" H 3400 1200 50  0001 C CNN
	1    3400 1200
	-1   0    0    1   
$EndComp
Text HLabel 3250 1200 3    20   Input ~ 0
L2
Text HLabel 3550 1200 3    20   Input ~ 0
L8
Text Notes 3800 700  0    50   ~ 0
X7
$Comp
L Device:LED D1037
U 1 1 0000040D
P 3800 1200
F 0 "D1037" H 3792 1133 20  0000 C CNN
F 1 "LED" H 3792 1133 50  0001 C CNN
F 2 "LED_SMD:LED_0402_1005Metric" H 3800 1200 50  0001 C CNN
F 3 "~" H 3800 1200 50  0001 C CNN
	1    3800 1200
	-1   0    0    1   
$EndComp
Text HLabel 3650 1200 3    20   Input ~ 0
L2
Text HLabel 3950 1200 3    20   Input ~ 0
L9
Text Notes 4200 700  0    50   ~ 0
X8
$Comp
L Device:LED D1038
U 1 1 0000040E
P 4200 1200
F 0 "D1038" H 4192 1133 20  0000 C CNN
F 1 "LED" H 4192 1133 50  0001 C CNN
F 2 "LED_SMD:LED_0402_1005Metric" H 4200 1200 50  0001 C CNN
F 3 "~" H 4200 1200 50  0001 C CNN
	1    4200 1200
	-1   0    0    1   
$EndComp
Text HLabel 4050 1200 3    20   Input ~ 0
L3
Text HLabel 4350 1200 3    20   Input ~ 0
L10
Text Notes 4600 700  0    50   ~ 0
X9
$Comp
L Device:LED D1039
U 1 1 0000040F
P 4600 1200
F 0 "D1039" H 4592 1133 20  0000 C CNN
F 1 "LED" H 4592 1133 50  0001 C CNN
F 2 "LED_SMD:LED_0402_1005Metric" H 4600 1200 50  0001 C CNN
F 3 "~" H 4600 1200 50  0001 C CNN
	1    4600 1200
	-1   0    0    1   
$EndComp
Text HLabel 4450 1200 3    20   Input ~ 0
L3
Text HLabel 4750 1200 3    20   Input ~ 0
L11
Text Notes 5000 700  0    50   ~ 0
X10
$Comp
L Device:LED D1040
U 1 1 00000410
P 5000 1200
F 0 "D1040" H 4992 1133 20  0000 C CNN
F 1 "LED" H 4992 1133 50  0001 C CNN
F 2 "LED_SMD:LED_0402_1005Metric" H 5000 1200 50  0001 C CNN
F 3 "~" H 5000 1200 50  0001 C CNN
	1    5000 1200
	-1   0    0    1   
$EndComp
Text HLabel 4850 1200 3    20   Input ~ 0
L4
Text HLabel 5150 1200 3    20   Input ~ 0
L12
Text Notes 5400 700  0    50   ~ 0
X11
$Comp
L Device:LED D1041
U 1 1 00000411
P 5400 1200
F 0 "D1041" H 5392 1133 20  0000 C CNN
F 1 "LED" H 5392 1133 50  0001 C CNN
F 2 "LED_SMD:LED_0402_1005Metric" H 5400 1200 50  0001 C CNN
F 3 "~" H 5400 1200 50  0001 C CNN
	1    5400 1200
	-1   0    0    1   
$EndComp
Text HLabel 5250 1200 3    20   Input ~ 0
L4
Text HLabel 5550 1200 3    20   Input ~ 0
L13
Text Notes 5800 700  0    50   ~ 0
X12
$Comp
L Device:LED D1042
U 1 1 00000412
P 5800 1200
F 0 "D1042" H 5792 1133 20  0000 C CNN
F 1 "LED" H 5792 1133 50  0001 C CNN
F 2 "LED_SMD:LED_0402_1005Metric" H 5800 1200 50  0001 C CNN
F 3 "~" H 5800 1200 50  0001 C CNN
	1    5800 1200
	-1   0    0    1   
$EndComp
Text HLabel 5650 1200 3    20   Input ~ 0
L5
Text HLabel 5950 1200 3    20   Input ~ 0
L14
Text Notes 6200 700  0    50   ~ 0
X13
$Comp
L Device:LED D1043
U 1 1 00000413
P 6200 1200
F 0 "D1043" H 6192 1133 20  0000 C CNN
F 1 "LED" H 6192 1133 50  0001 C CNN
F 2 "LED_SMD:LED_0402_1005Metric" H 6200 1200 50  0001 C CNN
F 3 "~" H 6200 1200 50  0001 C CNN
	1    6200 1200
	-1   0    0    1   
$EndComp
Text HLabel 6050 1200 3    20   Input ~ 0
L5
Text HLabel 6350 1200 3    20   Input ~ 0
L15
Text Notes 6600 700  0    50   ~ 0
X14
$Comp
L Device:LED D1044
U 1 1 00000414
P 6600 1200
F 0 "D1044" H 6592 1133 20  0000 C CNN
F 1 "LED" H 6592 1133 50  0001 C CNN
F 2 "LED_SMD:LED_0402_1005Metric" H 6600 1200 50  0001 C CNN
F 3 "~" H 6600 1200 50  0001 C CNN
	1    6600 1200
	-1   0    0    1   
$EndComp
Text HLabel 6450 1200 3    20   Input ~ 0
L6
Text HLabel 6750 1200 3    20   Input ~ 0
L1
Text Notes 7000 700  0    50   ~ 0
X15
$Comp
L Device:LED D1045
U 1 1 00000415
P 7000 1200
F 0 "D1045" H 6992 1133 20  0000 C CNN
F 1 "LED" H 6992 1133 50  0001 C CNN
F 2 "LED_SMD:LED_0402_1005Metric" H 7000 1200 50  0001 C CNN
F 3 "~" H 7000 1200 50  0001 C CNN
	1    7000 1200
	-1   0    0    1   
$EndComp
Text HLabel 6850 1200 3    20   Input ~ 0
L6
Text HLabel 7150 1200 3    20   Input ~ 0
L2
Text Notes 7400 700  0    50   ~ 0
X16
$Comp
L Device:LED D1046
U 1 1 00000416
P 7400 1200
F 0 "D1046" H 7392 1133 20  0000 C CNN
F 1 "LED" H 7392 1133 50  0001 C CNN
F 2 "LED_SMD:LED_0402_1005Metric" H 7400 1200 50  0001 C CNN
F 3 "~" H 7400 1200 50  0001 C CNN
	1    7400 1200
	-1   0    0    1   
$EndComp
Text HLabel 7250 1200 3    20   Input ~ 0
L7
Text HLabel 7550 1200 3    20   Input ~ 0
L3
Text Notes 7800 700  0    50   ~ 0
X17
$Comp
L Device:LED D1047
U 1 1 00000417
P 7800 1200
F 0 "D1047" H 7792 1133 20  0000 C CNN
F 1 "LED" H 7792 1133 50  0001 C CNN
F 2 "LED_SMD:LED_0402_1005Metric" H 7800 1200 50  0001 C CNN
F 3 "~" H 7800 1200 50  0001 C CNN
	1    7800 1200
	-1   0    0    1   
$EndComp
Text HLabel 7650 1200 3    20   Input ~ 0
L7
Text HLabel 7950 1200 3    20   Input ~ 0
L4
Text Notes 8200 700  0    50   ~ 0
X18
$Comp
L Device:LED D1048
U 1 1 00000418
P 8200 1200
F 0 "D1048" H 8192 1133 20  0000 C CNN
F 1 "LED" H 8192 1133 50  0001 C CNN
F 2 "LED_SMD:LED_0402_1005Metric" H 8200 1200 50  0001 C CNN
F 3 "~" H 8200 1200 50  0001 C CNN
	1    8200 1200
	-1   0    0    1   
$EndComp
Text HLabel 8050 1200 3    20   Input ~ 0
L8
Text HLabel 8350 1200 3    20   Input ~ 0
L5
Text Notes 8600 700  0    50   ~ 0
X19
$Comp
L Device:LED D1049
U 1 1 00000419
P 8600 1200
F 0 "D1049" H 8592 1133 20  0000 C CNN
F 1 "LED" H 8592 1133 50  0001 C CNN
F 2 "LED_SMD:LED_0402_1005Metric" H 8600 1200 50  0001 C CNN
F 3 "~" H 8600 1200 50  0001 C CNN
	1    8600 1200
	-1   0    0    1   
$EndComp
Text HLabel 8450 1200 3    20   Input ~ 0
L8
Text HLabel 8750 1200 3    20   Input ~ 0
L6
Text Notes 9000 700  0    50   ~ 0
X20
$Comp
L Device:LED D1050
U 1 1 0000041A
P 9000 1200
F 0 "D1050" H 8992 1133 20  0000 C CNN
F 1 "LED" H 8992 1133 50  0001 C CNN
F 2 "LED_SMD:LED_0402_1005Metric" H 9000 1200 50  0001 C CNN
F 3 "~" H 9000 1200 50  0001 C CNN
	1    9000 1200
	-1   0    0    1   
$EndComp
Text HLabel 8850 1200 3    20   Input ~ 0
L9
Text HLabel 9150 1200 3    20   Input ~ 0
L7
Text Notes 9400 700  0    50   ~ 0
X21
$Comp
L Device:LED D1051
U 1 1 0000041B
P 9400 1200
F 0 "D1051" H 9392 1133 20  0000 C CNN
F 1 "LED" H 9392 1133 50  0001 C CNN
F 2 "LED_SMD:LED_0402_1005Metric" H 9400 1200 50  0001 C CNN
F 3 "~" H 9400 1200 50  0001 C CNN
	1    9400 1200
	-1   0    0    1   
$EndComp
Text HLabel 9250 1200 3    20   Input ~ 0
L9
Text HLabel 9550 1200 3    20   Input ~ 0
L8
Text Notes 9800 700  0    50   ~ 0
X22
$Comp
L Device:LED D1052
U 1 1 0000041C
P 9800 1200
F 0 "D1052" H 9792 1133 20  0000 C CNN
F 1 "LED" H 9792 1133 50  0001 C CNN
F 2 "LED_SMD:LED_0402_1005Metric" H 9800 1200 50  0001 C CNN
F 3 "~" H 9800 1200 50  0001 C CNN
	1    9800 1200
	-1   0    0    1   
$EndComp
Text HLabel 9650 1200 3    20   Input ~ 0
L10
Text HLabel 9950 1200 3    20   Input ~ 0
L9
Text Notes 10200 700  0    50   ~ 0
X23
$Comp
L Device:LED D1053
U 1 1 0000041D
P 10200 1200
F 0 "D1053" H 10192 1133 20  0000 C CNN
F 1 "LED" H 10192 1133 50  0001 C CNN
F 2 "LED_SMD:LED_0402_1005Metric" H 10200 1200 50  0001 C CNN
F 3 "~" H 10200 1200 50  0001 C CNN
	1    10200 1200
	-1   0    0    1   
$EndComp
Text HLabel 10050 1200 3    20   Input ~ 0
L10
Text HLabel 10350 1200 3    20   Input ~ 0
L10
Text Notes 10600 700  0    50   ~ 0
X24
$Comp
L Device:LED D1054
U 1 1 0000041E
P 10600 1200
F 0 "D1054" H 10592 1133 20  0000 C CNN
F 1 "LED" H 10592 1133 50  0001 C CNN
F 2 "LED_SMD:LED_0402_1005Metric" H 10600 1200 50  0001 C CNN
F 3 "~" H 10600 1200 50  0001 C CNN
	1    10600 1200
	-1   0    0    1   
$EndComp
Text HLabel 10450 1200 3    20   Input ~ 0
L11
Text HLabel 10750 1200 3    20   Input ~ 0
L11
Text Notes 11000 700  0    50   ~ 0
X25
$Comp
L Device:LED D1055
U 1 1 0000041F
P 11000 1200
F 0 "D1055" H 10992 1133 20  0000 C CNN
F 1 "LED" H 10992 1133 50  0001 C CNN
F 2 "LED_SMD:LED_0402_1005Metric" H 11000 1200 50  0001 C CNN
F 3 "~" H 11000 1200 50  0001 C CNN
	1    11000 1200
	-1   0    0    1   
$EndComp
Text HLabel 10850 1200 3    20   Input ~ 0
L11
Text HLabel 11150 1200 3    20   Input ~ 0
L12
Text Notes 11400 700  0    50   ~ 0
X26
$Comp
L Device:LED D1056
U 1 1 00000420
P 11400 1200
F 0 "D1056" H 11392 1133 20  0000 C CNN
F 1 "LED" H 11392 1133 50  0001 C CNN
F 2 "LED_SMD:LED_0402_1005Metric" H 11400 1200 50  0001 C CNN
F 3 "~" H 11400 1200 50  0001 C CNN
	1    11400 1200
	-1   0    0    1   
$EndComp
Text HLabel 11250 1200 3    20   Input ~ 0
L12
Text HLabel 11550 1200 3    20   Input ~ 0
L13
Text Notes 11800 700  0    50   ~ 0
X27
$Comp
L Device:LED D1057
U 1 1 00000421
P 11800 1200
F 0 "D1057" H 11792 1133 20  0000 C CNN
F 1 "LED" H 11792 1133 50  0001 C CNN
F 2 "LED_SMD:LED_0402_1005Metric" H 11800 1200 50  0001 C CNN
F 3 "~" H 11800 1200 50  0001 C CNN
	1    11800 1200
	-1   0    0    1   
$EndComp
Text HLabel 11650 1200 3    20   Input ~ 0
L12
Text HLabel 11950 1200 3    20   Input ~ 0
L14
Text Notes 12200 700  0    50   ~ 0
X28
$Comp
L Device:LED D1058
U 1 1 00000422
P 12200 1200
F 0 "D1058" H 12192 1133 20  0000 C CNN
F 1 "LED" H 12192 1133 50  0001 C CNN
F 2 "LED_SMD:LED_0402_1005Metric" H 12200 1200 50  0001 C CNN
F 3 "~" H 12200 1200 50  0001 C CNN
	1    12200 1200
	-1   0    0    1   
$EndComp
Text HLabel 12050 1200 3    20   Input ~ 0
L13
Text HLabel 12350 1200 3    20   Input ~ 0
L15
Text Notes 12600 700  0    50   ~ 0
X29
$Comp
L Device:LED D1059
U 1 1 00000423
P 12600 1200
F 0 "D1059" H 12592 1133 20  0000 C CNN
F 1 "LED" H 12592 1133 50  0001 C CNN
F 2 "LED_SMD:LED_0402_1005Metric" H 12600 1200 50  0001 C CNN
F 3 "~" H 12600 1200 50  0001 C CNN
	1    12600 1200
	-1   0    0    1   
$EndComp
Text HLabel 12450 1200 3    20   Input ~ 0
L13
Text HLabel 12750 1200 3    20   Input ~ 0
L1
Text Notes 700  1400 0    50   ~ 0
Y2
Text Notes 1000 700  0    50   ~ 0
X0
$Comp
L Device:LED D1060
U 1 1 00000424
P 1000 1400
F 0 "D1060" H 992 1333 20  0000 C CNN
F 1 "LED" H 992 1333 50  0001 C CNN
F 2 "LED_SMD:LED_0402_1005Metric" H 1000 1400 50  0001 C CNN
F 3 "~" H 1000 1400 50  0001 C CNN
	1    1000 1400
	-1   0    0    1   
$EndComp
Text HLabel 850  1400 3    20   Input ~ 0
L13
Text HLabel 1150 1400 3    20   Input ~ 0
L3
Text Notes 1400 700  0    50   ~ 0
X1
$Comp
L Device:LED D1061
U 1 1 00000425
P 1400 1400
F 0 "D1061" H 1392 1333 20  0000 C CNN
F 1 "LED" H 1392 1333 50  0001 C CNN
F 2 "LED_SMD:LED_0402_1005Metric" H 1400 1400 50  0001 C CNN
F 3 "~" H 1400 1400 50  0001 C CNN
	1    1400 1400
	-1   0    0    1   
$EndComp
Text HLabel 1250 1400 3    20   Input ~ 0
L13
Text HLabel 1550 1400 3    20   Input ~ 0
L4
Text Notes 1800 700  0    50   ~ 0
X2
$Comp
L Device:LED D1062
U 1 1 00000426
P 1800 1400
F 0 "D1062" H 1792 1333 20  0000 C CNN
F 1 "LED" H 1792 1333 50  0001 C CNN
F 2 "LED_SMD:LED_0402_1005Metric" H 1800 1400 50  0001 C CNN
F 3 "~" H 1800 1400 50  0001 C CNN
	1    1800 1400
	-1   0    0    1   
$EndComp
Text HLabel 1650 1400 3    20   Input ~ 0
L14
Text HLabel 1950 1400 3    20   Input ~ 0
L5
Text Notes 2200 700  0    50   ~ 0
X3
$Comp
L Device:LED D1063
U 1 1 00000427
P 2200 1400
F 0 "D1063" H 2192 1333 20  0000 C CNN
F 1 "LED" H 2192 1333 50  0001 C CNN
F 2 "LED_SMD:LED_0402_1005Metric" H 2200 1400 50  0001 C CNN
F 3 "~" H 2200 1400 50  0001 C CNN
	1    2200 1400
	-1   0    0    1   
$EndComp
Text HLabel 2050 1400 3    20   Input ~ 0
L14
Text HLabel 2350 1400 3    20   Input ~ 0
L6
Text Notes 2600 700  0    50   ~ 0
X4
$Comp
L Device:LED D1064
U 1 1 00000428
P 2600 1400
F 0 "D1064" H 2592 1333 20  0000 C CNN
F 1 "LED" H 2592 1333 50  0001 C CNN
F 2 "LED_SMD:LED_0402_1005Metric" H 2600 1400 50  0001 C CNN
F 3 "~" H 2600 1400 50  0001 C CNN
	1    2600 1400
	-1   0    0    1   
$EndComp
Text HLabel 2450 1400 3    20   Input ~ 0
L15
Text HLabel 2750 1400 3    20   Input ~ 0
L7
Text Notes 3000 700  0    50   ~ 0
X5
$Comp
L Device:LED D1065
U 1 1 00000429
P 3000 1400
F 0 "D1065" H 2992 1333 20  0000 C CNN
F 1 "LED" H 2992 1333 50  0001 C CNN
F 2 "LED_SMD:LED_0402_1005Metric" H 3000 1400 50  0001 C CNN
F 3 "~" H 3000 1400 50  0001 C CNN
	1    3000 1400
	-1   0    0    1   
$EndComp
Text HLabel 2850 1400 3    20   Input ~ 0
L15
Text HLabel 3150 1400 3    20   Input ~ 0
L8
Text Notes 3400 700  0    50   ~ 0
X6
$Comp
L Device:LED D1066
U 1 1 0000042A
P 3400 1400
F 0 "D1066" H 3392 1333 20  0000 C CNN
F 1 "LED" H 3392 1333 50  0001 C CNN
F 2 "LED_SMD:LED_0402_1005Metric" H 3400 1400 50  0001 C CNN
F 3 "~" H 3400 1400 50  0001 C CNN
	1    3400 1400
	-1   0    0    1   
$EndComp
Text HLabel 3250 1400 3    20   Input ~ 0
L1
Text HLabel 3550 1400 3    20   Input ~ 0
L9
Text Notes 3800 700  0    50   ~ 0
X7
$Comp
L Device:LED D1067
U 1 1 0000042B
P 3800 1400
F 0 "D1067" H 3792 1333 20  0000 C CNN
F 1 "LED" H 3792 1333 50  0001 C CNN
F 2 "LED_SMD:LED_0402_1005Metric" H 3800 1400 50  0001 C CNN
F 3 "~" H 3800 1400 50  0001 C CNN
	1    3800 1400
	-1   0    0    1   
$EndComp
Text HLabel 3650 1400 3    20   Input ~ 0
L1
Text HLabel 3950 1400 3    20   Input ~ 0
L10
Text Notes 4200 700  0    50   ~ 0
X8
$Comp
L Device:LED D1068
U 1 1 0000042C
P 4200 1400
F 0 "D1068" H 4192 1333 20  0000 C CNN
F 1 "LED" H 4192 1333 50  0001 C CNN
F 2 "LED_SMD:LED_0402_1005Metric" H 4200 1400 50  0001 C CNN
F 3 "~" H 4200 1400 50  0001 C CNN
	1    4200 1400
	-1   0    0    1   
$EndComp
Text HLabel 4050 1400 3    20   Input ~ 0
L2
Text HLabel 4350 1400 3    20   Input ~ 0
L11
Text Notes 4600 700  0    50   ~ 0
X9
$Comp
L Device:LED D1069
U 1 1 0000042D
P 4600 1400
F 0 "D1069" H 4592 1333 20  0000 C CNN
F 1 "LED" H 4592 1333 50  0001 C CNN
F 2 "LED_SMD:LED_0402_1005Metric" H 4600 1400 50  0001 C CNN
F 3 "~" H 4600 1400 50  0001 C CNN
	1    4600 1400
	-1   0    0    1   
$EndComp
Text HLabel 4450 1400 3    20   Input ~ 0
L2
Text HLabel 4750 1400 3    20   Input ~ 0
L12
Text Notes 5000 700  0    50   ~ 0
X10
$Comp
L Device:LED D1070
U 1 1 0000042E
P 5000 1400
F 0 "D1070" H 4992 1333 20  0000 C CNN
F 1 "LED" H 4992 1333 50  0001 C CNN
F 2 "LED_SMD:LED_0402_1005Metric" H 5000 1400 50  0001 C CNN
F 3 "~" H 5000 1400 50  0001 C CNN
	1    5000 1400
	-1   0    0    1   
$EndComp
Text HLabel 4850 1400 3    20   Input ~ 0
L3
Text HLabel 5150 1400 3    20   Input ~ 0
L13
Text Notes 5400 700  0    50   ~ 0
X11
$Comp
L Device:LED D1071
U 1 1 0000042F
P 5400 1400
F 0 "D1071" H 5392 1333 20  0000 C CNN
F 1 "LED" H 5392 1333 50  0001 C CNN
F 2 "LED_SMD:LED_0402_1005Metric" H 5400 1400 50  0001 C CNN
F 3 "~" H 5400 1400 50  0001 C CNN
	1    5400 1400
	-1   0    0    1   
$EndComp
Text HLabel 5250 1400 3    20   Input ~ 0
L3
Text HLabel 5550 1400 3    20   Input ~ 0
L14
Text Notes 5800 700  0    50   ~ 0
X12
$Comp
L Device:LED D1072
U 1 1 00000430
P 5800 1400
F 0 "D1072" H 5792 1333 20  0000 C CNN
F 1 "LED" H 5792 1333 50  0001 C CNN
F 2 "LED_SMD:LED_0402_1005Metric" H 5800 1400 50  0001 C CNN
F 3 "~" H 5800 1400 50  0001 C CNN
	1    5800 1400
	-1   0    0    1   
$EndComp
Text HLabel 5650 1400 3    20   Input ~ 0
L4
Text HLabel 5950 1400 3    20   Input ~ 0
L15
Text Notes 6200 700  0    50   ~ 0
X13
$Comp
L Device:LED D1073
U 1 1 00000431
P 6200 1400
F 0 "D1073" H 6192 1333 20  0000 C CNN
F 1 "LED" H 6192 1333 50  0001 C CNN
F 2 "LED_SMD:LED_0402_1005Metric" H 6200 1400 50  0001 C CNN
F 3 "~" H 6200 1400 50  0001 C CNN
	1    6200 1400
	-1   0    0    1   
$EndComp
Text HLabel 6050 1400 3    20   Input ~ 0
L4
Text HLabel 6350 1400 3    20   Input ~ 0
L1
Text Notes 6600 700  0    50   ~ 0
X14
$Comp
L Device:LED D1074
U 1 1 00000432
P 6600 1400
F 0 "D1074" H 6592 1333 20  0000 C CNN
F 1 "LED" H 6592 1333 50  0001 C CNN
F 2 "LED_SMD:LED_0402_1005Metric" H 6600 1400 50  0001 C CNN
F 3 "~" H 6600 1400 50  0001 C CNN
	1    6600 1400
	-1   0    0    1   
$EndComp
Text HLabel 6450 1400 3    20   Input ~ 0
L5
Text HLabel 6750 1400 3    20   Input ~ 0
L2
Text Notes 7000 700  0    50   ~ 0
X15
$Comp
L Device:LED D1075
U 1 1 00000433
P 7000 1400
F 0 "D1075" H 6992 1333 20  0000 C CNN
F 1 "LED" H 6992 1333 50  0001 C CNN
F 2 "LED_SMD:LED_0402_1005Metric" H 7000 1400 50  0001 C CNN
F 3 "~" H 7000 1400 50  0001 C CNN
	1    7000 1400
	-1   0    0    1   
$EndComp
Text HLabel 6850 1400 3    20   Input ~ 0
L5
Text HLabel 7150 1400 3    20   Input ~ 0
L3
Text Notes 7400 700  0    50   ~ 0
X16
$Comp
L Device:LED D1076
U 1 1 00000434
P 7400 1400
F 0 "D1076" H 7392 1333 20  0000 C CNN
F 1 "LED" H 7392 1333 50  0001 C CNN
F 2 "LED_SMD:LED_0402_1005Metric" H 7400 1400 50  0001 C CNN
F 3 "~" H 7400 1400 50  0001 C CNN
	1    7400 1400
	-1   0    0    1   
$EndComp
Text HLabel 7250 1400 3    20   Input ~ 0
L6
Text HLabel 7550 1400 3    20   Input ~ 0
L4
Text Notes 7800 700  0    50   ~ 0
X17
$Comp
L Device:LED D1077
U 1 1 00000435
P 7800 1400
F 0 "D1077" H 7792 1333 20  0000 C CNN
F 1 "LED" H 7792 1333 50  0001 C CNN
F 2 "LED_SMD:LED_0402_1005Metric" H 7800 1400 50  0001 C CNN
F 3 "~" H 7800 1400 50  0001 C CNN
	1    7800 1400
	-1   0    0    1   
$EndComp
Text HLabel 7650 1400 3    20   Input ~ 0
L6
Text HLabel 7950 1400 3    20   Input ~ 0
L5
Text Notes 8200 700  0    50   ~ 0
X18
$Comp
L Device:LED D1078
U 1 1 00000436
P 8200 1400
F 0 "D1078" H 8192 1333 20  0000 C CNN
F 1 "LED" H 8192 1333 50  0001 C CNN
F 2 "LED_SMD:LED_0402_1005Metric" H 8200 1400 50  0001 C CNN
F 3 "~" H 8200 1400 50  0001 C CNN
	1    8200 1400
	-1   0    0    1   
$EndComp
Text HLabel 8050 1400 3    20   Input ~ 0
L7
Text HLabel 8350 1400 3    20   Input ~ 0
L6
Text Notes 8600 700  0    50   ~ 0
X19
$Comp
L Device:LED D1079
U 1 1 00000437
P 8600 1400
F 0 "D1079" H 8592 1333 20  0000 C CNN
F 1 "LED" H 8592 1333 50  0001 C CNN
F 2 "LED_SMD:LED_0402_1005Metric" H 8600 1400 50  0001 C CNN
F 3 "~" H 8600 1400 50  0001 C CNN
	1    8600 1400
	-1   0    0    1   
$EndComp
Text HLabel 8450 1400 3    20   Input ~ 0
L7
Text HLabel 8750 1400 3    20   Input ~ 0
L7
Text Notes 9000 700  0    50   ~ 0
X20
$Comp
L Device:LED D1080
U 1 1 00000438
P 9000 1400
F 0 "D1080" H 8992 1333 20  0000 C CNN
F 1 "LED" H 8992 1333 50  0001 C CNN
F 2 "LED_SMD:LED_0402_1005Metric" H 9000 1400 50  0001 C CNN
F 3 "~" H 9000 1400 50  0001 C CNN
	1    9000 1400
	-1   0    0    1   
$EndComp
Text HLabel 8850 1400 3    20   Input ~ 0
L8
Text HLabel 9150 1400 3    20   Input ~ 0
L8
Text Notes 9400 700  0    50   ~ 0
X21
$Comp
L Device:LED D1081
U 1 1 00000439
P 9400 1400
F 0 "D1081" H 9392 1333 20  0000 C CNN
F 1 "LED" H 9392 1333 50  0001 C CNN
F 2 "LED_SMD:LED_0402_1005Metric" H 9400 1400 50  0001 C CNN
F 3 "~" H 9400 1400 50  0001 C CNN
	1    9400 1400
	-1   0    0    1   
$EndComp
Text HLabel 9250 1400 3    20   Input ~ 0
L8
Text HLabel 9550 1400 3    20   Input ~ 0
L9
Text Notes 9800 700  0    50   ~ 0
X22
$Comp
L Device:LED D1082
U 1 1 0000043A
P 9800 1400
F 0 "D1082" H 9792 1333 20  0000 C CNN
F 1 "LED" H 9792 1333 50  0001 C CNN
F 2 "LED_SMD:LED_0402_1005Metric" H 9800 1400 50  0001 C CNN
F 3 "~" H 9800 1400 50  0001 C CNN
	1    9800 1400
	-1   0    0    1   
$EndComp
Text HLabel 9650 1400 3    20   Input ~ 0
L9
Text HLabel 9950 1400 3    20   Input ~ 0
L10
Text Notes 10200 700  0    50   ~ 0
X23
$Comp
L Device:LED D1083
U 1 1 0000043B
P 10200 1400
F 0 "D1083" H 10192 1333 20  0000 C CNN
F 1 "LED" H 10192 1333 50  0001 C CNN
F 2 "LED_SMD:LED_0402_1005Metric" H 10200 1400 50  0001 C CNN
F 3 "~" H 10200 1400 50  0001 C CNN
	1    10200 1400
	-1   0    0    1   
$EndComp
Text HLabel 10050 1400 3    20   Input ~ 0
L9
Text HLabel 10350 1400 3    20   Input ~ 0
L11
Text Notes 10600 700  0    50   ~ 0
X24
$Comp
L Device:LED D1084
U 1 1 0000043C
P 10600 1400
F 0 "D1084" H 10592 1333 20  0000 C CNN
F 1 "LED" H 10592 1333 50  0001 C CNN
F 2 "LED_SMD:LED_0402_1005Metric" H 10600 1400 50  0001 C CNN
F 3 "~" H 10600 1400 50  0001 C CNN
	1    10600 1400
	-1   0    0    1   
$EndComp
Text HLabel 10450 1400 3    20   Input ~ 0
L10
Text HLabel 10750 1400 3    20   Input ~ 0
L12
Text Notes 11000 700  0    50   ~ 0
X25
$Comp
L Device:LED D1085
U 1 1 0000043D
P 11000 1400
F 0 "D1085" H 10992 1333 20  0000 C CNN
F 1 "LED" H 10992 1333 50  0001 C CNN
F 2 "LED_SMD:LED_0402_1005Metric" H 11000 1400 50  0001 C CNN
F 3 "~" H 11000 1400 50  0001 C CNN
	1    11000 1400
	-1   0    0    1   
$EndComp
Text HLabel 10850 1400 3    20   Input ~ 0
L10
Text HLabel 11150 1400 3    20   Input ~ 0
L13
Text Notes 11400 700  0    50   ~ 0
X26
$Comp
L Device:LED D1086
U 1 1 0000043E
P 11400 1400
F 0 "D1086" H 11392 1333 20  0000 C CNN
F 1 "LED" H 11392 1333 50  0001 C CNN
F 2 "LED_SMD:LED_0402_1005Metric" H 11400 1400 50  0001 C CNN
F 3 "~" H 11400 1400 50  0001 C CNN
	1    11400 1400
	-1   0    0    1   
$EndComp
Text HLabel 11250 1400 3    20   Input ~ 0
L11
Text HLabel 11550 1400 3    20   Input ~ 0
L14
Text Notes 11800 700  0    50   ~ 0
X27
$Comp
L Device:LED D1087
U 1 1 0000043F
P 11800 1400
F 0 "D1087" H 11792 1333 20  0000 C CNN
F 1 "LED" H 11792 1333 50  0001 C CNN
F 2 "LED_SMD:LED_0402_1005Metric" H 11800 1400 50  0001 C CNN
F 3 "~" H 11800 1400 50  0001 C CNN
	1    11800 1400
	-1   0    0    1   
$EndComp
Text HLabel 11650 1400 3    20   Input ~ 0
L11
Text HLabel 11950 1400 3    20   Input ~ 0
L15
Text Notes 12200 700  0    50   ~ 0
X28
$Comp
L Device:LED D1088
U 1 1 00000440
P 12200 1400
F 0 "D1088" H 12192 1333 20  0000 C CNN
F 1 "LED" H 12192 1333 50  0001 C CNN
F 2 "LED_SMD:LED_0402_1005Metric" H 12200 1400 50  0001 C CNN
F 3 "~" H 12200 1400 50  0001 C CNN
	1    12200 1400
	-1   0    0    1   
$EndComp
Text HLabel 12050 1400 3    20   Input ~ 0
L12
Text HLabel 12350 1400 3    20   Input ~ 0
L1
Text Notes 12600 700  0    50   ~ 0
X29
$Comp
L Device:LED D1089
U 1 1 00000441
P 12600 1400
F 0 "D1089" H 12592 1333 20  0000 C CNN
F 1 "LED" H 12592 1333 50  0001 C CNN
F 2 "LED_SMD:LED_0402_1005Metric" H 12600 1400 50  0001 C CNN
F 3 "~" H 12600 1400 50  0001 C CNN
	1    12600 1400
	-1   0    0    1   
$EndComp
Text HLabel 12450 1400 3    20   Input ~ 0
L12
Text HLabel 12750 1400 3    20   Input ~ 0
L2
Text Notes 700  1600 0    50   ~ 0
Y3
Text Notes 1000 700  0    50   ~ 0
X0
$Comp
L Device:LED D1090
U 1 1 00000442
P 1000 1600
F 0 "D1090" H 992 1533 20  0000 C CNN
F 1 "LED" H 992 1533 50  0001 C CNN
F 2 "LED_SMD:LED_0402_1005Metric" H 1000 1600 50  0001 C CNN
F 3 "~" H 1000 1600 50  0001 C CNN
	1    1000 1600
	-1   0    0    1   
$EndComp
Text HLabel 850  1600 3    20   Input ~ 0
L12
Text HLabel 1150 1600 3    20   Input ~ 0
L4
Text Notes 1400 700  0    50   ~ 0
X1
$Comp
L Device:LED D1091
U 1 1 00000443
P 1400 1600
F 0 "D1091" H 1392 1533 20  0000 C CNN
F 1 "LED" H 1392 1533 50  0001 C CNN
F 2 "LED_SMD:LED_0402_1005Metric" H 1400 1600 50  0001 C CNN
F 3 "~" H 1400 1600 50  0001 C CNN
	1    1400 1600
	-1   0    0    1   
$EndComp
Text HLabel 1250 1600 3    20   Input ~ 0
L12
Text HLabel 1550 1600 3    20   Input ~ 0
L5
Text Notes 1800 700  0    50   ~ 0
X2
$Comp
L Device:LED D1092
U 1 1 00000444
P 1800 1600
F 0 "D1092" H 1792 1533 20  0000 C CNN
F 1 "LED" H 1792 1533 50  0001 C CNN
F 2 "LED_SMD:LED_0402_1005Metric" H 1800 1600 50  0001 C CNN
F 3 "~" H 1800 1600 50  0001 C CNN
	1    1800 1600
	-1   0    0    1   
$EndComp
Text HLabel 1650 1600 3    20   Input ~ 0
L13
Text HLabel 1950 1600 3    20   Input ~ 0
L6
Text Notes 2200 700  0    50   ~ 0
X3
$Comp
L Device:LED D1093
U 1 1 00000445
P 2200 1600
F 0 "D1093" H 2192 1533 20  0000 C CNN
F 1 "LED" H 2192 1533 50  0001 C CNN
F 2 "LED_SMD:LED_0402_1005Metric" H 2200 1600 50  0001 C CNN
F 3 "~" H 2200 1600 50  0001 C CNN
	1    2200 1600
	-1   0    0    1   
$EndComp
Text HLabel 2050 1600 3    20   Input ~ 0
L13
Text HLabel 2350 1600 3    20   Input ~ 0
L7
Text Notes 2600 700  0    50   ~ 0
X4
$Comp
L Device:LED D1094
U 1 1 00000446
P 2600 1600
F 0 "D1094" H 2592 1533 20  0000 C CNN
F 1 "LED" H 2592 1533 50  0001 C CNN
F 2 "LED_SMD:LED_0402_1005Metric" H 2600 1600 50  0001 C CNN
F 3 "~" H 2600 1600 50  0001 C CNN
	1    2600 1600
	-1   0    0    1   
$EndComp
Text HLabel 2450 1600 3    20   Input ~ 0
L14
Text HLabel 2750 1600 3    20   Input ~ 0
L8
Text Notes 3000 700  0    50   ~ 0
X5
$Comp
L Device:LED D1095
U 1 1 00000447
P 3000 1600
F 0 "D1095" H 2992 1533 20  0000 C CNN
F 1 "LED" H 2992 1533 50  0001 C CNN
F 2 "LED_SMD:LED_0402_1005Metric" H 3000 1600 50  0001 C CNN
F 3 "~" H 3000 1600 50  0001 C CNN
	1    3000 1600
	-1   0    0    1   
$EndComp
Text HLabel 2850 1600 3    20   Input ~ 0
L14
Text HLabel 3150 1600 3    20   Input ~ 0
L9
Text Notes 3400 700  0    50   ~ 0
X6
$Comp
L Device:LED D1096
U 1 1 00000448
P 3400 1600
F 0 "D1096" H 3392 1533 20  0000 C CNN
F 1 "LED" H 3392 1533 50  0001 C CNN
F 2 "LED_SMD:LED_0402_1005Metric" H 3400 1600 50  0001 C CNN
F 3 "~" H 3400 1600 50  0001 C CNN
	1    3400 1600
	-1   0    0    1   
$EndComp
Text HLabel 3250 1600 3    20   Input ~ 0
L15
Text HLabel 3550 1600 3    20   Input ~ 0
L10
Text Notes 3800 700  0    50   ~ 0
X7
$Comp
L Device:LED D1097
U 1 1 00000449
P 3800 1600
F 0 "D1097" H 3792 1533 20  0000 C CNN
F 1 "LED" H 3792 1533 50  0001 C CNN
F 2 "LED_SMD:LED_0402_1005Metric" H 3800 1600 50  0001 C CNN
F 3 "~" H 3800 1600 50  0001 C CNN
	1    3800 1600
	-1   0    0    1   
$EndComp
Text HLabel 3650 1600 3    20   Input ~ 0
L15
Text HLabel 3950 1600 3    20   Input ~ 0
L11
Text Notes 4200 700  0    50   ~ 0
X8
$Comp
L Device:LED D1098
U 1 1 0000044A
P 4200 1600
F 0 "D1098" H 4192 1533 20  0000 C CNN
F 1 "LED" H 4192 1533 50  0001 C CNN
F 2 "LED_SMD:LED_0402_1005Metric" H 4200 1600 50  0001 C CNN
F 3 "~" H 4200 1600 50  0001 C CNN
	1    4200 1600
	-1   0    0    1   
$EndComp
Text HLabel 4050 1600 3    20   Input ~ 0
L1
Text HLabel 4350 1600 3    20   Input ~ 0
L12
Text Notes 4600 700  0    50   ~ 0
X9
$Comp
L Device:LED D1099
U 1 1 0000044B
P 4600 1600
F 0 "D1099" H 4592 1533 20  0000 C CNN
F 1 "LED" H 4592 1533 50  0001 C CNN
F 2 "LED_SMD:LED_0402_1005Metric" H 4600 1600 50  0001 C CNN
F 3 "~" H 4600 1600 50  0001 C CNN
	1    4600 1600
	-1   0    0    1   
$EndComp
Text HLabel 4450 1600 3    20   Input ~ 0
L1
Text HLabel 4750 1600 3    20   Input ~ 0
L13
Text Notes 5000 700  0    50   ~ 0
X10
$Comp
L Device:LED D1100
U 1 1 0000044C
P 5000 1600
F 0 "D1100" H 4992 1533 20  0000 C CNN
F 1 "LED" H 4992 1533 50  0001 C CNN
F 2 "LED_SMD:LED_0402_1005Metric" H 5000 1600 50  0001 C CNN
F 3 "~" H 5000 1600 50  0001 C CNN
	1    5000 1600
	-1   0    0    1   
$EndComp
Text HLabel 4850 1600 3    20   Input ~ 0
L2
Text HLabel 5150 1600 3    20   Input ~ 0
L14
Text Notes 5400 700  0    50   ~ 0
X11
$Comp
L Device:LED D1101
U 1 1 0000044D
P 5400 1600
F 0 "D1101" H 5392 1533 20  0000 C CNN
F 1 "LED" H 5392 1533 50  0001 C CNN
F 2 "LED_SMD:LED_0402_1005Metric" H 5400 1600 50  0001 C CNN
F 3 "~" H 5400 1600 50  0001 C CNN
	1    5400 1600
	-1   0    0    1   
$EndComp
Text HLabel 5250 1600 3    20   Input ~ 0
L2
Text HLabel 5550 1600 3    20   Input ~ 0
L15
Text Notes 5800 700  0    50   ~ 0
X12
$Comp
L Device:LED D1102
U 1 1 0000044E
P 5800 1600
F 0 "D1102" H 5792 1533 20  0000 C CNN
F 1 "LED" H 5792 1533 50  0001 C CNN
F 2 "LED_SMD:LED_0402_1005Metric" H 5800 1600 50  0001 C CNN
F 3 "~" H 5800 1600 50  0001 C CNN
	1    5800 1600
	-1   0    0    1   
$EndComp
Text HLabel 5650 1600 3    20   Input ~ 0
L3
Text HLabel 5950 1600 3    20   Input ~ 0
L1
Text Notes 6200 700  0    50   ~ 0
X13
$Comp
L Device:LED D1103
U 1 1 0000044F
P 6200 1600
F 0 "D1103" H 6192 1533 20  0000 C CNN
F 1 "LED" H 6192 1533 50  0001 C CNN
F 2 "LED_SMD:LED_0402_1005Metric" H 6200 1600 50  0001 C CNN
F 3 "~" H 6200 1600 50  0001 C CNN
	1    6200 1600
	-1   0    0    1   
$EndComp
Text HLabel 6050 1600 3    20   Input ~ 0
L3
Text HLabel 6350 1600 3    20   Input ~ 0
L2
Text Notes 6600 700  0    50   ~ 0
X14
$Comp
L Device:LED D1104
U 1 1 00000450
P 6600 1600
F 0 "D1104" H 6592 1533 20  0000 C CNN
F 1 "LED" H 6592 1533 50  0001 C CNN
F 2 "LED_SMD:LED_0402_1005Metric" H 6600 1600 50  0001 C CNN
F 3 "~" H 6600 1600 50  0001 C CNN
	1    6600 1600
	-1   0    0    1   
$EndComp
Text HLabel 6450 1600 3    20   Input ~ 0
L4
Text HLabel 6750 1600 3    20   Input ~ 0
L3
Text Notes 7000 700  0    50   ~ 0
X15
$Comp
L Device:LED D1105
U 1 1 00000451
P 7000 1600
F 0 "D1105" H 6992 1533 20  0000 C CNN
F 1 "LED" H 6992 1533 50  0001 C CNN
F 2 "LED_SMD:LED_0402_1005Metric" H 7000 1600 50  0001 C CNN
F 3 "~" H 7000 1600 50  0001 C CNN
	1    7000 1600
	-1   0    0    1   
$EndComp
Text HLabel 6850 1600 3    20   Input ~ 0
L4
Text HLabel 7150 1600 3    20   Input ~ 0
L4
Text Notes 7400 700  0    50   ~ 0
X16
$Comp
L Device:LED D1106
U 1 1 00000452
P 7400 1600
F 0 "D1106" H 7392 1533 20  0000 C CNN
F 1 "LED" H 7392 1533 50  0001 C CNN
F 2 "LED_SMD:LED_0402_1005Metric" H 7400 1600 50  0001 C CNN
F 3 "~" H 7400 1600 50  0001 C CNN
	1    7400 1600
	-1   0    0    1   
$EndComp
Text HLabel 7250 1600 3    20   Input ~ 0
L5
Text HLabel 7550 1600 3    20   Input ~ 0
L5
Text Notes 7800 700  0    50   ~ 0
X17
$Comp
L Device:LED D1107
U 1 1 00000453
P 7800 1600
F 0 "D1107" H 7792 1533 20  0000 C CNN
F 1 "LED" H 7792 1533 50  0001 C CNN
F 2 "LED_SMD:LED_0402_1005Metric" H 7800 1600 50  0001 C CNN
F 3 "~" H 7800 1600 50  0001 C CNN
	1    7800 1600
	-1   0    0    1   
$EndComp
Text HLabel 7650 1600 3    20   Input ~ 0
L5
Text HLabel 7950 1600 3    20   Input ~ 0
L6
Text Notes 8200 700  0    50   ~ 0
X18
$Comp
L Device:LED D1108
U 1 1 00000454
P 8200 1600
F 0 "D1108" H 8192 1533 20  0000 C CNN
F 1 "LED" H 8192 1533 50  0001 C CNN
F 2 "LED_SMD:LED_0402_1005Metric" H 8200 1600 50  0001 C CNN
F 3 "~" H 8200 1600 50  0001 C CNN
	1    8200 1600
	-1   0    0    1   
$EndComp
Text HLabel 8050 1600 3    20   Input ~ 0
L6
Text HLabel 8350 1600 3    20   Input ~ 0
L7
Text Notes 8600 700  0    50   ~ 0
X19
$Comp
L Device:LED D1109
U 1 1 00000455
P 8600 1600
F 0 "D1109" H 8592 1533 20  0000 C CNN
F 1 "LED" H 8592 1533 50  0001 C CNN
F 2 "LED_SMD:LED_0402_1005Metric" H 8600 1600 50  0001 C CNN
F 3 "~" H 8600 1600 50  0001 C CNN
	1    8600 1600
	-1   0    0    1   
$EndComp
Text HLabel 8450 1600 3    20   Input ~ 0
L6
Text HLabel 8750 1600 3    20   Input ~ 0
L8
Text Notes 9000 700  0    50   ~ 0
X20
$Comp
L Device:LED D1110
U 1 1 00000456
P 9000 1600
F 0 "D1110" H 8992 1533 20  0000 C CNN
F 1 "LED" H 8992 1533 50  0001 C CNN
F 2 "LED_SMD:LED_0402_1005Metric" H 9000 1600 50  0001 C CNN
F 3 "~" H 9000 1600 50  0001 C CNN
	1    9000 1600
	-1   0    0    1   
$EndComp
Text HLabel 8850 1600 3    20   Input ~ 0
L7
Text HLabel 9150 1600 3    20   Input ~ 0
L9
Text Notes 9400 700  0    50   ~ 0
X21
$Comp
L Device:LED D1111
U 1 1 00000457
P 9400 1600
F 0 "D1111" H 9392 1533 20  0000 C CNN
F 1 "LED" H 9392 1533 50  0001 C CNN
F 2 "LED_SMD:LED_0402_1005Metric" H 9400 1600 50  0001 C CNN
F 3 "~" H 9400 1600 50  0001 C CNN
	1    9400 1600
	-1   0    0    1   
$EndComp
Text HLabel 9250 1600 3    20   Input ~ 0
L7
Text HLabel 9550 1600 3    20   Input ~ 0
L10
Text Notes 9800 700  0    50   ~ 0
X22
$Comp
L Device:LED D1112
U 1 1 00000458
P 9800 1600
F 0 "D1112" H 9792 1533 20  0000 C CNN
F 1 "LED" H 9792 1533 50  0001 C CNN
F 2 "LED_SMD:LED_0402_1005Metric" H 9800 1600 50  0001 C CNN
F 3 "~" H 9800 1600 50  0001 C CNN
	1    9800 1600
	-1   0    0    1   
$EndComp
Text HLabel 9650 1600 3    20   Input ~ 0
L8
Text HLabel 9950 1600 3    20   Input ~ 0
L11
Text Notes 10200 700  0    50   ~ 0
X23
$Comp
L Device:LED D1113
U 1 1 00000459
P 10200 1600
F 0 "D1113" H 10192 1533 20  0000 C CNN
F 1 "LED" H 10192 1533 50  0001 C CNN
F 2 "LED_SMD:LED_0402_1005Metric" H 10200 1600 50  0001 C CNN
F 3 "~" H 10200 1600 50  0001 C CNN
	1    10200 1600
	-1   0    0    1   
$EndComp
Text HLabel 10050 1600 3    20   Input ~ 0
L8
Text HLabel 10350 1600 3    20   Input ~ 0
L12
Text Notes 10600 700  0    50   ~ 0
X24
$Comp
L Device:LED D1114
U 1 1 0000045A
P 10600 1600
F 0 "D1114" H 10592 1533 20  0000 C CNN
F 1 "LED" H 10592 1533 50  0001 C CNN
F 2 "LED_SMD:LED_0402_1005Metric" H 10600 1600 50  0001 C CNN
F 3 "~" H 10600 1600 50  0001 C CNN
	1    10600 1600
	-1   0    0    1   
$EndComp
Text HLabel 10450 1600 3    20   Input ~ 0
L9
Text HLabel 10750 1600 3    20   Input ~ 0
L13
Text Notes 11000 700  0    50   ~ 0
X25
$Comp
L Device:LED D1115
U 1 1 0000045B
P 11000 1600
F 0 "D1115" H 10992 1533 20  0000 C CNN
F 1 "LED" H 10992 1533 50  0001 C CNN
F 2 "LED_SMD:LED_0402_1005Metric" H 11000 1600 50  0001 C CNN
F 3 "~" H 11000 1600 50  0001 C CNN
	1    11000 1600
	-1   0    0    1   
$EndComp
Text HLabel 10850 1600 3    20   Input ~ 0
L9
Text HLabel 11150 1600 3    20   Input ~ 0
L14
Text Notes 11400 700  0    50   ~ 0
X26
$Comp
L Device:LED D1116
U 1 1 0000045C
P 11400 1600
F 0 "D1116" H 11392 1533 20  0000 C CNN
F 1 "LED" H 11392 1533 50  0001 C CNN
F 2 "LED_SMD:LED_0402_1005Metric" H 11400 1600 50  0001 C CNN
F 3 "~" H 11400 1600 50  0001 C CNN
	1    11400 1600
	-1   0    0    1   
$EndComp
Text HLabel 11250 1600 3    20   Input ~ 0
L10
Text HLabel 11550 1600 3    20   Input ~ 0
L15
Text Notes 11800 700  0    50   ~ 0
X27
$Comp
L Device:LED D1117
U 1 1 0000045D
P 11800 1600
F 0 "D1117" H 11792 1533 20  0000 C CNN
F 1 "LED" H 11792 1533 50  0001 C CNN
F 2 "LED_SMD:LED_0402_1005Metric" H 11800 1600 50  0001 C CNN
F 3 "~" H 11800 1600 50  0001 C CNN
	1    11800 1600
	-1   0    0    1   
$EndComp
Text HLabel 11650 1600 3    20   Input ~ 0
L10
Text HLabel 11950 1600 3    20   Input ~ 0
L1
Text Notes 12200 700  0    50   ~ 0
X28
$Comp
L Device:LED D1118
U 1 1 0000045E
P 12200 1600
F 0 "D1118" H 12192 1533 20  0000 C CNN
F 1 "LED" H 12192 1533 50  0001 C CNN
F 2 "LED_SMD:LED_0402_1005Metric" H 12200 1600 50  0001 C CNN
F 3 "~" H 12200 1600 50  0001 C CNN
	1    12200 1600
	-1   0    0    1   
$EndComp
Text HLabel 12050 1600 3    20   Input ~ 0
L11
Text HLabel 12350 1600 3    20   Input ~ 0
L2
Text Notes 12600 700  0    50   ~ 0
X29
$Comp
L Device:LED D1119
U 1 1 0000045F
P 12600 1600
F 0 "D1119" H 12592 1533 20  0000 C CNN
F 1 "LED" H 12592 1533 50  0001 C CNN
F 2 "LED_SMD:LED_0402_1005Metric" H 12600 1600 50  0001 C CNN
F 3 "~" H 12600 1600 50  0001 C CNN
	1    12600 1600
	-1   0    0    1   
$EndComp
Text HLabel 12450 1600 3    20   Input ~ 0
L11
Text HLabel 12750 1600 3    20   Input ~ 0
L3
Text Notes 700  1800 0    50   ~ 0
Y4
Text Notes 1000 700  0    50   ~ 0
X0
$Comp
L Device:LED D1120
U 1 1 00000460
P 1000 1800
F 0 "D1120" H 992 1733 20  0000 C CNN
F 1 "LED" H 992 1733 50  0001 C CNN
F 2 "LED_SMD:LED_0402_1005Metric" H 1000 1800 50  0001 C CNN
F 3 "~" H 1000 1800 50  0001 C CNN
	1    1000 1800
	-1   0    0    1   
$EndComp
Text HLabel 850  1800 3    20   Input ~ 0
L11
Text HLabel 1150 1800 3    20   Input ~ 0
L5
Text Notes 1400 700  0    50   ~ 0
X1
$Comp
L Device:LED D1121
U 1 1 00000461
P 1400 1800
F 0 "D1121" H 1392 1733 20  0000 C CNN
F 1 "LED" H 1392 1733 50  0001 C CNN
F 2 "LED_SMD:LED_0402_1005Metric" H 1400 1800 50  0001 C CNN
F 3 "~" H 1400 1800 50  0001 C CNN
	1    1400 1800
	-1   0    0    1   
$EndComp
Text HLabel 1250 1800 3    20   Input ~ 0
L11
Text HLabel 1550 1800 3    20   Input ~ 0
L6
Text Notes 1800 700  0    50   ~ 0
X2
$Comp
L Device:LED D1122
U 1 1 00000462
P 1800 1800
F 0 "D1122" H 1792 1733 20  0000 C CNN
F 1 "LED" H 1792 1733 50  0001 C CNN
F 2 "LED_SMD:LED_0402_1005Metric" H 1800 1800 50  0001 C CNN
F 3 "~" H 1800 1800 50  0001 C CNN
	1    1800 1800
	-1   0    0    1   
$EndComp
Text HLabel 1650 1800 3    20   Input ~ 0
L12
Text HLabel 1950 1800 3    20   Input ~ 0
L7
Text Notes 2200 700  0    50   ~ 0
X3
$Comp
L Device:LED D1123
U 1 1 00000463
P 2200 1800
F 0 "D1123" H 2192 1733 20  0000 C CNN
F 1 "LED" H 2192 1733 50  0001 C CNN
F 2 "LED_SMD:LED_0402_1005Metric" H 2200 1800 50  0001 C CNN
F 3 "~" H 2200 1800 50  0001 C CNN
	1    2200 1800
	-1   0    0    1   
$EndComp
Text HLabel 2050 1800 3    20   Input ~ 0
L12
Text HLabel 2350 1800 3    20   Input ~ 0
L8
Text Notes 2600 700  0    50   ~ 0
X4
$Comp
L Device:LED D1124
U 1 1 00000464
P 2600 1800
F 0 "D1124" H 2592 1733 20  0000 C CNN
F 1 "LED" H 2592 1733 50  0001 C CNN
F 2 "LED_SMD:LED_0402_1005Metric" H 2600 1800 50  0001 C CNN
F 3 "~" H 2600 1800 50  0001 C CNN
	1    2600 1800
	-1   0    0    1   
$EndComp
Text HLabel 2450 1800 3    20   Input ~ 0
L13
Text HLabel 2750 1800 3    20   Input ~ 0
L9
Text Notes 3000 700  0    50   ~ 0
X5
$Comp
L Device:LED D1125
U 1 1 00000465
P 3000 1800
F 0 "D1125" H 2992 1733 20  0000 C CNN
F 1 "LED" H 2992 1733 50  0001 C CNN
F 2 "LED_SMD:LED_0402_1005Metric" H 3000 1800 50  0001 C CNN
F 3 "~" H 3000 1800 50  0001 C CNN
	1    3000 1800
	-1   0    0    1   
$EndComp
Text HLabel 2850 1800 3    20   Input ~ 0
L13
Text HLabel 3150 1800 3    20   Input ~ 0
L10
Text Notes 3400 700  0    50   ~ 0
X6
$Comp
L Device:LED D1126
U 1 1 00000466
P 3400 1800
F 0 "D1126" H 3392 1733 20  0000 C CNN
F 1 "LED" H 3392 1733 50  0001 C CNN
F 2 "LED_SMD:LED_0402_1005Metric" H 3400 1800 50  0001 C CNN
F 3 "~" H 3400 1800 50  0001 C CNN
	1    3400 1800
	-1   0    0    1   
$EndComp
Text HLabel 3250 1800 3    20   Input ~ 0
L14
Text HLabel 3550 1800 3    20   Input ~ 0
L11
Text Notes 3800 700  0    50   ~ 0
X7
$Comp
L Device:LED D1127
U 1 1 00000467
P 3800 1800
F 0 "D1127" H 3792 1733 20  0000 C CNN
F 1 "LED" H 3792 1733 50  0001 C CNN
F 2 "LED_SMD:LED_0402_1005Metric" H 3800 1800 50  0001 C CNN
F 3 "~" H 3800 1800 50  0001 C CNN
	1    3800 1800
	-1   0    0    1   
$EndComp
Text HLabel 3650 1800 3    20   Input ~ 0
L14
Text HLabel 3950 1800 3    20   Input ~ 0
L12
Text Notes 4200 700  0    50   ~ 0
X8
$Comp
L Device:LED D1128
U 1 1 00000468
P 4200 1800
F 0 "D1128" H 4192 1733 20  0000 C CNN
F 1 "LED" H 4192 1733 50  0001 C CNN
F 2 "LED_SMD:LED_0402_1005Metric" H 4200 1800 50  0001 C CNN
F 3 "~" H 4200 1800 50  0001 C CNN
	1    4200 1800
	-1   0    0    1   
$EndComp
Text HLabel 4050 1800 3    20   Input ~ 0
L15
Text HLabel 4350 1800 3    20   Input ~ 0
L13
Text Notes 4600 700  0    50   ~ 0
X9
$Comp
L Device:LED D1129
U 1 1 00000469
P 4600 1800
F 0 "D1129" H 4592 1733 20  0000 C CNN
F 1 "LED" H 4592 1733 50  0001 C CNN
F 2 "LED_SMD:LED_0402_1005Metric" H 4600 1800 50  0001 C CNN
F 3 "~" H 4600 1800 50  0001 C CNN
	1    4600 1800
	-1   0    0    1   
$EndComp
Text HLabel 4450 1800 3    20   Input ~ 0
L15
Text HLabel 4750 1800 3    20   Input ~ 0
L14
Text Notes 5000 700  0    50   ~ 0
X10
$Comp
L Device:LED D1130
U 1 1 0000046A
P 5000 1800
F 0 "D1130" H 4992 1733 20  0000 C CNN
F 1 "LED" H 4992 1733 50  0001 C CNN
F 2 "LED_SMD:LED_0402_1005Metric" H 5000 1800 50  0001 C CNN
F 3 "~" H 5000 1800 50  0001 C CNN
	1    5000 1800
	-1   0    0    1   
$EndComp
Text HLabel 4850 1800 3    20   Input ~ 0
L1
Text HLabel 5150 1800 3    20   Input ~ 0
L15
Text Notes 5400 700  0    50   ~ 0
X11
$Comp
L Device:LED D1131
U 1 1 0000046B
P 5400 1800
F 0 "D1131" H 5392 1733 20  0000 C CNN
F 1 "LED" H 5392 1733 50  0001 C CNN
F 2 "LED_SMD:LED_0402_1005Metric" H 5400 1800 50  0001 C CNN
F 3 "~" H 5400 1800 50  0001 C CNN
	1    5400 1800
	-1   0    0    1   
$EndComp
Text HLabel 5250 1800 3    20   Input ~ 0
L1
Text HLabel 5550 1800 3    20   Input ~ 0
L1
Text Notes 5800 700  0    50   ~ 0
X12
$Comp
L Device:LED D1132
U 1 1 0000046C
P 5800 1800
F 0 "D1132" H 5792 1733 20  0000 C CNN
F 1 "LED" H 5792 1733 50  0001 C CNN
F 2 "LED_SMD:LED_0402_1005Metric" H 5800 1800 50  0001 C CNN
F 3 "~" H 5800 1800 50  0001 C CNN
	1    5800 1800
	-1   0    0    1   
$EndComp
Text HLabel 5650 1800 3    20   Input ~ 0
L2
Text HLabel 5950 1800 3    20   Input ~ 0
L2
Text Notes 6200 700  0    50   ~ 0
X13
$Comp
L Device:LED D1133
U 1 1 0000046D
P 6200 1800
F 0 "D1133" H 6192 1733 20  0000 C CNN
F 1 "LED" H 6192 1733 50  0001 C CNN
F 2 "LED_SMD:LED_0402_1005Metric" H 6200 1800 50  0001 C CNN
F 3 "~" H 6200 1800 50  0001 C CNN
	1    6200 1800
	-1   0    0    1   
$EndComp
Text HLabel 6050 1800 3    20   Input ~ 0
L2
Text HLabel 6350 1800 3    20   Input ~ 0
L3
Text Notes 6600 700  0    50   ~ 0
X14
$Comp
L Device:LED D1134
U 1 1 0000046E
P 6600 1800
F 0 "D1134" H 6592 1733 20  0000 C CNN
F 1 "LED" H 6592 1733 50  0001 C CNN
F 2 "LED_SMD:LED_0402_1005Metric" H 6600 1800 50  0001 C CNN
F 3 "~" H 6600 1800 50  0001 C CNN
	1    6600 1800
	-1   0    0    1   
$EndComp
Text HLabel 6450 1800 3    20   Input ~ 0
L3
Text HLabel 6750 1800 3    20   Input ~ 0
L4
Text Notes 7000 700  0    50   ~ 0
X15
$Comp
L Device:LED D1135
U 1 1 0000046F
P 7000 1800
F 0 "D1135" H 6992 1733 20  0000 C CNN
F 1 "LED" H 6992 1733 50  0001 C CNN
F 2 "LED_SMD:LED_0402_1005Metric" H 7000 1800 50  0001 C CNN
F 3 "~" H 7000 1800 50  0001 C CNN
	1    7000 1800
	-1   0    0    1   
$EndComp
Text HLabel 6850 1800 3    20   Input ~ 0
L3
Text HLabel 7150 1800 3    20   Input ~ 0
L5
Text Notes 7400 700  0    50   ~ 0
X16
$Comp
L Device:LED D1136
U 1 1 00000470
P 7400 1800
F 0 "D1136" H 7392 1733 20  0000 C CNN
F 1 "LED" H 7392 1733 50  0001 C CNN
F 2 "LED_SMD:LED_0402_1005Metric" H 7400 1800 50  0001 C CNN
F 3 "~" H 7400 1800 50  0001 C CNN
	1    7400 1800
	-1   0    0    1   
$EndComp
Text HLabel 7250 1800 3    20   Input ~ 0
L4
Text HLabel 7550 1800 3    20   Input ~ 0
L6
Text Notes 7800 700  0    50   ~ 0
X17
$Comp
L Device:LED D1137
U 1 1 00000471
P 7800 1800
F 0 "D1137" H 7792 1733 20  0000 C CNN
F 1 "LED" H 7792 1733 50  0001 C CNN
F 2 "LED_SMD:LED_0402_1005Metric" H 7800 1800 50  0001 C CNN
F 3 "~" H 7800 1800 50  0001 C CNN
	1    7800 1800
	-1   0    0    1   
$EndComp
Text HLabel 7650 1800 3    20   Input ~ 0
L4
Text HLabel 7950 1800 3    20   Input ~ 0
L7
Text Notes 8200 700  0    50   ~ 0
X18
$Comp
L Device:LED D1138
U 1 1 00000472
P 8200 1800
F 0 "D1138" H 8192 1733 20  0000 C CNN
F 1 "LED" H 8192 1733 50  0001 C CNN
F 2 "LED_SMD:LED_0402_1005Metric" H 8200 1800 50  0001 C CNN
F 3 "~" H 8200 1800 50  0001 C CNN
	1    8200 1800
	-1   0    0    1   
$EndComp
Text HLabel 8050 1800 3    20   Input ~ 0
L5
Text HLabel 8350 1800 3    20   Input ~ 0
L8
Text Notes 8600 700  0    50   ~ 0
X19
$Comp
L Device:LED D1139
U 1 1 00000473
P 8600 1800
F 0 "D1139" H 8592 1733 20  0000 C CNN
F 1 "LED" H 8592 1733 50  0001 C CNN
F 2 "LED_SMD:LED_0402_1005Metric" H 8600 1800 50  0001 C CNN
F 3 "~" H 8600 1800 50  0001 C CNN
	1    8600 1800
	-1   0    0    1   
$EndComp
Text HLabel 8450 1800 3    20   Input ~ 0
L5
Text HLabel 8750 1800 3    20   Input ~ 0
L9
Text Notes 9000 700  0    50   ~ 0
X20
$Comp
L Device:LED D1140
U 1 1 00000474
P 9000 1800
F 0 "D1140" H 8992 1733 20  0000 C CNN
F 1 "LED" H 8992 1733 50  0001 C CNN
F 2 "LED_SMD:LED_0402_1005Metric" H 9000 1800 50  0001 C CNN
F 3 "~" H 9000 1800 50  0001 C CNN
	1    9000 1800
	-1   0    0    1   
$EndComp
Text HLabel 8850 1800 3    20   Input ~ 0
L6
Text HLabel 9150 1800 3    20   Input ~ 0
L10
Text Notes 9400 700  0    50   ~ 0
X21
$Comp
L Device:LED D1141
U 1 1 00000475
P 9400 1800
F 0 "D1141" H 9392 1733 20  0000 C CNN
F 1 "LED" H 9392 1733 50  0001 C CNN
F 2 "LED_SMD:LED_0402_1005Metric" H 9400 1800 50  0001 C CNN
F 3 "~" H 9400 1800 50  0001 C CNN
	1    9400 1800
	-1   0    0    1   
$EndComp
Text HLabel 9250 1800 3    20   Input ~ 0
L6
Text HLabel 9550 1800 3    20   Input ~ 0
L11
Text Notes 9800 700  0    50   ~ 0
X22
$Comp
L Device:LED D1142
U 1 1 00000476
P 9800 1800
F 0 "D1142" H 9792 1733 20  0000 C CNN
F 1 "LED" H 9792 1733 50  0001 C CNN
F 2 "LED_SMD:LED_0402_1005Metric" H 9800 1800 50  0001 C CNN
F 3 "~" H 9800 1800 50  0001 C CNN
	1    9800 1800
	-1   0    0    1   
$EndComp
Text HLabel 9650 1800 3    20   Input ~ 0
L7
Text HLabel 9950 1800 3    20   Input ~ 0
L12
Text Notes 10200 700  0    50   ~ 0
X23
$Comp
L Device:LED D1143
U 1 1 00000477
P 10200 1800
F 0 "D1143" H 10192 1733 20  0000 C CNN
F 1 "LED" H 10192 1733 50  0001 C CNN
F 2 "LED_SMD:LED_0402_1005Metric" H 10200 1800 50  0001 C CNN
F 3 "~" H 10200 1800 50  0001 C CNN
	1    10200 1800
	-1   0    0    1   
$EndComp
Text HLabel 10050 1800 3    20   Input ~ 0
L7
Text HLabel 10350 1800 3    20   Input ~ 0
L13
Text Notes 10600 700  0    50   ~ 0
X24
$Comp
L Device:LED D1144
U 1 1 00000478
P 10600 1800
F 0 "D1144" H 10592 1733 20  0000 C CNN
F 1 "LED" H 10592 1733 50  0001 C CNN
F 2 "LED_SMD:LED_0402_1005Metric" H 10600 1800 50  0001 C CNN
F 3 "~" H 10600 1800 50  0001 C CNN
	1    10600 1800
	-1   0    0    1   
$EndComp
Text HLabel 10450 1800 3    20   Input ~ 0
L8
Text HLabel 10750 1800 3    20   Input ~ 0
L14
Text Notes 11000 700  0    50   ~ 0
X25
$Comp
L Device:LED D1145
U 1 1 00000479
P 11000 1800
F 0 "D1145" H 10992 1733 20  0000 C CNN
F 1 "LED" H 10992 1733 50  0001 C CNN
F 2 "LED_SMD:LED_0402_1005Metric" H 11000 1800 50  0001 C CNN
F 3 "~" H 11000 1800 50  0001 C CNN
	1    11000 1800
	-1   0    0    1   
$EndComp
Text HLabel 10850 1800 3    20   Input ~ 0
L8
Text HLabel 11150 1800 3    20   Input ~ 0
L15
Text Notes 11400 700  0    50   ~ 0
X26
$Comp
L Device:LED D1146
U 1 1 0000047A
P 11400 1800
F 0 "D1146" H 11392 1733 20  0000 C CNN
F 1 "LED" H 11392 1733 50  0001 C CNN
F 2 "LED_SMD:LED_0402_1005Metric" H 11400 1800 50  0001 C CNN
F 3 "~" H 11400 1800 50  0001 C CNN
	1    11400 1800
	-1   0    0    1   
$EndComp
Text HLabel 11250 1800 3    20   Input ~ 0
L9
Text HLabel 11550 1800 3    20   Input ~ 0
L1
Text Notes 11800 700  0    50   ~ 0
X27
$Comp
L Device:LED D1147
U 1 1 0000047B
P 11800 1800
F 0 "D1147" H 11792 1733 20  0000 C CNN
F 1 "LED" H 11792 1733 50  0001 C CNN
F 2 "LED_SMD:LED_0402_1005Metric" H 11800 1800 50  0001 C CNN
F 3 "~" H 11800 1800 50  0001 C CNN
	1    11800 1800
	-1   0    0    1   
$EndComp
Text HLabel 11650 1800 3    20   Input ~ 0
L9
Text HLabel 11950 1800 3    20   Input ~ 0
L2
Text Notes 12200 700  0    50   ~ 0
X28
$Comp
L Device:LED D1148
U 1 1 0000047C
P 12200 1800
F 0 "D1148" H 12192 1733 20  0000 C CNN
F 1 "LED" H 12192 1733 50  0001 C CNN
F 2 "LED_SMD:LED_0402_1005Metric" H 12200 1800 50  0001 C CNN
F 3 "~" H 12200 1800 50  0001 C CNN
	1    12200 1800
	-1   0    0    1   
$EndComp
Text HLabel 12050 1800 3    20   Input ~ 0
L10
Text HLabel 12350 1800 3    20   Input ~ 0
L3
Text Notes 12600 700  0    50   ~ 0
X29
$Comp
L Device:LED D1149
U 1 1 0000047D
P 12600 1800
F 0 "D1149" H 12592 1733 20  0000 C CNN
F 1 "LED" H 12592 1733 50  0001 C CNN
F 2 "LED_SMD:LED_0402_1005Metric" H 12600 1800 50  0001 C CNN
F 3 "~" H 12600 1800 50  0001 C CNN
	1    12600 1800
	-1   0    0    1   
$EndComp
Text HLabel 12450 1800 3    20   Input ~ 0
L10
Text HLabel 12750 1800 3    20   Input ~ 0
L4
Text Notes 700  2000 0    50   ~ 0
Y5
Text Notes 1000 700  0    50   ~ 0
X0
$Comp
L Device:LED D1150
U 1 1 0000047E
P 1000 2000
F 0 "D1150" H 992 1933 20  0000 C CNN
F 1 "LED" H 992 1933 50  0001 C CNN
F 2 "LED_SMD:LED_0402_1005Metric" H 1000 2000 50  0001 C CNN
F 3 "~" H 1000 2000 50  0001 C CNN
	1    1000 2000
	-1   0    0    1   
$EndComp
Text HLabel 850  2000 3    20   Input ~ 0
L10
Text HLabel 1150 2000 3    20   Input ~ 0
L6
Text Notes 1400 700  0    50   ~ 0
X1
$Comp
L Device:LED D1151
U 1 1 0000047F
P 1400 2000
F 0 "D1151" H 1392 1933 20  0000 C CNN
F 1 "LED" H 1392 1933 50  0001 C CNN
F 2 "LED_SMD:LED_0402_1005Metric" H 1400 2000 50  0001 C CNN
F 3 "~" H 1400 2000 50  0001 C CNN
	1    1400 2000
	-1   0    0    1   
$EndComp
Text HLabel 1250 2000 3    20   Input ~ 0
L10
Text HLabel 1550 2000 3    20   Input ~ 0
L7
Text Notes 1800 700  0    50   ~ 0
X2
$Comp
L Device:LED D1152
U 1 1 00000480
P 1800 2000
F 0 "D1152" H 1792 1933 20  0000 C CNN
F 1 "LED" H 1792 1933 50  0001 C CNN
F 2 "LED_SMD:LED_0402_1005Metric" H 1800 2000 50  0001 C CNN
F 3 "~" H 1800 2000 50  0001 C CNN
	1    1800 2000
	-1   0    0    1   
$EndComp
Text HLabel 1650 2000 3    20   Input ~ 0
L11
Text HLabel 1950 2000 3    20   Input ~ 0
L8
Text Notes 2200 700  0    50   ~ 0
X3
$Comp
L Device:LED D1153
U 1 1 00000481
P 2200 2000
F 0 "D1153" H 2192 1933 20  0000 C CNN
F 1 "LED" H 2192 1933 50  0001 C CNN
F 2 "LED_SMD:LED_0402_1005Metric" H 2200 2000 50  0001 C CNN
F 3 "~" H 2200 2000 50  0001 C CNN
	1    2200 2000
	-1   0    0    1   
$EndComp
Text HLabel 2050 2000 3    20   Input ~ 0
L11
Text HLabel 2350 2000 3    20   Input ~ 0
L9
Text Notes 2600 700  0    50   ~ 0
X4
$Comp
L Device:LED D1154
U 1 1 00000482
P 2600 2000
F 0 "D1154" H 2592 1933 20  0000 C CNN
F 1 "LED" H 2592 1933 50  0001 C CNN
F 2 "LED_SMD:LED_0402_1005Metric" H 2600 2000 50  0001 C CNN
F 3 "~" H 2600 2000 50  0001 C CNN
	1    2600 2000
	-1   0    0    1   
$EndComp
Text HLabel 2450 2000 3    20   Input ~ 0
L12
Text HLabel 2750 2000 3    20   Input ~ 0
L10
Text Notes 3000 700  0    50   ~ 0
X5
$Comp
L Device:LED D1155
U 1 1 00000483
P 3000 2000
F 0 "D1155" H 2992 1933 20  0000 C CNN
F 1 "LED" H 2992 1933 50  0001 C CNN
F 2 "LED_SMD:LED_0402_1005Metric" H 3000 2000 50  0001 C CNN
F 3 "~" H 3000 2000 50  0001 C CNN
	1    3000 2000
	-1   0    0    1   
$EndComp
Text HLabel 2850 2000 3    20   Input ~ 0
L12
Text HLabel 3150 2000 3    20   Input ~ 0
L11
Text Notes 3400 700  0    50   ~ 0
X6
$Comp
L Device:LED D1156
U 1 1 00000484
P 3400 2000
F 0 "D1156" H 3392 1933 20  0000 C CNN
F 1 "LED" H 3392 1933 50  0001 C CNN
F 2 "LED_SMD:LED_0402_1005Metric" H 3400 2000 50  0001 C CNN
F 3 "~" H 3400 2000 50  0001 C CNN
	1    3400 2000
	-1   0    0    1   
$EndComp
Text HLabel 3250 2000 3    20   Input ~ 0
L13
Text HLabel 3550 2000 3    20   Input ~ 0
L12
Text Notes 3800 700  0    50   ~ 0
X7
$Comp
L Device:LED D1157
U 1 1 00000485
P 3800 2000
F 0 "D1157" H 3792 1933 20  0000 C CNN
F 1 "LED" H 3792 1933 50  0001 C CNN
F 2 "LED_SMD:LED_0402_1005Metric" H 3800 2000 50  0001 C CNN
F 3 "~" H 3800 2000 50  0001 C CNN
	1    3800 2000
	-1   0    0    1   
$EndComp
Text HLabel 3650 2000 3    20   Input ~ 0
L13
Text HLabel 3950 2000 3    20   Input ~ 0
L13
Text Notes 4200 700  0    50   ~ 0
X8
$Comp
L Device:LED D1158
U 1 1 00000486
P 4200 2000
F 0 "D1158" H 4192 1933 20  0000 C CNN
F 1 "LED" H 4192 1933 50  0001 C CNN
F 2 "LED_SMD:LED_0402_1005Metric" H 4200 2000 50  0001 C CNN
F 3 "~" H 4200 2000 50  0001 C CNN
	1    4200 2000
	-1   0    0    1   
$EndComp
Text HLabel 4050 2000 3    20   Input ~ 0
L14
Text HLabel 4350 2000 3    20   Input ~ 0
L14
Text Notes 4600 700  0    50   ~ 0
X9
$Comp
L Device:LED D1159
U 1 1 00000487
P 4600 2000
F 0 "D1159" H 4592 1933 20  0000 C CNN
F 1 "LED" H 4592 1933 50  0001 C CNN
F 2 "LED_SMD:LED_0402_1005Metric" H 4600 2000 50  0001 C CNN
F 3 "~" H 4600 2000 50  0001 C CNN
	1    4600 2000
	-1   0    0    1   
$EndComp
Text HLabel 4450 2000 3    20   Input ~ 0
L14
Text HLabel 4750 2000 3    20   Input ~ 0
L15
Text Notes 5000 700  0    50   ~ 0
X10
$Comp
L Device:LED D1160
U 1 1 00000488
P 5000 2000
F 0 "D1160" H 4992 1933 20  0000 C CNN
F 1 "LED" H 4992 1933 50  0001 C CNN
F 2 "LED_SMD:LED_0402_1005Metric" H 5000 2000 50  0001 C CNN
F 3 "~" H 5000 2000 50  0001 C CNN
	1    5000 2000
	-1   0    0    1   
$EndComp
Text HLabel 4850 2000 3    20   Input ~ 0
L15
Text HLabel 5150 2000 3    20   Input ~ 0
L1
Text Notes 5400 700  0    50   ~ 0
X11
$Comp
L Device:LED D1161
U 1 1 00000489
P 5400 2000
F 0 "D1161" H 5392 1933 20  0000 C CNN
F 1 "LED" H 5392 1933 50  0001 C CNN
F 2 "LED_SMD:LED_0402_1005Metric" H 5400 2000 50  0001 C CNN
F 3 "~" H 5400 2000 50  0001 C CNN
	1    5400 2000
	-1   0    0    1   
$EndComp
Text HLabel 5250 2000 3    20   Input ~ 0
L15
Text HLabel 5550 2000 3    20   Input ~ 0
L2
Text Notes 5800 700  0    50   ~ 0
X12
$Comp
L Device:LED D1162
U 1 1 0000048A
P 5800 2000
F 0 "D1162" H 5792 1933 20  0000 C CNN
F 1 "LED" H 5792 1933 50  0001 C CNN
F 2 "LED_SMD:LED_0402_1005Metric" H 5800 2000 50  0001 C CNN
F 3 "~" H 5800 2000 50  0001 C CNN
	1    5800 2000
	-1   0    0    1   
$EndComp
Text HLabel 5650 2000 3    20   Input ~ 0
L1
Text HLabel 5950 2000 3    20   Input ~ 0
L3
Text Notes 6200 700  0    50   ~ 0
X13
$Comp
L Device:LED D1163
U 1 1 0000048B
P 6200 2000
F 0 "D1163" H 6192 1933 20  0000 C CNN
F 1 "LED" H 6192 1933 50  0001 C CNN
F 2 "LED_SMD:LED_0402_1005Metric" H 6200 2000 50  0001 C CNN
F 3 "~" H 6200 2000 50  0001 C CNN
	1    6200 2000
	-1   0    0    1   
$EndComp
Text HLabel 6050 2000 3    20   Input ~ 0
L1
Text HLabel 6350 2000 3    20   Input ~ 0
L4
Text Notes 6600 700  0    50   ~ 0
X14
$Comp
L Device:LED D1164
U 1 1 0000048C
P 6600 2000
F 0 "D1164" H 6592 1933 20  0000 C CNN
F 1 "LED" H 6592 1933 50  0001 C CNN
F 2 "LED_SMD:LED_0402_1005Metric" H 6600 2000 50  0001 C CNN
F 3 "~" H 6600 2000 50  0001 C CNN
	1    6600 2000
	-1   0    0    1   
$EndComp
Text HLabel 6450 2000 3    20   Input ~ 0
L2
Text HLabel 6750 2000 3    20   Input ~ 0
L5
Text Notes 7000 700  0    50   ~ 0
X15
$Comp
L Device:LED D1165
U 1 1 0000048D
P 7000 2000
F 0 "D1165" H 6992 1933 20  0000 C CNN
F 1 "LED" H 6992 1933 50  0001 C CNN
F 2 "LED_SMD:LED_0402_1005Metric" H 7000 2000 50  0001 C CNN
F 3 "~" H 7000 2000 50  0001 C CNN
	1    7000 2000
	-1   0    0    1   
$EndComp
Text HLabel 6850 2000 3    20   Input ~ 0
L2
Text HLabel 7150 2000 3    20   Input ~ 0
L6
Text Notes 7400 700  0    50   ~ 0
X16
$Comp
L Device:LED D1166
U 1 1 0000048E
P 7400 2000
F 0 "D1166" H 7392 1933 20  0000 C CNN
F 1 "LED" H 7392 1933 50  0001 C CNN
F 2 "LED_SMD:LED_0402_1005Metric" H 7400 2000 50  0001 C CNN
F 3 "~" H 7400 2000 50  0001 C CNN
	1    7400 2000
	-1   0    0    1   
$EndComp
Text HLabel 7250 2000 3    20   Input ~ 0
L3
Text HLabel 7550 2000 3    20   Input ~ 0
L7
Text Notes 7800 700  0    50   ~ 0
X17
$Comp
L Device:LED D1167
U 1 1 0000048F
P 7800 2000
F 0 "D1167" H 7792 1933 20  0000 C CNN
F 1 "LED" H 7792 1933 50  0001 C CNN
F 2 "LED_SMD:LED_0402_1005Metric" H 7800 2000 50  0001 C CNN
F 3 "~" H 7800 2000 50  0001 C CNN
	1    7800 2000
	-1   0    0    1   
$EndComp
Text HLabel 7650 2000 3    20   Input ~ 0
L3
Text HLabel 7950 2000 3    20   Input ~ 0
L8
Text Notes 8200 700  0    50   ~ 0
X18
$Comp
L Device:LED D1168
U 1 1 00000490
P 8200 2000
F 0 "D1168" H 8192 1933 20  0000 C CNN
F 1 "LED" H 8192 1933 50  0001 C CNN
F 2 "LED_SMD:LED_0402_1005Metric" H 8200 2000 50  0001 C CNN
F 3 "~" H 8200 2000 50  0001 C CNN
	1    8200 2000
	-1   0    0    1   
$EndComp
Text HLabel 8050 2000 3    20   Input ~ 0
L4
Text HLabel 8350 2000 3    20   Input ~ 0
L9
Text Notes 8600 700  0    50   ~ 0
X19
$Comp
L Device:LED D1169
U 1 1 00000491
P 8600 2000
F 0 "D1169" H 8592 1933 20  0000 C CNN
F 1 "LED" H 8592 1933 50  0001 C CNN
F 2 "LED_SMD:LED_0402_1005Metric" H 8600 2000 50  0001 C CNN
F 3 "~" H 8600 2000 50  0001 C CNN
	1    8600 2000
	-1   0    0    1   
$EndComp
Text HLabel 8450 2000 3    20   Input ~ 0
L4
Text HLabel 8750 2000 3    20   Input ~ 0
L10
Text Notes 9000 700  0    50   ~ 0
X20
$Comp
L Device:LED D1170
U 1 1 00000492
P 9000 2000
F 0 "D1170" H 8992 1933 20  0000 C CNN
F 1 "LED" H 8992 1933 50  0001 C CNN
F 2 "LED_SMD:LED_0402_1005Metric" H 9000 2000 50  0001 C CNN
F 3 "~" H 9000 2000 50  0001 C CNN
	1    9000 2000
	-1   0    0    1   
$EndComp
Text HLabel 8850 2000 3    20   Input ~ 0
L5
Text HLabel 9150 2000 3    20   Input ~ 0
L11
Text Notes 9400 700  0    50   ~ 0
X21
$Comp
L Device:LED D1171
U 1 1 00000493
P 9400 2000
F 0 "D1171" H 9392 1933 20  0000 C CNN
F 1 "LED" H 9392 1933 50  0001 C CNN
F 2 "LED_SMD:LED_0402_1005Metric" H 9400 2000 50  0001 C CNN
F 3 "~" H 9400 2000 50  0001 C CNN
	1    9400 2000
	-1   0    0    1   
$EndComp
Text HLabel 9250 2000 3    20   Input ~ 0
L5
Text HLabel 9550 2000 3    20   Input ~ 0
L12
Text Notes 9800 700  0    50   ~ 0
X22
$Comp
L Device:LED D1172
U 1 1 00000494
P 9800 2000
F 0 "D1172" H 9792 1933 20  0000 C CNN
F 1 "LED" H 9792 1933 50  0001 C CNN
F 2 "LED_SMD:LED_0402_1005Metric" H 9800 2000 50  0001 C CNN
F 3 "~" H 9800 2000 50  0001 C CNN
	1    9800 2000
	-1   0    0    1   
$EndComp
Text HLabel 9650 2000 3    20   Input ~ 0
L6
Text HLabel 9950 2000 3    20   Input ~ 0
L13
Text Notes 10200 700  0    50   ~ 0
X23
$Comp
L Device:LED D1173
U 1 1 00000495
P 10200 2000
F 0 "D1173" H 10192 1933 20  0000 C CNN
F 1 "LED" H 10192 1933 50  0001 C CNN
F 2 "LED_SMD:LED_0402_1005Metric" H 10200 2000 50  0001 C CNN
F 3 "~" H 10200 2000 50  0001 C CNN
	1    10200 2000
	-1   0    0    1   
$EndComp
Text HLabel 10050 2000 3    20   Input ~ 0
L6
Text HLabel 10350 2000 3    20   Input ~ 0
L14
Text Notes 10600 700  0    50   ~ 0
X24
$Comp
L Device:LED D1174
U 1 1 00000496
P 10600 2000
F 0 "D1174" H 10592 1933 20  0000 C CNN
F 1 "LED" H 10592 1933 50  0001 C CNN
F 2 "LED_SMD:LED_0402_1005Metric" H 10600 2000 50  0001 C CNN
F 3 "~" H 10600 2000 50  0001 C CNN
	1    10600 2000
	-1   0    0    1   
$EndComp
Text HLabel 10450 2000 3    20   Input ~ 0
L7
Text HLabel 10750 2000 3    20   Input ~ 0
L15
Text Notes 11000 700  0    50   ~ 0
X25
$Comp
L Device:LED D1175
U 1 1 00000497
P 11000 2000
F 0 "D1175" H 10992 1933 20  0000 C CNN
F 1 "LED" H 10992 1933 50  0001 C CNN
F 2 "LED_SMD:LED_0402_1005Metric" H 11000 2000 50  0001 C CNN
F 3 "~" H 11000 2000 50  0001 C CNN
	1    11000 2000
	-1   0    0    1   
$EndComp
Text HLabel 10850 2000 3    20   Input ~ 0
L7
Text HLabel 11150 2000 3    20   Input ~ 0
L1
Text Notes 11400 700  0    50   ~ 0
X26
$Comp
L Device:LED D1176
U 1 1 00000498
P 11400 2000
F 0 "D1176" H 11392 1933 20  0000 C CNN
F 1 "LED" H 11392 1933 50  0001 C CNN
F 2 "LED_SMD:LED_0402_1005Metric" H 11400 2000 50  0001 C CNN
F 3 "~" H 11400 2000 50  0001 C CNN
	1    11400 2000
	-1   0    0    1   
$EndComp
Text HLabel 11250 2000 3    20   Input ~ 0
L8
Text HLabel 11550 2000 3    20   Input ~ 0
L2
Text Notes 11800 700  0    50   ~ 0
X27
$Comp
L Device:LED D1177
U 1 1 00000499
P 11800 2000
F 0 "D1177" H 11792 1933 20  0000 C CNN
F 1 "LED" H 11792 1933 50  0001 C CNN
F 2 "LED_SMD:LED_0402_1005Metric" H 11800 2000 50  0001 C CNN
F 3 "~" H 11800 2000 50  0001 C CNN
	1    11800 2000
	-1   0    0    1   
$EndComp
Text HLabel 11650 2000 3    20   Input ~ 0
L8
Text HLabel 11950 2000 3    20   Input ~ 0
L3
Text Notes 12200 700  0    50   ~ 0
X28
$Comp
L Device:LED D1178
U 1 1 0000049A
P 12200 2000
F 0 "D1178" H 12192 1933 20  0000 C CNN
F 1 "LED" H 12192 1933 50  0001 C CNN
F 2 "LED_SMD:LED_0402_1005Metric" H 12200 2000 50  0001 C CNN
F 3 "~" H 12200 2000 50  0001 C CNN
	1    12200 2000
	-1   0    0    1   
$EndComp
Text HLabel 12050 2000 3    20   Input ~ 0
L9
Text HLabel 12350 2000 3    20   Input ~ 0
L4
Text Notes 12600 700  0    50   ~ 0
X29
$Comp
L Device:LED D1179
U 1 1 0000049B
P 12600 2000
F 0 "D1179" H 12592 1933 20  0000 C CNN
F 1 "LED" H 12592 1933 50  0001 C CNN
F 2 "LED_SMD:LED_0402_1005Metric" H 12600 2000 50  0001 C CNN
F 3 "~" H 12600 2000 50  0001 C CNN
	1    12600 2000
	-1   0    0    1   
$EndComp
Text HLabel 12450 2000 3    20   Input ~ 0
L9
Text HLabel 12750 2000 3    20   Input ~ 0
L5
Text Notes 700  2200 0    50   ~ 0
Y6
Text Notes 1000 700  0    50   ~ 0
X0
$Comp
L Device:LED D1180
U 1 1 0000049C
P 1000 2200
F 0 "D1180" H 992 2133 20  0000 C CNN
F 1 "LED" H 992 2133 50  0001 C CNN
F 2 "LED_SMD:LED_0402_1005Metric" H 1000 2200 50  0001 C CNN
F 3 "~" H 1000 2200 50  0001 C CNN
	1    1000 2200
	-1   0    0    1   
$EndComp
Text HLabel 850  2200 3    20   Input ~ 0
L9
Text HLabel 1150 2200 3    20   Input ~ 0
L7
Text Notes 1400 700  0    50   ~ 0
X1
$Comp
L Device:LED D1181
U 1 1 0000049D
P 1400 2200
F 0 "D1181" H 1392 2133 20  0000 C CNN
F 1 "LED" H 1392 2133 50  0001 C CNN
F 2 "LED_SMD:LED_0402_1005Metric" H 1400 2200 50  0001 C CNN
F 3 "~" H 1400 2200 50  0001 C CNN
	1    1400 2200
	-1   0    0    1   
$EndComp
Text HLabel 1250 2200 3    20   Input ~ 0
L9
Text HLabel 1550 2200 3    20   Input ~ 0
L8
Text Notes 1800 700  0    50   ~ 0
X2
$Comp
L Device:LED D1182
U 1 1 0000049E
P 1800 2200
F 0 "D1182" H 1792 2133 20  0000 C CNN
F 1 "LED" H 1792 2133 50  0001 C CNN
F 2 "LED_SMD:LED_0402_1005Metric" H 1800 2200 50  0001 C CNN
F 3 "~" H 1800 2200 50  0001 C CNN
	1    1800 2200
	-1   0    0    1   
$EndComp
Text HLabel 1650 2200 3    20   Input ~ 0
L10
Text HLabel 1950 2200 3    20   Input ~ 0
L9
Text Notes 2200 700  0    50   ~ 0
X3
$Comp
L Device:LED D1183
U 1 1 0000049F
P 2200 2200
F 0 "D1183" H 2192 2133 20  0000 C CNN
F 1 "LED" H 2192 2133 50  0001 C CNN
F 2 "LED_SMD:LED_0402_1005Metric" H 2200 2200 50  0001 C CNN
F 3 "~" H 2200 2200 50  0001 C CNN
	1    2200 2200
	-1   0    0    1   
$EndComp
Text HLabel 2050 2200 3    20   Input ~ 0
L10
Text HLabel 2350 2200 3    20   Input ~ 0
L10
Text Notes 2600 700  0    50   ~ 0
X4
$Comp
L Device:LED D1184
U 1 1 000004A0
P 2600 2200
F 0 "D1184" H 2592 2133 20  0000 C CNN
F 1 "LED" H 2592 2133 50  0001 C CNN
F 2 "LED_SMD:LED_0402_1005Metric" H 2600 2200 50  0001 C CNN
F 3 "~" H 2600 2200 50  0001 C CNN
	1    2600 2200
	-1   0    0    1   
$EndComp
Text HLabel 2450 2200 3    20   Input ~ 0
L11
Text HLabel 2750 2200 3    20   Input ~ 0
L11
Text Notes 3000 700  0    50   ~ 0
X5
$Comp
L Device:LED D1185
U 1 1 000004A1
P 3000 2200
F 0 "D1185" H 2992 2133 20  0000 C CNN
F 1 "LED" H 2992 2133 50  0001 C CNN
F 2 "LED_SMD:LED_0402_1005Metric" H 3000 2200 50  0001 C CNN
F 3 "~" H 3000 2200 50  0001 C CNN
	1    3000 2200
	-1   0    0    1   
$EndComp
Text HLabel 2850 2200 3    20   Input ~ 0
L11
Text HLabel 3150 2200 3    20   Input ~ 0
L12
Text Notes 3400 700  0    50   ~ 0
X6
$Comp
L Device:LED D1186
U 1 1 000004A2
P 3400 2200
F 0 "D1186" H 3392 2133 20  0000 C CNN
F 1 "LED" H 3392 2133 50  0001 C CNN
F 2 "LED_SMD:LED_0402_1005Metric" H 3400 2200 50  0001 C CNN
F 3 "~" H 3400 2200 50  0001 C CNN
	1    3400 2200
	-1   0    0    1   
$EndComp
Text HLabel 3250 2200 3    20   Input ~ 0
L12
Text HLabel 3550 2200 3    20   Input ~ 0
L13
Text Notes 3800 700  0    50   ~ 0
X7
$Comp
L Device:LED D1187
U 1 1 000004A3
P 3800 2200
F 0 "D1187" H 3792 2133 20  0000 C CNN
F 1 "LED" H 3792 2133 50  0001 C CNN
F 2 "LED_SMD:LED_0402_1005Metric" H 3800 2200 50  0001 C CNN
F 3 "~" H 3800 2200 50  0001 C CNN
	1    3800 2200
	-1   0    0    1   
$EndComp
Text HLabel 3650 2200 3    20   Input ~ 0
L12
Text HLabel 3950 2200 3    20   Input ~ 0
L14
Text Notes 4200 700  0    50   ~ 0
X8
$Comp
L Device:LED D1188
U 1 1 000004A4
P 4200 2200
F 0 "D1188" H 4192 2133 20  0000 C CNN
F 1 "LED" H 4192 2133 50  0001 C CNN
F 2 "LED_SMD:LED_0402_1005Metric" H 4200 2200 50  0001 C CNN
F 3 "~" H 4200 2200 50  0001 C CNN
	1    4200 2200
	-1   0    0    1   
$EndComp
Text HLabel 4050 2200 3    20   Input ~ 0
L13
Text HLabel 4350 2200 3    20   Input ~ 0
L15
Text Notes 4600 700  0    50   ~ 0
X9
$Comp
L Device:LED D1189
U 1 1 000004A5
P 4600 2200
F 0 "D1189" H 4592 2133 20  0000 C CNN
F 1 "LED" H 4592 2133 50  0001 C CNN
F 2 "LED_SMD:LED_0402_1005Metric" H 4600 2200 50  0001 C CNN
F 3 "~" H 4600 2200 50  0001 C CNN
	1    4600 2200
	-1   0    0    1   
$EndComp
Text HLabel 4450 2200 3    20   Input ~ 0
L13
Text HLabel 4750 2200 3    20   Input ~ 0
L1
Text Notes 5000 700  0    50   ~ 0
X10
$Comp
L Device:LED D1190
U 1 1 000004A6
P 5000 2200
F 0 "D1190" H 4992 2133 20  0000 C CNN
F 1 "LED" H 4992 2133 50  0001 C CNN
F 2 "LED_SMD:LED_0402_1005Metric" H 5000 2200 50  0001 C CNN
F 3 "~" H 5000 2200 50  0001 C CNN
	1    5000 2200
	-1   0    0    1   
$EndComp
Text HLabel 4850 2200 3    20   Input ~ 0
L14
Text HLabel 5150 2200 3    20   Input ~ 0
L2
Text Notes 5400 700  0    50   ~ 0
X11
$Comp
L Device:LED D1191
U 1 1 000004A7
P 5400 2200
F 0 "D1191" H 5392 2133 20  0000 C CNN
F 1 "LED" H 5392 2133 50  0001 C CNN
F 2 "LED_SMD:LED_0402_1005Metric" H 5400 2200 50  0001 C CNN
F 3 "~" H 5400 2200 50  0001 C CNN
	1    5400 2200
	-1   0    0    1   
$EndComp
Text HLabel 5250 2200 3    20   Input ~ 0
L14
Text HLabel 5550 2200 3    20   Input ~ 0
L3
Text Notes 5800 700  0    50   ~ 0
X12
$Comp
L Device:LED D1192
U 1 1 000004A8
P 5800 2200
F 0 "D1192" H 5792 2133 20  0000 C CNN
F 1 "LED" H 5792 2133 50  0001 C CNN
F 2 "LED_SMD:LED_0402_1005Metric" H 5800 2200 50  0001 C CNN
F 3 "~" H 5800 2200 50  0001 C CNN
	1    5800 2200
	-1   0    0    1   
$EndComp
Text HLabel 5650 2200 3    20   Input ~ 0
L15
Text HLabel 5950 2200 3    20   Input ~ 0
L4
Text Notes 6200 700  0    50   ~ 0
X13
$Comp
L Device:LED D1193
U 1 1 000004A9
P 6200 2200
F 0 "D1193" H 6192 2133 20  0000 C CNN
F 1 "LED" H 6192 2133 50  0001 C CNN
F 2 "LED_SMD:LED_0402_1005Metric" H 6200 2200 50  0001 C CNN
F 3 "~" H 6200 2200 50  0001 C CNN
	1    6200 2200
	-1   0    0    1   
$EndComp
Text HLabel 6050 2200 3    20   Input ~ 0
L15
Text HLabel 6350 2200 3    20   Input ~ 0
L5
Text Notes 6600 700  0    50   ~ 0
X14
$Comp
L Device:LED D1194
U 1 1 000004AA
P 6600 2200
F 0 "D1194" H 6592 2133 20  0000 C CNN
F 1 "LED" H 6592 2133 50  0001 C CNN
F 2 "LED_SMD:LED_0402_1005Metric" H 6600 2200 50  0001 C CNN
F 3 "~" H 6600 2200 50  0001 C CNN
	1    6600 2200
	-1   0    0    1   
$EndComp
Text HLabel 6450 2200 3    20   Input ~ 0
L1
Text HLabel 6750 2200 3    20   Input ~ 0
L6
Text Notes 7000 700  0    50   ~ 0
X15
$Comp
L Device:LED D1195
U 1 1 000004AB
P 7000 2200
F 0 "D1195" H 6992 2133 20  0000 C CNN
F 1 "LED" H 6992 2133 50  0001 C CNN
F 2 "LED_SMD:LED_0402_1005Metric" H 7000 2200 50  0001 C CNN
F 3 "~" H 7000 2200 50  0001 C CNN
	1    7000 2200
	-1   0    0    1   
$EndComp
Text HLabel 6850 2200 3    20   Input ~ 0
L1
Text HLabel 7150 2200 3    20   Input ~ 0
L7
Text Notes 7400 700  0    50   ~ 0
X16
$Comp
L Device:LED D1196
U 1 1 000004AC
P 7400 2200
F 0 "D1196" H 7392 2133 20  0000 C CNN
F 1 "LED" H 7392 2133 50  0001 C CNN
F 2 "LED_SMD:LED_0402_1005Metric" H 7400 2200 50  0001 C CNN
F 3 "~" H 7400 2200 50  0001 C CNN
	1    7400 2200
	-1   0    0    1   
$EndComp
Text HLabel 7250 2200 3    20   Input ~ 0
L2
Text HLabel 7550 2200 3    20   Input ~ 0
L8
Text Notes 7800 700  0    50   ~ 0
X17
$Comp
L Device:LED D1197
U 1 1 000004AD
P 7800 2200
F 0 "D1197" H 7792 2133 20  0000 C CNN
F 1 "LED" H 7792 2133 50  0001 C CNN
F 2 "LED_SMD:LED_0402_1005Metric" H 7800 2200 50  0001 C CNN
F 3 "~" H 7800 2200 50  0001 C CNN
	1    7800 2200
	-1   0    0    1   
$EndComp
Text HLabel 7650 2200 3    20   Input ~ 0
L2
Text HLabel 7950 2200 3    20   Input ~ 0
L9
Text Notes 8200 700  0    50   ~ 0
X18
$Comp
L Device:LED D1198
U 1 1 000004AE
P 8200 2200
F 0 "D1198" H 8192 2133 20  0000 C CNN
F 1 "LED" H 8192 2133 50  0001 C CNN
F 2 "LED_SMD:LED_0402_1005Metric" H 8200 2200 50  0001 C CNN
F 3 "~" H 8200 2200 50  0001 C CNN
	1    8200 2200
	-1   0    0    1   
$EndComp
Text HLabel 8050 2200 3    20   Input ~ 0
L3
Text HLabel 8350 2200 3    20   Input ~ 0
L10
Text Notes 8600 700  0    50   ~ 0
X19
$Comp
L Device:LED D1199
U 1 1 000004AF
P 8600 2200
F 0 "D1199" H 8592 2133 20  0000 C CNN
F 1 "LED" H 8592 2133 50  0001 C CNN
F 2 "LED_SMD:LED_0402_1005Metric" H 8600 2200 50  0001 C CNN
F 3 "~" H 8600 2200 50  0001 C CNN
	1    8600 2200
	-1   0    0    1   
$EndComp
Text HLabel 8450 2200 3    20   Input ~ 0
L3
Text HLabel 8750 2200 3    20   Input ~ 0
L11
Text Notes 9000 700  0    50   ~ 0
X20
$Comp
L Device:LED D1200
U 1 1 000004B0
P 9000 2200
F 0 "D1200" H 8992 2133 20  0000 C CNN
F 1 "LED" H 8992 2133 50  0001 C CNN
F 2 "LED_SMD:LED_0402_1005Metric" H 9000 2200 50  0001 C CNN
F 3 "~" H 9000 2200 50  0001 C CNN
	1    9000 2200
	-1   0    0    1   
$EndComp
Text HLabel 8850 2200 3    20   Input ~ 0
L4
Text HLabel 9150 2200 3    20   Input ~ 0
L12
Text Notes 9400 700  0    50   ~ 0
X21
$Comp
L Device:LED D1201
U 1 1 000004B1
P 9400 2200
F 0 "D1201" H 9392 2133 20  0000 C CNN
F 1 "LED" H 9392 2133 50  0001 C CNN
F 2 "LED_SMD:LED_0402_1005Metric" H 9400 2200 50  0001 C CNN
F 3 "~" H 9400 2200 50  0001 C CNN
	1    9400 2200
	-1   0    0    1   
$EndComp
Text HLabel 9250 2200 3    20   Input ~ 0
L4
Text HLabel 9550 2200 3    20   Input ~ 0
L13
Text Notes 9800 700  0    50   ~ 0
X22
$Comp
L Device:LED D1202
U 1 1 000004B2
P 9800 2200
F 0 "D1202" H 9792 2133 20  0000 C CNN
F 1 "LED" H 9792 2133 50  0001 C CNN
F 2 "LED_SMD:LED_0402_1005Metric" H 9800 2200 50  0001 C CNN
F 3 "~" H 9800 2200 50  0001 C CNN
	1    9800 2200
	-1   0    0    1   
$EndComp
Text HLabel 9650 2200 3    20   Input ~ 0
L5
Text HLabel 9950 2200 3    20   Input ~ 0
L14
Text Notes 10200 700  0    50   ~ 0
X23
$Comp
L Device:LED D1203
U 1 1 000004B3
P 10200 2200
F 0 "D1203" H 10192 2133 20  0000 C CNN
F 1 "LED" H 10192 2133 50  0001 C CNN
F 2 "LED_SMD:LED_0402_1005Metric" H 10200 2200 50  0001 C CNN
F 3 "~" H 10200 2200 50  0001 C CNN
	1    10200 2200
	-1   0    0    1   
$EndComp
Text HLabel 10050 2200 3    20   Input ~ 0
L5
Text HLabel 10350 2200 3    20   Input ~ 0
L15
Text Notes 10600 700  0    50   ~ 0
X24
$Comp
L Device:LED D1204
U 1 1 000004B4
P 10600 2200
F 0 "D1204" H 10592 2133 20  0000 C CNN
F 1 "LED" H 10592 2133 50  0001 C CNN
F 2 "LED_SMD:LED_0402_1005Metric" H 10600 2200 50  0001 C CNN
F 3 "~" H 10600 2200 50  0001 C CNN
	1    10600 2200
	-1   0    0    1   
$EndComp
Text HLabel 10450 2200 3    20   Input ~ 0
L6
Text HLabel 10750 2200 3    20   Input ~ 0
L1
Text Notes 11000 700  0    50   ~ 0
X25
$Comp
L Device:LED D1205
U 1 1 000004B5
P 11000 2200
F 0 "D1205" H 10992 2133 20  0000 C CNN
F 1 "LED" H 10992 2133 50  0001 C CNN
F 2 "LED_SMD:LED_0402_1005Metric" H 11000 2200 50  0001 C CNN
F 3 "~" H 11000 2200 50  0001 C CNN
	1    11000 2200
	-1   0    0    1   
$EndComp
Text HLabel 10850 2200 3    20   Input ~ 0
L6
Text HLabel 11150 2200 3    20   Input ~ 0
L2
Text Notes 11400 700  0    50   ~ 0
X26
$Comp
L Device:LED D1206
U 1 1 000004B6
P 11400 2200
F 0 "D1206" H 11392 2133 20  0000 C CNN
F 1 "LED" H 11392 2133 50  0001 C CNN
F 2 "LED_SMD:LED_0402_1005Metric" H 11400 2200 50  0001 C CNN
F 3 "~" H 11400 2200 50  0001 C CNN
	1    11400 2200
	-1   0    0    1   
$EndComp
Text HLabel 11250 2200 3    20   Input ~ 0
L7
Text HLabel 11550 2200 3    20   Input ~ 0
L3
Text Notes 11800 700  0    50   ~ 0
X27
$Comp
L Device:LED D1207
U 1 1 000004B7
P 11800 2200
F 0 "D1207" H 11792 2133 20  0000 C CNN
F 1 "LED" H 11792 2133 50  0001 C CNN
F 2 "LED_SMD:LED_0402_1005Metric" H 11800 2200 50  0001 C CNN
F 3 "~" H 11800 2200 50  0001 C CNN
	1    11800 2200
	-1   0    0    1   
$EndComp
Text HLabel 11650 2200 3    20   Input ~ 0
L7
Text HLabel 11950 2200 3    20   Input ~ 0
L4
Text Notes 12200 700  0    50   ~ 0
X28
$Comp
L Device:LED D1208
U 1 1 000004B8
P 12200 2200
F 0 "D1208" H 12192 2133 20  0000 C CNN
F 1 "LED" H 12192 2133 50  0001 C CNN
F 2 "LED_SMD:LED_0402_1005Metric" H 12200 2200 50  0001 C CNN
F 3 "~" H 12200 2200 50  0001 C CNN
	1    12200 2200
	-1   0    0    1   
$EndComp
Text HLabel 12050 2200 3    20   Input ~ 0
L8
Text HLabel 12350 2200 3    20   Input ~ 0
L5
Text Notes 12600 700  0    50   ~ 0
X29
$Comp
L Device:LED D1209
U 1 1 000004B9
P 12600 2200
F 0 "D1209" H 12592 2133 20  0000 C CNN
F 1 "LED" H 12592 2133 50  0001 C CNN
F 2 "LED_SMD:LED_0402_1005Metric" H 12600 2200 50  0001 C CNN
F 3 "~" H 12600 2200 50  0001 C CNN
	1    12600 2200
	-1   0    0    1   
$EndComp
Text HLabel 12450 2200 3    20   Input ~ 0
L8
Text HLabel 12750 2200 3    20   Input ~ 0
L6
$EndSCHEMATC
