EESchema Schematic File Version 4
LIBS:aammf-badge-2019-cache
EELAYER 30 0
EELAYER END
$Descr A4 11693 8268
encoding utf-8
Sheet 2 2
Title ""
Date ""
Rev ""
Comp ""
Comment1 ""
Comment2 ""
Comment3 ""
Comment4 ""
$EndDescr
Text Notes 700  1000 0    50   ~ 0
Y0
Text Notes 1000 700  0    50   ~ 0
X0
Text Notes 1000 700  0    50   ~ 0
X1
$Comp
L aammf-badge-2019-rescue:SMD-LED-YELLOW-DIFFUSED-PURE-WHITE_0402_-OPL_Optoelectronics-aammf-badge-2019-rescue D2
U 1 1 000003E8
P 1000 1000
F 0 "D2" H 992 933 20  0000 C CNN
F 1 "LED" H 992 933 45  0000 C CNN
F 2 "misc:LED-0402-no-silk" H 1000 1000 50  0001 C CNN
F 3 "https://datasheet.lcsc.com/szlcsc/Foshan-NationStar-Optoelectronics-FC-F1005WD-455K5_C130725.pdf" H 1000 1000 50  0001 C CNN
F 4 "FC-F1005WD-455K5" H 4580 1400 20  0001 C CNN "MPN"
F 5 "304090016" H 4580 1400 20  0001 C CNN "seeed-SKU"
F 6 "Foshan NationStar Optoelectronics" H 1000 1000 50  0001 C CNN "Manufacturer"
F 7 "C130725" H 1000 1000 50  0001 C CNN "lcsc-part"
	1    1000 1000
	1    0    0    -1  
$EndComp
Text HLabel 850  1000 3    20   Input ~ 0
L0
Text HLabel 1150 1000 3    20   Input ~ 0
L1
Text Notes 1400 700  0    50   ~ 0
X2
$Comp
L aammf-badge-2019-rescue:SMD-LED-YELLOW-DIFFUSED-PURE-WHITE_0402_-OPL_Optoelectronics-aammf-badge-2019-rescue D9
U 1 1 000003E9
P 1400 1000
F 0 "D9" H 1392 933 20  0000 C CNN
F 1 "LED" H 1392 933 45  0000 C CNN
F 2 "misc:LED-0402-no-silk" H 1400 1000 50  0001 C CNN
F 3 "" H 1400 1000 50  0001 C CNN
F 4 "16-219A_T2D-AR2T1QY_3T" H 4580 1400 20  0001 C CNN "MPN"
F 5 "304090016" H 4580 1400 20  0001 C CNN "SKU"
	1    1400 1000
	1    0    0    -1  
$EndComp
Text HLabel 1250 1000 3    20   Input ~ 0
L0
Text HLabel 1550 1000 3    20   Input ~ 0
L2
Text Notes 1800 700  0    50   ~ 0
X3
$Comp
L aammf-badge-2019-rescue:SMD-LED-YELLOW-DIFFUSED-PURE-WHITE_0402_-OPL_Optoelectronics-aammf-badge-2019-rescue D16
U 1 1 000003EA
P 1800 1000
F 0 "D16" H 1792 933 20  0000 C CNN
F 1 "LED" H 1792 933 45  0000 C CNN
F 2 "misc:LED-0402-no-silk" H 1800 1000 50  0001 C CNN
F 3 "" H 1800 1000 50  0001 C CNN
F 4 "16-219A_T2D-AR2T1QY_3T" H 4580 1400 20  0001 C CNN "MPN"
F 5 "304090016" H 4580 1400 20  0001 C CNN "SKU"
	1    1800 1000
	1    0    0    -1  
$EndComp
Text HLabel 1650 1000 3    20   Input ~ 0
L0
Text HLabel 1950 1000 3    20   Input ~ 0
L3
Text Notes 2200 700  0    50   ~ 0
X4
$Comp
L aammf-badge-2019-rescue:SMD-LED-YELLOW-DIFFUSED-PURE-WHITE_0402_-OPL_Optoelectronics-aammf-badge-2019-rescue D23
U 1 1 000003EB
P 2200 1000
F 0 "D23" H 2192 933 20  0000 C CNN
F 1 "LED" H 3050 550 45  0000 C CNN
F 2 "misc:LED-0402-no-silk" H 2200 1000 50  0001 C CNN
F 3 "" H 2200 1000 50  0001 C CNN
F 4 "16-219A_T2D-AR2T1QY_3T" H 4580 1400 20  0001 C CNN "MPN"
F 5 "304090016" H 4580 1400 20  0001 C CNN "SKU"
	1    2200 1000
	1    0    0    -1  
$EndComp
Text HLabel 2050 1000 3    20   Input ~ 0
L0
Text HLabel 2350 1000 3    20   Input ~ 0
L4
Text Notes 2600 700  0    50   ~ 0
X5
$Comp
L aammf-badge-2019-rescue:SMD-LED-YELLOW-DIFFUSED-PURE-WHITE_0402_-OPL_Optoelectronics-aammf-badge-2019-rescue D30
U 1 1 000003EC
P 2600 1000
F 0 "D30" H 2592 933 20  0000 C CNN
F 1 "LED" H 2900 550 45  0000 C CNN
F 2 "misc:LED-0402-no-silk" H 2600 1000 50  0001 C CNN
F 3 "" H 2600 1000 50  0001 C CNN
F 4 "16-219A_T2D-AR2T1QY_3T" H 4580 1400 20  0001 C CNN "MPN"
F 5 "304090016" H 4580 1400 20  0001 C CNN "SKU"
	1    2600 1000
	1    0    0    -1  
$EndComp
Text HLabel 2450 1000 3    20   Input ~ 0
L0
Text HLabel 2750 1000 3    20   Input ~ 0
L5
Text Notes 3000 700  0    50   ~ 0
X6
$Comp
L aammf-badge-2019-rescue:SMD-LED-YELLOW-DIFFUSED-PURE-WHITE_0402_-OPL_Optoelectronics-aammf-badge-2019-rescue D37
U 1 1 000003ED
P 3000 1000
F 0 "D37" H 2992 933 20  0000 C CNN
F 1 "LED" H 3550 450 45  0000 C CNN
F 2 "misc:LED-0402-no-silk" H 3000 1000 50  0001 C CNN
F 3 "" H 3000 1000 50  0001 C CNN
F 4 "16-219A_T2D-AR2T1QY_3T" H 4580 1400 20  0001 C CNN "MPN"
F 5 "304090016" H 4580 1400 20  0001 C CNN "SKU"
	1    3000 1000
	1    0    0    -1  
$EndComp
Text HLabel 2850 1000 3    20   Input ~ 0
L0
Text HLabel 3150 1000 3    20   Input ~ 0
L6
Text Notes 700  1200 0    50   ~ 0
Y1
$Comp
L aammf-badge-2019-rescue:SMD-LED-YELLOW-DIFFUSED-PURE-WHITE_0402_-OPL_Optoelectronics-aammf-badge-2019-rescue D3
U 1 1 000003EE
P 1000 1200
F 0 "D3" H 992 1133 20  0000 C CNN
F 1 "LED" H 992 1133 45  0000 C CNN
F 2 "misc:LED-0402-no-silk" H 1000 1200 50  0001 C CNN
F 3 "" H 1000 1200 50  0001 C CNN
F 4 "16-219A_T2D-AR2T1QY_3T" H 4580 1400 20  0001 C CNN "MPN"
F 5 "304090016" H 4580 1400 20  0001 C CNN "SKU"
	1    1000 1200
	1    0    0    -1  
$EndComp
Text HLabel 850  1200 3    20   Input ~ 0
L1
Text HLabel 1150 1200 3    20   Input ~ 0
L0
$Comp
L aammf-badge-2019-rescue:SMD-LED-YELLOW-DIFFUSED-PURE-WHITE_0402_-OPL_Optoelectronics-aammf-badge-2019-rescue D10
U 1 1 000003EF
P 1400 1200
F 0 "D10" H 1392 1133 20  0000 C CNN
F 1 "LED" H 1392 1133 45  0000 C CNN
F 2 "misc:LED-0402-no-silk" H 1400 1200 50  0001 C CNN
F 3 "" H 1400 1200 50  0001 C CNN
F 4 "16-219A_T2D-AR2T1QY_3T" H 4580 1400 20  0001 C CNN "MPN"
F 5 "304090016" H 4580 1400 20  0001 C CNN "SKU"
	1    1400 1200
	1    0    0    -1  
$EndComp
Text HLabel 1250 1200 3    20   Input ~ 0
L1
Text HLabel 1550 1200 3    20   Input ~ 0
L2
$Comp
L aammf-badge-2019-rescue:SMD-LED-YELLOW-DIFFUSED-PURE-WHITE_0402_-OPL_Optoelectronics-aammf-badge-2019-rescue D17
U 1 1 000003F0
P 1800 1200
F 0 "D17" H 1792 1133 20  0000 C CNN
F 1 "LED" H 1792 1133 45  0000 C CNN
F 2 "misc:LED-0402-no-silk" H 1800 1200 50  0001 C CNN
F 3 "" H 1800 1200 50  0001 C CNN
F 4 "16-219A_T2D-AR2T1QY_3T" H 4580 1400 20  0001 C CNN "MPN"
F 5 "304090016" H 4580 1400 20  0001 C CNN "SKU"
	1    1800 1200
	1    0    0    -1  
$EndComp
Text HLabel 1650 1200 3    20   Input ~ 0
L1
Text HLabel 1950 1200 3    20   Input ~ 0
L3
$Comp
L aammf-badge-2019-rescue:SMD-LED-YELLOW-DIFFUSED-PURE-WHITE_0402_-OPL_Optoelectronics-aammf-badge-2019-rescue D24
U 1 1 000003F1
P 2200 1200
F 0 "D24" H 2192 1133 20  0000 C CNN
F 1 "LED" H 2192 1133 45  0000 C CNN
F 2 "misc:LED-0402-no-silk" H 2200 1200 50  0001 C CNN
F 3 "" H 2200 1200 50  0001 C CNN
F 4 "16-219A_T2D-AR2T1QY_3T" H 4580 1400 20  0001 C CNN "MPN"
F 5 "304090016" H 4580 1400 20  0001 C CNN "SKU"
	1    2200 1200
	1    0    0    -1  
$EndComp
Text HLabel 2050 1200 3    20   Input ~ 0
L1
Text HLabel 2350 1200 3    20   Input ~ 0
L4
$Comp
L aammf-badge-2019-rescue:SMD-LED-YELLOW-DIFFUSED-PURE-WHITE_0402_-OPL_Optoelectronics-aammf-badge-2019-rescue D31
U 1 1 000003F2
P 2600 1200
F 0 "D31" H 2592 1133 20  0000 C CNN
F 1 "LED" H 2592 1133 45  0000 C CNN
F 2 "misc:LED-0402-no-silk" H 2600 1200 50  0001 C CNN
F 3 "" H 2600 1200 50  0001 C CNN
F 4 "16-219A_T2D-AR2T1QY_3T" H 4580 1400 20  0001 C CNN "MPN"
F 5 "304090016" H 4580 1400 20  0001 C CNN "SKU"
	1    2600 1200
	1    0    0    -1  
$EndComp
Text HLabel 2450 1200 3    20   Input ~ 0
L1
Text HLabel 2750 1200 3    20   Input ~ 0
L5
$Comp
L aammf-badge-2019-rescue:SMD-LED-YELLOW-DIFFUSED-PURE-WHITE_0402_-OPL_Optoelectronics-aammf-badge-2019-rescue D38
U 1 1 000003F3
P 3000 1200
F 0 "D38" H 2992 1133 20  0000 C CNN
F 1 "LED" H 2992 1133 45  0000 C CNN
F 2 "misc:LED-0402-no-silk" H 3000 1200 50  0001 C CNN
F 3 "" H 3000 1200 50  0001 C CNN
F 4 "16-219A_T2D-AR2T1QY_3T" H 4580 1400 20  0001 C CNN "MPN"
F 5 "304090016" H 4580 1400 20  0001 C CNN "SKU"
	1    3000 1200
	1    0    0    -1  
$EndComp
Text HLabel 2850 1200 3    20   Input ~ 0
L1
Text HLabel 3150 1200 3    20   Input ~ 0
L6
Text Notes 700  1400 0    50   ~ 0
Y2
$Comp
L aammf-badge-2019-rescue:SMD-LED-YELLOW-DIFFUSED-PURE-WHITE_0402_-OPL_Optoelectronics-aammf-badge-2019-rescue D4
U 1 1 000003F4
P 1000 1400
F 0 "D4" H 992 1333 20  0000 C CNN
F 1 "LED" H 992 1333 45  0000 C CNN
F 2 "misc:LED-0402-no-silk" H 1000 1400 50  0001 C CNN
F 3 "" H 1000 1400 50  0001 C CNN
F 4 "16-219A_T2D-AR2T1QY_3T" H 4580 1400 20  0001 C CNN "MPN"
F 5 "304090016" H 4580 1400 20  0001 C CNN "SKU"
	1    1000 1400
	1    0    0    -1  
$EndComp
Text HLabel 850  1400 3    20   Input ~ 0
L2
Text HLabel 1150 1400 3    20   Input ~ 0
L0
$Comp
L aammf-badge-2019-rescue:SMD-LED-YELLOW-DIFFUSED-PURE-WHITE_0402_-OPL_Optoelectronics-aammf-badge-2019-rescue D11
U 1 1 000003F5
P 1400 1400
F 0 "D11" H 1392 1333 20  0000 C CNN
F 1 "LED" H 1392 1333 45  0000 C CNN
F 2 "misc:LED-0402-no-silk" H 1400 1400 50  0001 C CNN
F 3 "" H 1400 1400 50  0001 C CNN
F 4 "16-219A_T2D-AR2T1QY_3T" H 4580 1400 20  0001 C CNN "MPN"
F 5 "304090016" H 4580 1400 20  0001 C CNN "SKU"
	1    1400 1400
	1    0    0    -1  
$EndComp
Text HLabel 1250 1400 3    20   Input ~ 0
L2
Text HLabel 1550 1400 3    20   Input ~ 0
L1
$Comp
L aammf-badge-2019-rescue:SMD-LED-YELLOW-DIFFUSED-PURE-WHITE_0402_-OPL_Optoelectronics-aammf-badge-2019-rescue D18
U 1 1 000003F6
P 1800 1400
F 0 "D18" H 1792 1333 20  0000 C CNN
F 1 "LED" H 1792 1333 45  0000 C CNN
F 2 "misc:LED-0402-no-silk" H 1800 1400 50  0001 C CNN
F 3 "" H 1800 1400 50  0001 C CNN
F 4 "16-219A_T2D-AR2T1QY_3T" H 4580 1400 20  0001 C CNN "MPN"
F 5 "304090016" H 4580 1400 20  0001 C CNN "SKU"
	1    1800 1400
	1    0    0    -1  
$EndComp
Text HLabel 1650 1400 3    20   Input ~ 0
L2
Text HLabel 1950 1400 3    20   Input ~ 0
L3
$Comp
L aammf-badge-2019-rescue:SMD-LED-YELLOW-DIFFUSED-PURE-WHITE_0402_-OPL_Optoelectronics-aammf-badge-2019-rescue D25
U 1 1 000003F7
P 2200 1400
F 0 "D25" H 2192 1333 20  0000 C CNN
F 1 "LED" H 2192 1333 45  0000 C CNN
F 2 "misc:LED-0402-no-silk" H 2200 1400 50  0001 C CNN
F 3 "" H 2200 1400 50  0001 C CNN
F 4 "16-219A_T2D-AR2T1QY_3T" H 4580 1400 20  0001 C CNN "MPN"
F 5 "304090016" H 4580 1400 20  0001 C CNN "SKU"
	1    2200 1400
	1    0    0    -1  
$EndComp
Text HLabel 2050 1400 3    20   Input ~ 0
L2
Text HLabel 2350 1400 3    20   Input ~ 0
L4
$Comp
L aammf-badge-2019-rescue:SMD-LED-YELLOW-DIFFUSED-PURE-WHITE_0402_-OPL_Optoelectronics-aammf-badge-2019-rescue D32
U 1 1 000003F8
P 2600 1400
F 0 "D32" H 2592 1333 20  0000 C CNN
F 1 "LED" H 2592 1333 45  0000 C CNN
F 2 "misc:LED-0402-no-silk" H 2600 1400 50  0001 C CNN
F 3 "" H 2600 1400 50  0001 C CNN
F 4 "16-219A_T2D-AR2T1QY_3T" H 4580 1400 20  0001 C CNN "MPN"
F 5 "304090016" H 4580 1400 20  0001 C CNN "SKU"
	1    2600 1400
	1    0    0    -1  
$EndComp
Text HLabel 2450 1400 3    20   Input ~ 0
L2
Text HLabel 2750 1400 3    20   Input ~ 0
L5
$Comp
L aammf-badge-2019-rescue:SMD-LED-YELLOW-DIFFUSED-PURE-WHITE_0402_-OPL_Optoelectronics-aammf-badge-2019-rescue D39
U 1 1 000003F9
P 3000 1400
F 0 "D39" H 2992 1333 20  0000 C CNN
F 1 "LED" H 2992 1333 45  0000 C CNN
F 2 "misc:LED-0402-no-silk" H 3000 1400 50  0001 C CNN
F 3 "" H 3000 1400 50  0001 C CNN
F 4 "16-219A_T2D-AR2T1QY_3T" H 4580 1400 20  0001 C CNN "MPN"
F 5 "304090016" H 4580 1400 20  0001 C CNN "SKU"
	1    3000 1400
	1    0    0    -1  
$EndComp
Text HLabel 2850 1400 3    20   Input ~ 0
L2
Text HLabel 3150 1400 3    20   Input ~ 0
L6
Text Notes 700  1600 0    50   ~ 0
Y3
$Comp
L aammf-badge-2019-rescue:SMD-LED-YELLOW-DIFFUSED-PURE-WHITE_0402_-OPL_Optoelectronics-aammf-badge-2019-rescue D5
U 1 1 000003FA
P 1000 1600
F 0 "D5" H 992 1533 20  0000 C CNN
F 1 "LED" H 992 1533 45  0000 C CNN
F 2 "misc:LED-0402-no-silk" H 1000 1600 50  0001 C CNN
F 3 "" H 1000 1600 50  0001 C CNN
F 4 "16-219A_T2D-AR2T1QY_3T" H 4580 1400 20  0001 C CNN "MPN"
F 5 "304090016" H 4580 1400 20  0001 C CNN "SKU"
	1    1000 1600
	1    0    0    -1  
$EndComp
Text HLabel 850  1600 3    20   Input ~ 0
L3
Text HLabel 1150 1600 3    20   Input ~ 0
L0
$Comp
L aammf-badge-2019-rescue:SMD-LED-YELLOW-DIFFUSED-PURE-WHITE_0402_-OPL_Optoelectronics-aammf-badge-2019-rescue D12
U 1 1 000003FB
P 1400 1600
F 0 "D12" H 1392 1533 20  0000 C CNN
F 1 "LED" H 1392 1533 45  0000 C CNN
F 2 "misc:LED-0402-no-silk" H 1400 1600 50  0001 C CNN
F 3 "" H 1400 1600 50  0001 C CNN
F 4 "16-219A_T2D-AR2T1QY_3T" H 4580 1400 20  0001 C CNN "MPN"
F 5 "304090016" H 4580 1400 20  0001 C CNN "SKU"
	1    1400 1600
	1    0    0    -1  
$EndComp
Text HLabel 1250 1600 3    20   Input ~ 0
L3
Text HLabel 1550 1600 3    20   Input ~ 0
L1
$Comp
L aammf-badge-2019-rescue:SMD-LED-YELLOW-DIFFUSED-PURE-WHITE_0402_-OPL_Optoelectronics-aammf-badge-2019-rescue D19
U 1 1 000003FC
P 1800 1600
F 0 "D19" H 1792 1533 20  0000 C CNN
F 1 "LED" H 1792 1533 45  0000 C CNN
F 2 "misc:LED-0402-no-silk" H 1800 1600 50  0001 C CNN
F 3 "" H 1800 1600 50  0001 C CNN
F 4 "16-219A_T2D-AR2T1QY_3T" H 4580 1400 20  0001 C CNN "MPN"
F 5 "304090016" H 4580 1400 20  0001 C CNN "SKU"
	1    1800 1600
	1    0    0    -1  
$EndComp
Text HLabel 1650 1600 3    20   Input ~ 0
L3
Text HLabel 1950 1600 3    20   Input ~ 0
L2
$Comp
L aammf-badge-2019-rescue:SMD-LED-YELLOW-DIFFUSED-PURE-WHITE_0402_-OPL_Optoelectronics-aammf-badge-2019-rescue D26
U 1 1 000003FD
P 2200 1600
F 0 "D26" H 2192 1533 20  0000 C CNN
F 1 "LED" H 2192 1533 45  0000 C CNN
F 2 "misc:LED-0402-no-silk" H 2200 1600 50  0001 C CNN
F 3 "" H 2200 1600 50  0001 C CNN
F 4 "16-219A_T2D-AR2T1QY_3T" H 4580 1400 20  0001 C CNN "MPN"
F 5 "304090016" H 4580 1400 20  0001 C CNN "SKU"
	1    2200 1600
	1    0    0    -1  
$EndComp
Text HLabel 2050 1600 3    20   Input ~ 0
L3
Text HLabel 2350 1600 3    20   Input ~ 0
L4
$Comp
L aammf-badge-2019-rescue:SMD-LED-YELLOW-DIFFUSED-PURE-WHITE_0402_-OPL_Optoelectronics-aammf-badge-2019-rescue D33
U 1 1 000003FE
P 2600 1600
F 0 "D33" H 2592 1533 20  0000 C CNN
F 1 "LED" H 2592 1533 45  0000 C CNN
F 2 "misc:LED-0402-no-silk" H 2600 1600 50  0001 C CNN
F 3 "" H 2600 1600 50  0001 C CNN
F 4 "16-219A_T2D-AR2T1QY_3T" H 4580 1400 20  0001 C CNN "MPN"
F 5 "304090016" H 4580 1400 20  0001 C CNN "SKU"
	1    2600 1600
	1    0    0    -1  
$EndComp
Text HLabel 2450 1600 3    20   Input ~ 0
L3
Text HLabel 2750 1600 3    20   Input ~ 0
L5
$Comp
L aammf-badge-2019-rescue:SMD-LED-YELLOW-DIFFUSED-PURE-WHITE_0402_-OPL_Optoelectronics-aammf-badge-2019-rescue D40
U 1 1 000003FF
P 3000 1600
F 0 "D40" H 2992 1533 20  0000 C CNN
F 1 "LED" H 2992 1533 45  0000 C CNN
F 2 "misc:LED-0402-no-silk" H 3000 1600 50  0001 C CNN
F 3 "" H 3000 1600 50  0001 C CNN
F 4 "16-219A_T2D-AR2T1QY_3T" H 4580 1400 20  0001 C CNN "MPN"
F 5 "304090016" H 4580 1400 20  0001 C CNN "SKU"
	1    3000 1600
	1    0    0    -1  
$EndComp
Text HLabel 2850 1600 3    20   Input ~ 0
L3
Text HLabel 3150 1600 3    20   Input ~ 0
L6
Text Notes 700  1800 0    50   ~ 0
Y4
$Comp
L aammf-badge-2019-rescue:SMD-LED-YELLOW-DIFFUSED-PURE-WHITE_0402_-OPL_Optoelectronics-aammf-badge-2019-rescue D6
U 1 1 00000400
P 1000 1800
F 0 "D6" H 992 1733 20  0000 C CNN
F 1 "LED" H 992 1733 45  0000 C CNN
F 2 "misc:LED-0402-no-silk" H 1000 1800 50  0001 C CNN
F 3 "" H 1000 1800 50  0001 C CNN
F 4 "16-219A_T2D-AR2T1QY_3T" H 4580 1400 20  0001 C CNN "MPN"
F 5 "304090016" H 4580 1400 20  0001 C CNN "SKU"
	1    1000 1800
	1    0    0    -1  
$EndComp
Text HLabel 850  1800 3    20   Input ~ 0
L4
Text HLabel 1150 1800 3    20   Input ~ 0
L0
$Comp
L aammf-badge-2019-rescue:SMD-LED-YELLOW-DIFFUSED-PURE-WHITE_0402_-OPL_Optoelectronics-aammf-badge-2019-rescue D13
U 1 1 00000401
P 1400 1800
F 0 "D13" H 1392 1733 20  0000 C CNN
F 1 "LED" H 1392 1733 45  0000 C CNN
F 2 "misc:LED-0402-no-silk" H 1400 1800 50  0001 C CNN
F 3 "" H 1400 1800 50  0001 C CNN
F 4 "16-219A_T2D-AR2T1QY_3T" H 4580 1400 20  0001 C CNN "MPN"
F 5 "304090016" H 4580 1400 20  0001 C CNN "SKU"
	1    1400 1800
	1    0    0    -1  
$EndComp
Text HLabel 1250 1800 3    20   Input ~ 0
L4
Text HLabel 1550 1800 3    20   Input ~ 0
L1
$Comp
L aammf-badge-2019-rescue:SMD-LED-YELLOW-DIFFUSED-PURE-WHITE_0402_-OPL_Optoelectronics-aammf-badge-2019-rescue D20
U 1 1 00000402
P 1800 1800
F 0 "D20" H 1792 1733 20  0000 C CNN
F 1 "LED" H 1792 1733 45  0000 C CNN
F 2 "misc:LED-0402-no-silk" H 1800 1800 50  0001 C CNN
F 3 "" H 1800 1800 50  0001 C CNN
F 4 "16-219A_T2D-AR2T1QY_3T" H 4580 1400 20  0001 C CNN "MPN"
F 5 "304090016" H 4580 1400 20  0001 C CNN "SKU"
	1    1800 1800
	1    0    0    -1  
$EndComp
Text HLabel 1650 1800 3    20   Input ~ 0
L4
Text HLabel 1950 1800 3    20   Input ~ 0
L2
$Comp
L aammf-badge-2019-rescue:SMD-LED-YELLOW-DIFFUSED-PURE-WHITE_0402_-OPL_Optoelectronics-aammf-badge-2019-rescue D27
U 1 1 00000403
P 2200 1800
F 0 "D27" H 2192 1733 20  0000 C CNN
F 1 "LED" H 2192 1733 45  0000 C CNN
F 2 "misc:LED-0402-no-silk" H 2200 1800 50  0001 C CNN
F 3 "" H 2200 1800 50  0001 C CNN
F 4 "16-219A_T2D-AR2T1QY_3T" H 4580 1400 20  0001 C CNN "MPN"
F 5 "304090016" H 4580 1400 20  0001 C CNN "SKU"
	1    2200 1800
	1    0    0    -1  
$EndComp
Text HLabel 2050 1800 3    20   Input ~ 0
L4
Text HLabel 2350 1800 3    20   Input ~ 0
L3
$Comp
L aammf-badge-2019-rescue:SMD-LED-YELLOW-DIFFUSED-PURE-WHITE_0402_-OPL_Optoelectronics-aammf-badge-2019-rescue D34
U 1 1 00000404
P 2600 1800
F 0 "D34" H 2592 1733 20  0000 C CNN
F 1 "LED" H 2592 1733 45  0000 C CNN
F 2 "misc:LED-0402-no-silk" H 2600 1800 50  0001 C CNN
F 3 "" H 2600 1800 50  0001 C CNN
F 4 "16-219A_T2D-AR2T1QY_3T" H 4580 1400 20  0001 C CNN "MPN"
F 5 "304090016" H 4580 1400 20  0001 C CNN "SKU"
	1    2600 1800
	1    0    0    -1  
$EndComp
Text HLabel 2450 1800 3    20   Input ~ 0
L4
Text HLabel 2750 1800 3    20   Input ~ 0
L5
$Comp
L aammf-badge-2019-rescue:SMD-LED-YELLOW-DIFFUSED-PURE-WHITE_0402_-OPL_Optoelectronics-aammf-badge-2019-rescue D41
U 1 1 00000405
P 3000 1800
F 0 "D41" H 2992 1733 20  0000 C CNN
F 1 "LED" H 2992 1733 45  0000 C CNN
F 2 "misc:LED-0402-no-silk" H 3000 1800 50  0001 C CNN
F 3 "" H 3000 1800 50  0001 C CNN
F 4 "16-219A_T2D-AR2T1QY_3T" H 4580 1400 20  0001 C CNN "MPN"
F 5 "304090016" H 4580 1400 20  0001 C CNN "SKU"
	1    3000 1800
	1    0    0    -1  
$EndComp
Text HLabel 2850 1800 3    20   Input ~ 0
L4
Text HLabel 3150 1800 3    20   Input ~ 0
L6
Text Notes 700  2000 0    50   ~ 0
Y5
$Comp
L aammf-badge-2019-rescue:SMD-LED-YELLOW-DIFFUSED-PURE-WHITE_0402_-OPL_Optoelectronics-aammf-badge-2019-rescue D7
U 1 1 00000406
P 1000 2000
F 0 "D7" H 992 1933 20  0000 C CNN
F 1 "LED" H 992 1933 45  0000 C CNN
F 2 "misc:LED-0402-no-silk" H 1000 2000 50  0001 C CNN
F 3 "" H 1000 2000 50  0001 C CNN
F 4 "16-219A_T2D-AR2T1QY_3T" H 4580 1400 20  0001 C CNN "MPN"
F 5 "304090016" H 4580 1400 20  0001 C CNN "SKU"
	1    1000 2000
	1    0    0    -1  
$EndComp
Text HLabel 850  2000 3    20   Input ~ 0
L5
Text HLabel 1150 2000 3    20   Input ~ 0
L0
$Comp
L aammf-badge-2019-rescue:SMD-LED-YELLOW-DIFFUSED-PURE-WHITE_0402_-OPL_Optoelectronics-aammf-badge-2019-rescue D14
U 1 1 00000407
P 1400 2000
F 0 "D14" H 1392 1933 20  0000 C CNN
F 1 "LED" H 1392 1933 45  0000 C CNN
F 2 "misc:LED-0402-no-silk" H 1400 2000 50  0001 C CNN
F 3 "" H 1400 2000 50  0001 C CNN
F 4 "16-219A_T2D-AR2T1QY_3T" H 4580 1400 20  0001 C CNN "MPN"
F 5 "304090016" H 4580 1400 20  0001 C CNN "SKU"
	1    1400 2000
	1    0    0    -1  
$EndComp
Text HLabel 1250 2000 3    20   Input ~ 0
L5
Text HLabel 1550 2000 3    20   Input ~ 0
L1
$Comp
L aammf-badge-2019-rescue:SMD-LED-YELLOW-DIFFUSED-PURE-WHITE_0402_-OPL_Optoelectronics-aammf-badge-2019-rescue D21
U 1 1 00000408
P 1800 2000
F 0 "D21" H 1792 1933 20  0000 C CNN
F 1 "LED" H 1792 1933 45  0000 C CNN
F 2 "misc:LED-0402-no-silk" H 1800 2000 50  0001 C CNN
F 3 "" H 1800 2000 50  0001 C CNN
F 4 "16-219A_T2D-AR2T1QY_3T" H 4580 1400 20  0001 C CNN "MPN"
F 5 "304090016" H 4580 1400 20  0001 C CNN "SKU"
	1    1800 2000
	1    0    0    -1  
$EndComp
Text HLabel 1650 2000 3    20   Input ~ 0
L5
Text HLabel 1950 2000 3    20   Input ~ 0
L2
$Comp
L aammf-badge-2019-rescue:SMD-LED-YELLOW-DIFFUSED-PURE-WHITE_0402_-OPL_Optoelectronics-aammf-badge-2019-rescue D28
U 1 1 00000409
P 2200 2000
F 0 "D28" H 2192 1933 20  0000 C CNN
F 1 "LED" H 2192 1933 45  0000 C CNN
F 2 "misc:LED-0402-no-silk" H 2200 2000 50  0001 C CNN
F 3 "" H 2200 2000 50  0001 C CNN
F 4 "16-219A_T2D-AR2T1QY_3T" H 4580 1400 20  0001 C CNN "MPN"
F 5 "304090016" H 4580 1400 20  0001 C CNN "SKU"
	1    2200 2000
	1    0    0    -1  
$EndComp
Text HLabel 2050 2000 3    20   Input ~ 0
L5
Text HLabel 2350 2000 3    20   Input ~ 0
L3
$Comp
L aammf-badge-2019-rescue:SMD-LED-YELLOW-DIFFUSED-PURE-WHITE_0402_-OPL_Optoelectronics-aammf-badge-2019-rescue D35
U 1 1 0000040A
P 2600 2000
F 0 "D35" H 2592 1933 20  0000 C CNN
F 1 "LED" H 2592 1933 45  0000 C CNN
F 2 "misc:LED-0402-no-silk" H 2600 2000 50  0001 C CNN
F 3 "" H 2600 2000 50  0001 C CNN
F 4 "16-219A_T2D-AR2T1QY_3T" H 4580 1400 20  0001 C CNN "MPN"
F 5 "304090016" H 4580 1400 20  0001 C CNN "SKU"
	1    2600 2000
	1    0    0    -1  
$EndComp
Text HLabel 2450 2000 3    20   Input ~ 0
L5
Text HLabel 2750 2000 3    20   Input ~ 0
L4
$Comp
L aammf-badge-2019-rescue:SMD-LED-YELLOW-DIFFUSED-PURE-WHITE_0402_-OPL_Optoelectronics-aammf-badge-2019-rescue D42
U 1 1 0000040B
P 3000 2000
F 0 "D42" H 2992 1933 20  0000 C CNN
F 1 "LED" H 2992 1933 45  0000 C CNN
F 2 "misc:LED-0402-no-silk" H 3000 2000 50  0001 C CNN
F 3 "" H 3000 2000 50  0001 C CNN
F 4 "16-219A_T2D-AR2T1QY_3T" H 4580 1400 20  0001 C CNN "MPN"
F 5 "304090016" H 4580 1400 20  0001 C CNN "SKU"
	1    3000 2000
	1    0    0    -1  
$EndComp
Text HLabel 2850 2000 3    20   Input ~ 0
L5
Text HLabel 3150 2000 3    20   Input ~ 0
L6
Text Notes 700  2200 0    50   ~ 0
Y6
$Comp
L aammf-badge-2019-rescue:SMD-LED-YELLOW-DIFFUSED-PURE-WHITE_0402_-OPL_Optoelectronics-aammf-badge-2019-rescue D8
U 1 1 0000040C
P 1000 2200
F 0 "D8" H 992 2133 20  0000 C CNN
F 1 "LED" H 992 2133 45  0000 C CNN
F 2 "misc:LED-0402-no-silk" H 1000 2200 50  0001 C CNN
F 3 "" H 1000 2200 50  0001 C CNN
F 4 "16-219A_T2D-AR2T1QY_3T" H 4580 1400 20  0001 C CNN "MPN"
F 5 "304090016" H 4580 1400 20  0001 C CNN "SKU"
	1    1000 2200
	1    0    0    -1  
$EndComp
Text HLabel 850  2200 3    20   Input ~ 0
L6
Text HLabel 1150 2200 3    20   Input ~ 0
L0
$Comp
L aammf-badge-2019-rescue:SMD-LED-YELLOW-DIFFUSED-PURE-WHITE_0402_-OPL_Optoelectronics-aammf-badge-2019-rescue D15
U 1 1 0000040D
P 1400 2200
F 0 "D15" H 1392 2133 20  0000 C CNN
F 1 "LED" H 1392 2133 45  0000 C CNN
F 2 "misc:LED-0402-no-silk" H 1400 2200 50  0001 C CNN
F 3 "" H 1400 2200 50  0001 C CNN
F 4 "16-219A_T2D-AR2T1QY_3T" H 4580 1400 20  0001 C CNN "MPN"
F 5 "304090016" H 4580 1400 20  0001 C CNN "SKU"
	1    1400 2200
	1    0    0    -1  
$EndComp
Text HLabel 1250 2200 3    20   Input ~ 0
L6
Text HLabel 1550 2200 3    20   Input ~ 0
L1
$Comp
L aammf-badge-2019-rescue:SMD-LED-YELLOW-DIFFUSED-PURE-WHITE_0402_-OPL_Optoelectronics-aammf-badge-2019-rescue D22
U 1 1 0000040E
P 1800 2200
F 0 "D22" H 1792 2133 20  0000 C CNN
F 1 "LED" H 1792 2133 45  0000 C CNN
F 2 "misc:LED-0402-no-silk" H 1800 2200 50  0001 C CNN
F 3 "" H 1800 2200 50  0001 C CNN
F 4 "16-219A_T2D-AR2T1QY_3T" H 4580 1400 20  0001 C CNN "MPN"
F 5 "304090016" H 4580 1400 20  0001 C CNN "SKU"
	1    1800 2200
	1    0    0    -1  
$EndComp
Text HLabel 1650 2200 3    20   Input ~ 0
L6
Text HLabel 1950 2200 3    20   Input ~ 0
L2
$Comp
L aammf-badge-2019-rescue:SMD-LED-YELLOW-DIFFUSED-PURE-WHITE_0402_-OPL_Optoelectronics-aammf-badge-2019-rescue D29
U 1 1 0000040F
P 2200 2200
F 0 "D29" H 2192 2133 20  0000 C CNN
F 1 "LED" H 2192 2133 45  0000 C CNN
F 2 "misc:LED-0402-no-silk" H 2200 2200 50  0001 C CNN
F 3 "" H 2200 2200 50  0001 C CNN
F 4 "16-219A_T2D-AR2T1QY_3T" H 4580 1400 20  0001 C CNN "MPN"
F 5 "304090016" H 4580 1400 20  0001 C CNN "SKU"
	1    2200 2200
	1    0    0    -1  
$EndComp
Text HLabel 2050 2200 3    20   Input ~ 0
L6
Text HLabel 2350 2200 3    20   Input ~ 0
L3
$Comp
L aammf-badge-2019-rescue:SMD-LED-YELLOW-DIFFUSED-PURE-WHITE_0402_-OPL_Optoelectronics-aammf-badge-2019-rescue D36
U 1 1 00000410
P 2600 2200
F 0 "D36" H 2592 2133 20  0000 C CNN
F 1 "LED" H 2592 2133 45  0000 C CNN
F 2 "misc:LED-0402-no-silk" H 2600 2200 50  0001 C CNN
F 3 "" H 2600 2200 50  0001 C CNN
F 4 "16-219A_T2D-AR2T1QY_3T" H 4580 1400 20  0001 C CNN "MPN"
F 5 "304090016" H 4580 1400 20  0001 C CNN "SKU"
	1    2600 2200
	1    0    0    -1  
$EndComp
Text HLabel 2450 2200 3    20   Input ~ 0
L6
Text HLabel 2750 2200 3    20   Input ~ 0
L4
$Comp
L aammf-badge-2019-rescue:SMD-LED-YELLOW-DIFFUSED-PURE-WHITE_0402_-OPL_Optoelectronics-aammf-badge-2019-rescue D43
U 1 1 00000411
P 3000 2200
F 0 "D43" H 2992 2133 20  0000 C CNN
F 1 "LED" H 2992 2133 45  0000 C CNN
F 2 "misc:LED-0402-no-silk" H 3000 2200 50  0001 C CNN
F 3 "" H 3000 2200 50  0001 C CNN
F 4 "16-219A_T2D-AR2T1QY_3T" H 4580 1400 20  0001 C CNN "MPN"
F 5 "304090016" H 4580 1400 20  0001 C CNN "SKU"
	1    3000 2200
	1    0    0    -1  
$EndComp
Text HLabel 2850 2200 3    20   Input ~ 0
L6
Text HLabel 3150 2200 3    20   Input ~ 0
L5
$EndSCHEMATC
