(module cogbadge-outline-spacy2 (layer F.Cu) (tedit 5B7FC8FC)
  (attr smd)
  (descr "Imported from ../cog-badge-outline-spacy.svg")
  (tags svg2mod)
  (fp_text reference cogbadge-outline-spacy2 (at 0 -65.0927789681) (layer F.SilkS) hide
    (effects (font (size 1.524 1.524) (thickness 0.3048)))
  )
  (fp_text value G*** (at 0 65.0927789681) (layer F.SilkS) hide
    (effects (font (size 1.524 1.524) (thickness 0.3048)))
  )
  (fp_poly
    (pts 
      (xy -23.3174963333 -33.0088677452)
      (xy -23.1767013111 -30.6597826118)
      (xy -15.3296789333 -26.2840089006)
      (xy -13.8419162666 -24.5145771672)
      (xy -10.9206058222 -18.5632612115)
      (xy -0.192622311111 -22.0489935227)
      (xy -1.32733344444 -28.5808095451)
      (xy -1.1637518 -30.8867965229)
      (xy 2.61260731111 -39.0392355565)
      (xy 6.3004079111 -39.0394785498)
      (xy 10.0765807555 -30.8870533452)
      (xy 10.24001 -28.5806769007)
      (xy 9.10566293332 -22.0488298338)
      (xy 19.833717 -18.5633741004)
      (xy 22.7547339333 -24.5142610783)
      (xy 24.2428747777 -26.2844604562)
      (xy 32.0899169111 -30.6598023674)
      (xy 35.0730678888 -28.4923893229)
      (xy 33.3365630222 -19.677234656)
      (xy 32.1129716444 -17.7153753449)
      (xy 27.3560850444 -13.0979855447)
      (xy 33.9864163777 -3.97248238898)
      (xy 34.7461642444 -4.37408743344)
      (xy 39.8475510444 -7.06965961128)
      (xy 42.0915479111 -7.6266449224)
      (xy 51.011977111 -6.55435005571)
      (xy 52.1515170666 -3.04720554452)
      (xy 45.5650176666 3.06359418896)
      (xy 43.4221974666 3.93197503342)
      (xy 36.8597970222 4.87086910011)
      (xy 36.8597490444 16.1512885004)
      (xy 43.4220168444 17.0902841671)
      (xy 45.5652434444 17.9587807226)
      (xy 52.1515255333 24.0696961672)
      (xy 51.012078711 27.5766261895)
      (xy 42.0919289111 28.6492710118)
      (xy 39.8475002444 28.0918595451)
      (xy 33.9865038666 24.9944198561)
      (xy 27.3560229555 34.1200048563)
      (xy 32.1130534888 38.7376289009)
      (xy 33.3364896444 40.6995898121)
      (xy 35.0733783333 49.5146146567)
      (xy 32.0897419333 51.6820531012)
      (xy 24.2427195555 47.3062822122)
      (xy 22.7549540666 45.5368476566)
      (xy 19.8336492666 39.5855345231)
      (xy 9.10566575554 43.0712668343)
      (xy 10.2403712444 49.6030828567)
      (xy 10.0767896 51.9090698345)
      (xy 6.3004333111 60.0615074569)
      (xy 2.61262988888 60.0617529903)
      (xy -1.16406224444 51.9094988123)
      (xy -1.32749431111 49.6031195456)
      (xy -0.192625133333 43.0711031454)
      (xy -10.9206792 39.585647412)
      (xy -13.8422182444 45.5367065455)
      (xy -15.3298369778 47.3067337678)
      (xy -23.1768762889 51.6820785012)
      (xy -26.1600300889 49.5146626345)
      (xy -24.4235224 40.6995107898)
      (xy -23.2006281111 38.7372930565)
      (xy -18.4430472444 34.1202560341)
      (xy -25.0735479111 24.9942335895)
      (xy -30.9345118333 28.0919329229)
      (xy -33.1785087 28.6489154118)
      (xy -42.0989364888 27.5766233673)
      (xy -43.2384764444 24.0694788561)
      (xy -36.6519773266 17.9586791226)
      (xy -34.5091596666 17.0902982782)
      (xy -27.9469279911 16.1508792782)
      (xy -27.9467115266 4.87098481122)
      (xy -34.5096719 3.93163354454)
      (xy -36.6522056444 3.06349541118)
      (xy -43.2384857577 -3.04742285563)
      (xy -42.0990383711 -6.55435005571)
      (xy -33.1788888533 -7.6270005224)
      (xy -30.9349839911 -7.06941407794)
      (xy -25.0734632444 -3.97214654454)
      (xy -18.4429851555 -13.0977315447)
      (xy -23.2005378 -17.7151834337)
      (xy -24.4239739555 -19.6771443449)
      (xy -26.1603377111 -28.4923413451)
      (xy -23.1767013111 -30.6597826118)
      (xy -23.3174963333 -33.0088677452)
      (xy -28.3510513044 -29.3517842118)
      (xy -26.2994676222 -18.9367766782)
      (xy -24.7553592889 -16.460592767)
      (xy -21.0583723555 -12.8721513225)
      (xy -25.6671205111 -6.52879483348)
      (xy -30.2218132333 -8.93614192243)
      (xy -33.0537935711 -9.63938325578)
      (xy -43.5937589444 -8.37194583353)
      (xy -45.5162191866 -2.45513718895)
      (xy -37.7343686933 4.76495674455)
      (xy -35.0298297511 5.86083410014)
      (xy -29.9300431511 6.59053376682)
      (xy -29.9301275355 14.4317254337)
      (xy -35.0298365244 15.1613912337)
      (xy -37.7346260799 16.2569948337)
      (xy -45.5162812755 23.4771226339)
      (xy -43.5937106844 29.3941852785)
      (xy -33.0541638466 30.6619754785)
      (xy -30.2219645044 29.9584999007)
      (xy -25.6673265333 27.5512769895)
      (xy -21.0584908889 33.8943625452)
      (xy -24.7552294666 37.4828039898)
      (xy -26.2992765577 39.9585504565)
      (xy -28.3508910022 50.3743115234)
      (xy -23.3177757333 54.0311156568)
      (xy -14.0457823111 48.8612589234)
      (xy -12.1680195778 46.6277268566)
      (xy -9.89819655554 42.0029597676)
      (xy -2.44110933333 44.4258911677)
      (xy -3.3228026 49.5020360123)
      (xy -3.11671828889 52.4123905901)
      (xy 1.34547468889 62.0447225237)
      (xy 7.56728653332 62.0447168792)
      (xy 12.0294795111 52.4123228568)
      (xy 12.2354735111 49.5019598123)
      (xy 11.3541499555 44.4260266344)
      (xy 18.8108956889 42.0031855454)
      (xy 21.0814468444 46.6277296789)
      (xy 22.9587693111 48.8611799011)
      (xy 32.2305341333 54.0311410568)
      (xy 37.2640888222 50.3740575234)
      (xy 35.2118139777 39.9586943898)
      (xy 33.6678749777 37.483035412)
      (xy 29.9714101555 33.8944246341)
      (xy 34.5801583111 27.5510653229)
      (xy 39.1348524444 29.9584124118)
      (xy 41.9668310888 30.6616565674)
      (xy 52.5062732221 29.3943884785)
      (xy 54.4292592444 23.4774105005)
      (xy 46.6472382888 16.2567916337)
      (xy 43.9428692444 15.1614392115)
      (xy 38.8429133111 14.4312174337)
      (xy 38.8426423777 6.59071721126)
      (xy 43.9428748888 5.86088207791)
      (xy 46.6471423333 4.76545063344)
      (xy 54.4291491777 -2.45537143339)
      (xy 52.5065808444 -8.37243690019)
      (xy 41.9666786888 -9.63953001133)
      (xy 39.1350048444 -8.9362265891)
      (xy 34.5798422222 -6.5288343446)
      (xy 29.9713593555 -12.872614167)
      (xy 33.6682700888 -16.4605306782)
      (xy 35.2121441777 -18.9368020782)
      (xy 37.2639307777 -29.3520382118)
      (xy 32.2302886 -33.0086701897)
      (xy 22.9588229333 -27.8389856118)
      (xy 21.0810573777 -25.605453545)
      (xy 18.8112343555 -20.980686456)
      (xy 11.3541471333 -23.4036178561)
      (xy 12.2353182889 -28.4795933673)
      (xy 12.0290646444 -31.3904700563)
      (xy 7.56756593332 -41.0224497765)
      (xy 1.34575408889 -41.022442721)
      (xy -3.11643606666 -31.3900495452)
      (xy -3.32243288888 -28.4796893229)
      (xy -2.44110933333 -23.403756145)
      (xy -9.89785224443 -20.9809122338)
      (xy -12.1684062222 -25.6054591895)
      (xy -14.0457258666 -27.8389094118)
      (xy -23.3174963333 -33.0088677452)
    )
    (layer F.SilkS)
    (width 0.0)
  )
  (fp_poly
    (pts 
      (xy 41.6042277647 -4.17074406225)
      (xy 46.3595115905 -5.71582941058)
      (xy 47.9045969388 -0.960545584658)
      (xy 43.149313113 0.584539763666)
      (xy 41.6042277647 -4.17074406225)
    )
    (layer F.SilkS)
    (width 0.0)
  )
  (fp_poly
    (pts 
      (xy -38.9916846684 21.9827890167)
      (xy -34.2364021846 20.4377041044)
      (xy -32.6913168363 25.1929879303)
      (xy -37.4465993201 26.7380728426)
      (xy -38.9916846684 21.9827890167)
    )
    (layer F.SilkS)
    (width 0.0)
  )
  (fp_poly
    (pts 
      (xy 25.8952545867 -23.1526568095)
      (xy 28.8341816163 -27.1977427997)
      (xy 32.8792676064 -24.25881577)
      (xy 29.9403405768 -20.2137297798)
      (xy 25.8952545867 -23.1526568095)
    )
    (layer F.SilkS)
    (width 0.0)
  )
  (fp_poly
    (pts 
      (xy -23.9355469175 45.3790843395)
      (xy -20.9966207173 41.3339994909)
      (xy -16.9515347271 44.2729265206)
      (xy -19.8904609273 48.3180113692)
      (xy -23.9355469175 45.3790843395)
    )
    (layer F.SilkS)
    (width 0.0)
  )
  (fp_poly
    (pts 
      (xy 1.97246337455 -29.3554558282)
      (xy 1.97246339 -34.3554570913)
      (xy 6.97246465305 -34.3554570759)
      (xy 6.9724646376 -29.3554558127)
      (xy 1.97246337455 -29.3554558282)
    )
    (layer F.SilkS)
    (width 0.0)
  )
  (fp_poly
    (pts 
      (xy 1.94044500176 55.3776974425)
      (xy 1.94044501722 50.3776975905)
      (xy 6.94044628026 50.3776976059)
      (xy 6.94044626481 55.377697458)
      (xy 1.94044500176 55.3776974425)
    )
    (layer F.SilkS)
    (width 0.0)
  )
  (fp_poly
    (pts 
      (xy -20.9861215162 -20.2815620373)
      (xy -23.9250484897 -24.3266480532)
      (xy -19.8799624739 -27.2655750267)
      (xy -16.9410355004 -23.2204890108)
      (xy -20.9861215162 -20.2815620373)
    )
    (layer F.SilkS)
    (width 0.0)
  )
  (fp_poly
    (pts 
      (xy 28.7928726437 48.2878190936)
      (xy 25.8539464997 44.2427342193)
      (xy 29.8990325155 41.3038072458)
      (xy 32.8379586595 45.34889212)
      (xy 28.7928726437 48.2878190936)
    )
    (layer F.SilkS)
    (width 0.0)
  )
  (fp_poly
    (pts 
      (xy -34.2265080242 0.55409034268)
      (xy -38.9817918093 -0.990995051963)
      (xy -37.4367064147 -5.74627883714)
      (xy -32.6814226296 -4.20119344249)
      (xy -34.2265080242 0.55409034268)
    )
    (layer F.SilkS)
    (width 0.0)
  )
  (fp_poly
    (pts 
      (xy 46.3496154375 26.7685262729)
      (xy 41.5943329945 25.2234413144)
      (xy 43.1394183891 20.4681575292)
      (xy 47.8947008321 22.0132424878)
      (xy 46.3496154375 26.7685262729)
    )
    (layer F.SilkS)
    (width 0.0)
  )
  (fp_poly
    (pts 
      (xy -22.8331409111 -6.11252834459)
      (xy -22.3179047333 -4.891657589)
      (xy -21.6534774222 -4.22603365565)
      (xy -21.6565818666 -4.21968365565)
      (xy -22.5870487777 -4.33996112232)
      (xy -22.3179160222 -4.89164912234)
      (xy -22.3179047333 -4.891657589)
      (xy -22.8331409111 -6.11252834459)
      (xy -23.0651529777 -5.63693592235)
      (xy -22.6301666889 -5.20099854457)
      (xy -23.0199466222 -4.40200203344)
      (xy -23.6281693777 -4.4828333001)
      (xy -23.8833829333 -3.95968078898)
      (xy -21.1223690666 -3.64114785564)
      (xy -20.8826241111 -4.1325927001)
      (xy -22.8331409111 -6.11252834459)
    )
    (layer F.SilkS)
    (width 0.0)
  )
  (fp_poly
    (pts 
      (xy -24.1803569111 -3.33856047786)
      (xy -23.8779021777 -2.96211836673)
      (xy -23.7770200805 -3.08235596952)
      (xy -23.6302380666 -3.08192452229)
      (xy -23.5361996378 -3.00129403028)
      (xy -23.4942150694 -2.85847825284)
      (xy -23.5073818385 -2.64796988791)
      (xy -23.5787974222 -2.36426163339)
      (xy -23.8994583111 -2.50265776673)
      (xy -23.9366770722 -2.7113177084)
      (xy -23.8778965333 -2.96211836673)
      (xy -23.8779021777 -2.96211836673)
      (xy -24.1803569111 -3.33856047786)
      (xy -24.248999 -3.08983144822)
      (xy -24.2398963926 -2.85109496673)
      (xy -24.1618149111 -2.6158881445)
      (xy -24.3025697166 -2.66366977784)
      (xy -24.4312298889 -2.68605987784)
      (xy -24.6548994666 -2.16782085561)
      (xy -24.4730541639 -2.13405825838)
      (xy -24.2128604444 -2.03467687782)
      (xy -23.5488705777 -1.74810278893)
      (xy -23.3374917385 -1.67654706917)
      (xy -23.1468428271 -1.65513659387)
      (xy -22.9765440194 -1.68648238893)
      (xy -22.8262154913 -1.77319548029)
      (xy -22.6954774188 -1.91788689387)
      (xy -22.5839499777 -2.12316765561)
      (xy -22.4840460892 -2.42669866985)
      (xy -22.4516382027 -2.69236013617)
      (xy -22.4693503371 -2.92201869)
      (xy -22.5198065111 -3.11754096674)
      (xy -22.9128517555 -3.02589776674)
      (xy -22.8754690181 -2.80982195274)
      (xy -22.8813346411 -2.58850307701)
      (xy -22.9437155777 -2.36681292228)
      (xy -23.0775771055 -2.21133811116)
      (xy -23.2516595333 -2.22307150005)
      (xy -23.2937670889 -2.24124661116)
      (xy -23.2007437481 -2.556137224)
      (xy -23.1491112502 -2.82947595462)
      (xy -23.1385736813 -3.06288262693)
      (xy -23.1688351277 -3.25797706483)
      (xy -23.2395996758 -3.41637909224)
      (xy -23.3505714119 -3.53970853306)
      (xy -23.5014544222 -3.6295852112)
      (xy -23.715759117 -3.67512952786)
      (xy -23.9084481472 -3.6313759112)
      (xy -24.0673652316 -3.51397076119)
      (xy -24.1803540889 -3.33856047786)
      (xy -24.1803569111 -3.33856047786)
    )
    (layer F.SilkS)
    (width 0.0)
  )
  (fp_poly
    (pts 
      (xy -24.7843689111 -1.83500747782)
      (xy -24.9890026 -1.30518041114)
      (xy -23.8997292444 -0.884471744465)
      (xy -23.8260684082 -0.720159562568)
      (xy -23.7992721399 -0.530246689313)
      (xy -23.8399828 -0.324387633341)
      (xy -23.9032372666 -0.189984944449)
      (xy -23.4351886444 -0.001646766667)
      (xy -23.4288386444 -0.018100322223)
      (xy -23.3752489659 -0.247884597228)
      (xy -23.3896175166 -0.443999055566)
      (xy -23.4486720757 -0.607027897236)
      (xy -23.5291404222 -0.737555322239)
      (xy -23.5280115333 -0.740857322239)
      (xy -23.2351241333 -0.627737011126)
      (xy -23.0304904444 -1.15756407781)
      (xy -24.7845156666 -1.83501876671)
      (xy -24.7843689111 -1.83500747782)
    )
    (layer F.SilkS)
    (width 0.0)
  )
  (fp_poly
    (pts 
      (xy -25.3219062889 -0.439754433344)
      (xy -25.5033497777 0.098457455558)
      (xy -24.3065808 0.501911055567)
      (xy -24.2416788611 0.73040980835)
      (xy -24.2612615555 0.9527638778)
      (xy -24.3766375277 1.09070386947)
      (xy -24.5751688666 1.0777572778)
      (xy -25.7050765777 0.696839122238)
      (xy -25.8865200666 1.23505101114)
      (xy -24.5861219111 1.67344372226)
      (xy -24.3369795288 1.71433088719)
      (xy -24.1397031527 1.66060014171)
      (xy -23.9921456892 1.52658687538)
      (xy -23.8921600444 1.32662647781)
      (xy -23.8504914326 1.10433145454)
      (xy -23.8688350833 0.906827625021)
      (xy -23.9263952757 0.73868354967)
      (xy -24.0023762889 0.604467788903)
      (xy -23.0295845111 0.932415655577)
      (xy -22.8481410222 0.394203766676)
      (xy -25.3219062889 -0.439754433344)
    )
    (layer F.SilkS)
    (width 0.0)
  )
  (fp_poly
    (pts 
      (xy -26.1868581333 2.13036714449)
      (xy -26.2120418675 2.42327388195)
      (xy -26.1463431473 2.66405166632)
      (xy -26.0403368222 2.84440065562)
      (xy -26.3225423933 2.76632387784)
      (xy -26.4739910222 3.31373338897)
      (xy -24.6617631111 3.81511245564)
      (xy -24.5103142 3.26770576674)
      (xy -25.7411332889 2.92717925562)
      (xy -25.8203710583 2.70256811395)
      (xy -25.8156173777 2.48197652228)
      (xy -25.7055112 2.33537336672)
      (xy -25.5047524222 2.33738561117)
      (xy -24.3419347777 2.65909636673)
      (xy -24.1904858666 2.1116868556)
      (xy -25.5131062 1.74576316671)
      (xy -25.7641251395 1.71869466011)
      (xy -25.95813325 1.7832362806)
      (xy -26.0980658187 1.92519233859)
      (xy -26.1868581333 2.13036714449)
    )
    (layer F.SilkS)
    (width 0.0)
  )
  (fp_poly
    (pts 
      (xy -26.76914128 4.44521307788)
      (xy -26.7992301957 4.65570905803)
      (xy -26.7939513833 4.85716585238)
      (xy -26.7486108127 5.04047654178)
      (xy -26.6585144544 5.19653420712)
      (xy -26.5189682786 5.31623192924)
      (xy -26.3252782555 5.39046278901)
      (xy -26.1033453265 5.39412594315)
      (xy -25.930802325 5.31111359541)
      (xy -25.7968130691 5.16406507061)
      (xy -25.6905413769 4.97561969354)
      (xy -25.6011510666 4.768416789)
      (xy -25.4744826777 4.53516012233)
      (xy -25.3333024222 4.48379285566)
      (xy -25.2289059527 4.57424825288)
      (xy -25.2254004 4.76727943344)
      (xy -25.2871527127 4.93769231905)
      (xy -25.3945002205 5.10378281452)
      (xy -25.5432785777 5.26485414457)
      (xy -25.2769511111 5.55037836679)
      (xy -25.1335587625 5.41509607061)
      (xy -25.0131248389 5.25314509734)
      (xy -24.9160218736 5.05225856991)
      (xy -24.8426224 4.80016961122)
      (xy -24.8172892753 4.56297176766)
      (xy -24.8480782297 4.3502818761)
      (xy -24.9342322752 4.17214343521)
      (xy -25.0749944241 4.03859994365)
      (xy -25.2696076889 3.95969490009)
      (xy -25.4980105849 3.95337926347)
      (xy -25.6739072782 4.03216541245)
      (xy -25.8088679769 4.1736006953)
      (xy -25.9144628889 4.35523246028)
      (xy -26.0022622222 4.55460805566)
      (xy -26.1400517189 4.80575090844)
      (xy -26.2987462622 4.85465261122)
      (xy -26.4157592644 4.743391439)
      (xy -26.4141170133 4.52260123344)
      (xy -26.3348989916 4.30089958076)
      (xy -26.2044994054 4.09837900462)
      (xy -26.037286 3.93678127787)
      (xy -26.299414 3.64856183342)
      (xy -26.444453715 3.78026965286)
      (xy -26.5759848633 3.95249470565)
      (xy -26.6866624 4.17191613343)
      (xy -26.76914128 4.44521307788)
    )
    (layer F.SilkS)
    (width 0.0)
  )
  (fp_poly
    (pts 
      (xy -27.1498717577 6.55783267793)
      (xy -27.2067228844 7.06974145572)
      (xy -25.4080320444 7.26949834461)
      (xy -25.4088787111 7.27652567795)
      (xy -25.6606015958 7.29997102774)
      (xy -25.8480010189 7.32661615038)
      (xy -26.0321975333 7.35992798906)
      (xy -27.2671460977 7.61321961129)
      (xy -27.3232182911 8.11811516686)
      (xy -26.1743246444 8.63969852242)
      (xy -25.9960096411 8.71379617592)
      (xy -25.8147513736 8.78269843189)
      (xy -25.6117626222 8.84770476687)
      (xy -25.6126092889 8.85470387798)
      (xy -27.38325232 8.65806272242)
      (xy -27.4443864511 9.2085399891)
      (xy -24.8497823777 9.496688878)
      (xy -24.7641166444 8.7253191002)
      (xy -26.6115348444 7.97353272241)
      (xy -26.6107446222 7.96650538907)
      (xy -24.6391119555 7.59980841129)
      (xy -24.5553907333 6.84597027794)
      (xy -27.1499956533 6.55782138904)
      (xy -27.1498717577 6.55783267793)
    )
    (layer F.SilkS)
    (width 0.0)
  )
  (fp_poly
    (pts 
      (xy -25.3126748 9.80376358912)
      (xy -25.5943523333 10.3601421225)
      (xy -25.5700812222 9.79621696689)
      (xy -27.4486511111 9.71538852245)
      (xy -27.4486556266 9.71538852245)
      (xy -27.4729210933 10.2793108558)
      (xy -25.5943523333 10.3601421225)
      (xy -25.3126748 9.80376358912)
      (xy -25.3372281333 10.3747358336)
      (xy -24.8825653111 10.3942938336)
      (xy -24.8579837555 9.82332158912)
      (xy -25.3126465777 9.80376358912)
      (xy -25.3126748 9.80376358912)
    )
    (layer F.SilkS)
    (width 0.0)
  )
  (fp_poly
    (pts 
      (xy -27.4964987844 10.7375127447)
      (xy -27.4904592289 11.3054511003)
      (xy -26.2275861866 11.2920173225)
      (xy -26.0910180066 11.4859258614)
      (xy -26.03627 11.6992273003)
      (xy -26.0997139083 11.8705682919)
      (xy -26.2914214666 11.9242035669)
      (xy -27.4837429044 11.9368753447)
      (xy -27.4777400377 12.5012859225)
      (xy -26.1055132222 12.4866950336)
      (xy -25.8568120767 12.4432604163)
      (xy -25.688255075 12.3279104614)
      (xy -25.5930876691 12.1538050149)
      (xy -25.5645553111 11.9341039225)
      (xy -25.59846925 11.7104935232)
      (xy -25.6808696722 11.5300647114)
      (xy -25.7906184861 11.3902780162)
      (xy -25.9065776 11.2885939669)
      (xy -25.6102612 11.285433078)
      (xy -25.6163007555 10.7174947225)
      (xy -27.4964973733 10.737504278)
      (xy -27.4964987844 10.7375127447)
    )
    (layer F.SilkS)
    (width 0.0)
  )
  (fp_poly
    (pts 
      (xy -25.3118394222 12.788133767)
      (xy -27.4448512711 12.9316804559)
      (xy -27.4078804422 13.494914167)
      (xy -25.5316115111 13.3717552114)
      (xy -25.5685826222 12.8085215003)
      (xy -27.4448512711 12.9316804559)
      (xy -25.3118394222 12.788133767)
      (xy -25.2744054666 13.3584061003)
      (xy -24.8203014444 13.3285977892)
      (xy -24.8577325777 12.7583254559)
      (xy -25.3118394222 12.788133767)
    )
    (layer F.SilkS)
    (width 0.0)
  )
  (fp_poly
    (pts 
      (xy -27.2910364911 14.9507857226)
      (xy -27.2022572822 15.458130967)
      (xy -25.4195946889 15.1461879226)
      (xy -25.4184658 15.1531305892)
      (xy -25.6535513712 15.2461313827)
      (xy -25.8259917621 15.3241900773)
      (xy -25.9934907555 15.4077514781)
      (xy -27.1080929911 15.9967436115)
      (xy -27.02053016 16.4971405448)
      (xy -25.7715427333 16.6761174115)
      (xy -25.5796116576 16.6973189901)
      (xy -25.386309609 16.7127017736)
      (xy -25.1732400889 16.7182588337)
      (xy -25.1721112 16.7252015004)
      (xy -26.9269737755 17.0322790337)
      (xy -26.8315059 17.5778512782)
      (xy -24.2600226 17.1278733448)
      (xy -24.3938015777 16.3633785004)
      (xy -26.3778311377 16.1590270337)
      (xy -26.3790446933 16.152084367)
      (xy -24.5889892889 15.247920567)
      (xy -24.7197259111 14.5008021448)
      (xy -27.2912089289 14.9507772559)
      (xy -27.2910364911 14.9507857226)
    )
    (layer F.SilkS)
    (width 0.0)
  )
  (fp_poly
    (pts 
      (xy -26.6204389555 18.4518709226)
      (xy -26.1492689555 18.5576337004)
      (xy -26.1453538277 18.4007273171)
      (xy -26.0303264 18.3095519004)
      (xy -25.9065311656 18.3139632101)
      (xy -25.7846650083 18.3994481449)
      (xy -25.6637158968 18.5722434629)
      (xy -25.5426718 18.8385859227)
      (xy -25.8796620666 18.9302996782)
      (xy -26.0388558611 18.790365081)
      (xy -26.1492689555 18.5576337004)
      (xy -26.6204389555 18.4518709226)
      (xy -26.5190329781 18.6891356675)
      (xy -26.3630733196 18.8701171482)
      (xy -26.1553847111 19.0053341004)
      (xy -26.2952235291 19.0557344032)
      (xy -26.4097755889 19.1184431227)
      (xy -26.2615482444 19.6630783893)
      (xy -26.0982893916 19.5761433616)
      (xy -25.8329288889 19.4915832338)
      (xy -25.1351175111 19.3016674338)
      (xy -24.9252378076 19.2258257123)
      (xy -24.7628299201 19.1237025951)
      (xy -24.6492246833 18.9930196866)
      (xy -24.5857529317 18.831498591)
      (xy -24.5737454998 18.6368609127)
      (xy -24.6145332222 18.406828256)
      (xy -24.7256638666 18.1072254223)
      (xy -24.8659558277 17.8793122365)
      (xy -25.0229874472 17.7107964216)
      (xy -25.1843370666 17.5893857004)
      (xy -25.4345044889 17.9060841893)
      (xy -25.2705611819 18.0517189045)
      (xy -25.1371630996 18.2284143704)
      (xy -25.0477189333 18.4406328338)
      (xy -25.0554486472 18.6456499921)
      (xy -25.1988715111 18.7450095004)
      (xy -25.2431211333 18.7570603893)
      (xy -25.3667139039 18.4528655873)
      (xy -25.4967620709 18.20696381)
      (xy -25.6340442172 18.0179041718)
      (xy -25.7793389255 17.8842357873)
      (xy -25.9334247787 17.8045077709)
      (xy -26.0970803597 17.7772692371)
      (xy -26.2710842511 17.8010693004)
      (xy -26.467033949 17.8990709671)
      (xy -26.5904092058 18.0534140671)
      (xy -26.6414606614 18.2442866004)
      (xy -26.6204389555 18.4518765671)
      (xy -26.6204389555 18.4518709226)
    )
    (layer F.SilkS)
    (width 0.0)
  )
  (fp_poly
    (pts 
      (xy -26.1518964444 20.0033621894)
      (xy -25.9647718222 20.5396239227)
      (xy -25.4851351555 20.3722605005)
      (xy -25.1664385333 20.5039171671)
      (xy -25.7520806889 21.149164656)
      (xy -25.5591451111 21.7020803227)
      (xy -24.6605072222 20.7010155227)
      (xy -23.7954396666 21.0492890338)
      (xy -23.9965088889 20.4730589894)
      (xy -24.8522772222 20.1514300782)
      (xy -23.4999642889 19.6795545227)
      (xy -23.6870889111 19.1432927893)
      (xy -26.1518964444 20.0033621894)
    )
    (layer F.SilkS)
    (width 0.0)
  )
  (fp_poly
    (pts 
      (xy -25.1876672889 22.6629933672)
      (xy -25.0786483722 22.8725357825)
      (xy -24.9452899055 23.0490021061)
      (xy -24.7877665139 23.1928262547)
      (xy -24.6062528222 23.304442145)
      (xy -24.3809237777 22.9701329894)
      (xy -24.5419288378 22.8741660404)
      (xy -24.6931263621 22.7313683902)
      (xy -24.8077566666 22.5464920339)
      (xy -24.8520625242 22.3346524799)
      (xy -24.7846917942 22.1406901359)
      (xy -24.5841378889 21.9750146116)
      (xy -24.2732390666 21.8496684338)
      (xy -24.0377067481 21.8311804742)
      (xy -23.8695484 21.9003551268)
      (xy -23.7675166 22.0361919227)
      (xy -23.735561414 22.219491075)
      (xy -23.8076628156 22.3808026075)
      (xy -23.9859876444 22.5210497005)
      (xy -24.2732390666 21.8496684338)
      (xy -24.5841378889 21.9750146116)
      (xy -24.0942819555 23.1199280783)
      (xy -24.0164394222 23.0866230339)
      (xy -23.7267626167 22.9327583664)
      (xy -23.5229188045 22.7629273428)
      (xy -23.3935350059 22.5830034601)
      (xy -23.3272382412 22.3988602153)
      (xy -23.312655531 22.2163711054)
      (xy -23.3384138957 22.0414096274)
      (xy -23.3931403555 21.8798492783)
      (xy -23.4765179825 21.7256587387)
      (xy -23.594936699 21.577734668)
      (xy -23.7470838016 21.4493425308)
      (xy -23.9316465866 21.3537477918)
      (xy -24.1473123503 21.3042159158)
      (xy -24.3927683893 21.3140123675)
      (xy -24.666702 21.3964026116)
      (xy -24.9160576096 21.5329141917)
      (xy -25.0959126481 21.6936556438)
      (xy -25.2129810589 21.8729750361)
      (xy -25.2739767851 22.0652204366)
      (xy -25.28561377 22.2647399132)
      (xy -25.2546059568 22.4658815341)
      (xy -25.1876672889 22.6629933672)
    )
    (layer F.SilkS)
    (width 0.0)
  )
  (fp_poly
    (pts 
      (xy -24.6704358 23.7200030783)
      (xy -24.4167180222 24.2281583006)
      (xy -23.3720047333 23.7065382561)
      (xy -23.2009475448 23.7627875491)
      (xy -23.0425408107 23.8709180668)
      (xy -22.9178245111 24.0396818339)
      (xy -22.8611063111 24.1769716561)
      (xy -22.4066128222 23.957933345)
      (xy -22.4144868222 23.9421571228)
      (xy -22.548208209 23.7477567676)
      (xy -22.7028248 23.6262626144)
      (xy -22.8630928909 23.5600827821)
      (xy -23.0137687777 23.5316253894)
      (xy -23.0154621111 23.5284645005)
      (xy -22.7345578666 23.388211345)
      (xy -22.9882756444 22.880058945)
      (xy -24.6705458666 23.7200059005)
      (xy -24.6704358 23.7200030783)
    )
    (layer F.SilkS)
    (width 0.0)
  )
  (fp_poly
    (pts 
      (xy -23.5038561333 25.9300316784)
      (xy -23.2050844 26.4213467006)
      (xy -22.3158896666 25.8806258562)
      (xy -21.8906456889 26.5799217228)
      (xy -21.5018112 26.3434703006)
      (xy -21.927058 25.6441744339)
      (xy -21.3844998889 25.314242545)
      (xy -20.7869536 26.2968754117)
      (xy -20.3770201778 26.0475941673)
      (xy -21.2733382 24.5736434561)
      (xy -23.5038561333 25.9300316784)
    )
    (layer F.SilkS)
    (width 0.0)
  )
  (fp_poly
    (pts 
      (xy -22.3697179111 27.783565634)
      (xy -21.8902082444 27.7265059451)
      (xy -21.9387300055 27.5772400229)
      (xy -21.8605946666 27.452984634)
      (xy -21.7423859771 27.4159524482)
      (xy -21.5990191166 27.4560153479)
      (xy -21.4274635479 27.5787166183)
      (xy -21.2246887333 27.7895995451)
      (xy -21.5119599111 27.9882247229)
      (xy -21.7086458694 27.9092310756)
      (xy -21.8902082444 27.7265059451)
      (xy -22.3697179111 27.783565634)
      (xy -22.1951409934 27.9735668323)
      (xy -21.9878457399 28.0923395319)
      (xy -21.7469974 28.1507423895)
      (xy -21.8620982055 28.2448007062)
      (xy -21.9492547777 28.3420551895)
      (xy -21.6282467555 28.8063276784)
      (xy -21.5032191361 28.6700235173)
      (xy -21.2811190666 28.5019820562)
      (xy -20.686268 28.0906883229)
      (xy -20.5135850808 27.949330594)
      (xy -20.3944138469 27.7989851064)
      (xy -20.3307674833 27.6379463756)
      (xy -20.3246591753 27.4645089171)
      (xy -20.378102108 27.2769672462)
      (xy -20.4931094666 27.0736158784)
      (xy -20.6976016475 26.828065744)
      (xy -20.9057384639 26.6598234201)
      (xy -21.109896476 26.5531639253)
      (xy -21.3024522444 26.4923622784)
      (xy -21.4329800222 26.8742569228)
      (xy -21.2299196699 26.9570391813)
      (xy -21.0453266856 27.0792773607)
      (xy -20.8903626444 27.2496407006)
      (xy -20.82942875 27.4455452562)
      (xy -20.9316178889 27.5869668118)
      (xy -20.9693397111 27.6130441451)
      (xy -21.1871115109 27.3673100555)
      (xy -21.3915735626 27.1786953575)
      (xy -21.5839428446 27.0460908932)
      (xy -21.7654363354 26.9683875044)
      (xy -21.9372710133 26.9444760333)
      (xy -22.1006638569 26.9732473217)
      (xy -22.2568318444 27.0535922117)
      (xy -22.4090041705 27.2112122645)
      (xy -22.4739902027 27.3978137173)
      (xy -22.4586185725 27.5947963618)
      (xy -22.3697179111 27.7835599895)
      (xy -22.3697179111 27.783565634)
    )
    (layer F.SilkS)
    (width 0.0)
  )
  (fp_poly
    (pts 
      (xy -19.6956030889 27.8075883895)
      (xy -21.3952130444 29.1043797451)
      (xy -21.0535689333 29.5536859896)
      (xy -19.5568174889 28.4155797229)
      (xy -19.8984644222 27.9662734784)
      (xy -21.3952130444 29.1043797451)
      (xy -19.6956030889 27.8075883895)
      (xy -19.3496861333 28.2625108562)
      (xy -18.9874341555 27.9870591451)
      (xy -19.3333482889 27.5321366784)
      (xy -19.6956030889 27.8075883895)
    )
    (layer F.SilkS)
    (width 0.0)
  )
  (fp_poly
    (pts 
      (xy -20.7745979111 29.9133697451)
      (xy -20.4152104889 30.353182034)
      (xy -19.5110043555 29.6143186118)
      (xy -19.3317583325 29.631519011)
      (xy -19.1534279638 29.7021152274)
      (xy -18.9946110666 29.8392751229)
      (xy -18.9090525778 29.9607040563)
      (xy -18.5139499333 29.6469632562)
      (xy -18.5250977111 29.6333037007)
      (xy -18.6983446729 29.4731207173)
      (xy -18.8759196889 29.388655134)
      (xy -19.0468272048 29.3593901007)
      (xy -19.2000716666 29.3648087673)
      (xy -19.2023294444 29.3619865451)
      (xy -18.9592034666 29.163319034)
      (xy -19.3185908889 28.7235067451)
      (xy -20.7746120222 29.9132766118)
      (xy -20.7745979111 29.9133697451)
    )
    (layer F.SilkS)
    (width 0.0)
  )
  (fp_poly
    (pts 
      (xy -19.3293012222 31.6736349007)
      (xy -19.1585130774 31.8368071466)
      (xy -18.9753575139 31.9608200007)
      (xy -18.7798591378 32.0461401882)
      (xy -18.5720425555 32.0932344341)
      (xy -18.4666071555 31.7041092563)
      (xy -18.6499629613 31.6652081633)
      (xy -18.8391425794 31.5788209863)
      (xy -19.0072828444 31.4408072118)
      (xy -19.117556265 31.2545872686)
      (xy -19.1163562979 31.049260881)
      (xy -18.9799637333 30.8277443452)
      (xy -18.7261217778 30.6088104563)
      (xy -18.5091454658 30.5153282126)
      (xy -18.3276626749 30.5265566851)
      (xy -18.1872664222 30.6222160118)
      (xy -18.0978892576 30.785407876)
      (xy -18.1140995794 30.9613543032)
      (xy -18.2376459111 31.1516282118)
      (xy -18.7261217778 30.608807634)
      (xy -18.7261217778 30.6088104563)
      (xy -18.9799637333 30.8277443452)
      (xy -18.1469566222 31.7534275896)
      (xy -18.0840210666 31.6967912341)
      (xy -17.8594660434 31.4577056335)
      (xy -17.7213058248 31.2311962666)
      (xy -17.6568807448 31.0191537425)
      (xy -17.6535311373 30.8234686703)
      (xy -17.6985973362 30.6460316591)
      (xy -17.7794196754 30.488733318)
      (xy -17.8833384889 30.3534642563)
      (xy -18.0119993132 30.2344135594)
      (xy -18.1718062642 30.1325983794)
      (xy -18.3572375448 30.0601514248)
      (xy -18.5627713581 30.0292054043)
      (xy -18.7828859067 30.0518930266)
      (xy -19.0120593938 30.1403470003)
      (xy -19.2447700222 30.306700034)
      (xy -19.4367571194 30.5163538803)
      (xy -19.5551430636 30.7265216014)
      (xy -19.6081060624 30.9340193851)
      (xy -19.6038243235 31.1356634191)
      (xy -19.5504760543 31.3282698912)
      (xy -19.4562394624 31.5086549892)
      (xy -19.3292927555 31.6736349007)
      (xy -19.3293012222 31.6736349007)
    )
    (layer F.SilkS)
    (width 0.0)
  )
  (fp_poly
    (pts 
      (xy -17.9275598889 33.1064065674)
      (xy -16.5329898222 34.4247992119)
      (xy -16.2252039111 34.0992276563)
      (xy -17.1250102 33.2485760119)
      (xy -17.0013054972 33.1951522713)
      (xy -16.8101913111 33.1845203869)
      (xy -16.558663225 33.209154815)
      (xy -16.2537168222 33.2615300119)
      (xy -15.9437779394 33.3012793411)
      (xy -15.7024735141 33.2898914938)
      (xy -15.5147202814 33.2355677575)
      (xy -15.3654349762 33.1465094195)
      (xy -15.2395343333 33.0309177674)
      (xy -15.10986766 32.8553648181)
      (xy -15.0389192798 32.6673193806)
      (xy -15.0275420528 32.4709645369)
      (xy -15.0765888387 32.2704833691)
      (xy -15.1869124974 32.0700589593)
      (xy -15.3593658889 31.8738743896)
      (xy -15.5655345957 31.7145815521)
      (xy -15.7806025143 31.6137536895)
      (xy -16.0038967817 31.5655023368)
      (xy -16.2347445349 31.5639390289)
      (xy -16.4724729111 31.6031753007)
      (xy -16.3739688889 32.0895260341)
      (xy -16.110503051 32.0584654925)
      (xy -15.8810161415 32.1010059979)
      (xy -15.7017804666 32.2104018119)
      (xy -15.5936002987 32.3666135888)
      (xy -15.5845911382 32.5261643682)
      (xy -15.6712327333 32.676201123)
      (xy -15.8123127559 32.7800997789)
      (xy -15.9808499139 32.8143492535)
      (xy -16.2037552427 32.7953799074)
      (xy -16.5079397778 32.7396221008)
      (xy -16.8709775876 32.6918771694)
      (xy -17.1651249531 32.6955042868)
      (xy -17.4021806444 32.7425857869)
      (xy -17.5939434321 32.8252040036)
      (xy -17.7522120864 32.935441271)
      (xy -17.8887853778 33.065379923)
      (xy -17.9275598889 33.1063952785)
      (xy -17.9275598889 33.1064065674)
    )
    (layer F.SilkS)
    (width 0.0)
  )
  (fp_poly
    (pts 
      (xy -15.5400360889 35.336597123)
      (xy -15.2524318889 34.9930677675)
      (xy -15.3663162771 34.8493954558)
      (xy -15.405477523 34.6726565436)
      (xy -15.3689886281 34.4651730651)
      (xy -15.2559225939 34.2292670542)
      (xy -15.0653524222 33.9672605452)
      (xy -14.8424234181 33.7337806521)
      (xy -14.6333175682 33.5817030853)
      (xy -14.4386628958 33.510722774)
      (xy -14.2590874245 33.5205346473)
      (xy -14.0952191778 33.6108336341)
      (xy -13.9806283082 33.7536620787)
      (xy -13.9397823763 33.9283885884)
      (xy -13.974260517 34.1334699269)
      (xy -14.085641865 34.367362858)
      (xy -14.2755055555 34.6285241452)
      (xy -14.499400595 34.8626306169)
      (xy -14.7107102393 35.0162860091)
      (xy -14.9077649971 35.0893425277)
      (xy -15.0888953774 35.0816523785)
      (xy -15.2524318889 34.9930677675)
      (xy -15.5400360889 35.336597123)
      (xy -15.360037419 35.4616944652)
      (xy -15.1730470479 35.5433419658)
      (xy -14.9811085662 35.5826687691)
      (xy -14.786265565 35.5808040197)
      (xy -14.590561635 35.5388768618)
      (xy -14.3960403671 35.4580164399)
      (xy -14.2047453521 35.3393518984)
      (xy -14.0187201809 35.1840123817)
      (xy -13.8400084444 34.9931270341)
      (xy -13.6835218163 34.7836339238)
      (xy -13.563312985 34.5731918732)
      (xy -13.4801342411 34.3640111584)
      (xy -13.4347378753 34.1583020557)
      (xy -13.4278761782 33.9582748413)
      (xy -13.4603014403 33.7661397913)
      (xy -13.5327659524 33.5841071819)
      (xy -13.646022005 33.4143872893)
      (xy -13.8008218889 33.2591903897)
      (xy -13.980201199 33.1346115505)
      (xy -14.1670617905 33.0530726919)
      (xy -14.3592488329 33.0135377913)
      (xy -14.5546074956 33.0149708259)
      (xy -14.750982948 33.0563357731)
      (xy -14.9462203597 33.1365966102)
      (xy -15.1381649 33.2547173145)
      (xy -15.3246617384 33.4096618634)
      (xy -15.5035560444 33.6003942341)
      (xy -15.6598600101 33.810039578)
      (xy -15.7795969418 34.0208762016)
      (xy -15.8621258584 34.2306006374)
      (xy -15.9068057785 34.4369094178)
      (xy -15.912995721 34.6374990752)
      (xy -15.8800547045 34.830066142)
      (xy -15.8073417478 35.0123071506)
      (xy -15.6942158697 35.1819186335)
      (xy -15.5400360889 35.336597123)
    )
    (layer F.SilkS)
    (width 0.0)
  )
  (fp_poly
    (pts 
      (xy -14.4690592 36.146741412)
      (xy -13.3152839555 37.0072539009)
      (xy -13.0474296666 36.648112012)
      (xy -13.3782900666 36.4013481897)
      (xy -12.0854131333 34.6678546341)
      (xy -12.5180795555 34.3451645675)
      (xy -12.677812107 34.3394767444)
      (xy -12.8397052263 34.2881698942)
      (xy -13.0039081778 34.1940656119)
      (xy -13.2844173111 34.5701718786)
      (xy -13.0695273139 34.6869843619)
      (xy -12.8394290666 34.7524253453)
      (xy -13.8222679555 36.0702196786)
      (xy -14.2012049111 35.7875995231)
      (xy -14.4690592 36.146741412)
    )
    (layer F.SilkS)
    (width 0.0)
  )
  (fp_poly
    (pts 
      (xy -12.3519692 37.7138677898)
      (xy -12.1388265111 37.385372412)
      (xy -12.3260583778 37.2039252646)
      (xy -12.3897634592 37.0063713815)
      (xy -12.3376069111 36.8232478342)
      (xy -12.2003209564 36.7072002515)
      (xy -11.9956033325 36.6629405947)
      (xy -11.7288564 36.6757500342)
      (xy -11.5588796 36.9500436934)
      (xy -11.4947135555 37.1612907898)
      (xy -11.5444862667 37.3378603009)
      (xy -11.6913194856 37.4614208482)
      (xy -11.8972606996 37.4830816128)
      (xy -12.1388265111 37.385372412)
      (xy -12.3519692 37.7138677898)
      (xy -12.0835096098 37.8612853132)
      (xy -11.8315867522 37.9466920293)
      (xy -10.9514442444 36.2423837008)
      (xy -11.0600652016 36.3466598992)
      (xy -11.2170809983 36.3886954358)
      (xy -11.4399680889 36.3795803897)
      (xy -11.5709560979 36.1717013543)
      (xy -11.6226503243 35.9928435436)
      (xy -11.5730782 35.8264248342)
      (xy -11.4648123201 35.7284592292)
      (xy -11.3028201094 35.701799891)
      (xy -11.0951235778 35.7832956342)
      (xy -10.9399552913 35.9423827329)
      (xy -10.904772842 36.1049204687)
      (xy -10.9514442444 36.2423837008)
      (xy -11.8315867522 37.9466920293)
      (xy -11.6007066972 37.9705517231)
      (xy -11.3953755144 37.9333281799)
      (xy -11.2200992735 37.8354851848)
      (xy -11.0793840444 37.6774865231)
      (xy -10.9761752896 37.4409477002)
      (xy -10.9719646222 37.2178417731)
      (xy -11.0453107382 36.9988199543)
      (xy -11.1747723333 36.7745334564)
      (xy -10.9547972649 36.7838752765)
      (xy -10.7578528528 36.7412143009)
      (xy -10.5901782364 36.6464452252)
      (xy -10.4580125555 36.4994627453)
      (xy -10.3900698159 36.3494990548)
      (xy -10.3689631868 36.1795424284)
      (xy -10.4009108861 35.9966556342)
      (xy -10.4921311317 35.8079014399)
      (xy -10.6488421414 35.6203426136)
      (xy -10.8772621333 35.441041923)
      (xy -11.1290240719 35.3084891878)
      (xy -11.3629766123 35.2419265148)
      (xy -11.5739661417 35.2339511369)
      (xy -11.7568390469 35.2771602868)
      (xy -11.9064417151 35.3641511972)
      (xy -12.0176205333 35.4875211008)
      (xy -12.1103288135 35.688229696)
      (xy -12.1263716917 35.8795439953)
      (xy -12.0787468239 36.0711662696)
      (xy -11.9804518667 36.2727987897)
      (xy -12.2320180969 36.2483488203)
      (xy -12.469898225 36.2769361675)
      (xy -12.6780005573 36.3689981147)
      (xy -12.8402334 36.5349719453)
      (xy -12.9276321737 36.7290244045)
      (xy -12.9452047012 36.9296012926)
      (xy -12.894687825 37.1325383425)
      (xy -12.7778183876 37.3336712869)
      (xy -12.5963332318 37.5288358584)
      (xy -12.3519692 37.7138677898)
    )
    (layer F.SilkS)
    (width 0.0)
  )
  (fp_poly
    (pts 
      (xy 34.6808185111 15.1954159448)
      (xy 34.7393457555 14.722775567)
      (xy 33.9022294888 14.1456254781)
      (xy 33.0640802888 14.0418326114)
      (xy 32.9298554 15.1257550337)
      (xy 33.9066434444 15.2467126559)
      (xy 33.9573700666 14.8370925003)
      (xy 34.6808185111 15.1954159448)
    )
    (layer F.SilkS)
    (width 0.0)
  )
  (fp_poly
    (pts 
      (xy 34.2608436222 11.8098640558)
      (xy 34.197544 10.8849287003)
      (xy 30.9475970666 11.1073367447)
      (xy 30.9467504 11.0946649669)
      (xy 31.2295607507 11.018130003)
      (xy 31.455556246 10.950676589)
      (xy 31.6478812304 10.8867491013)
      (xy 31.8296800483 10.8207919166)
      (xy 32.0240970444 10.7472494114)
      (xy 34.1303666444 9.9029731669)
      (xy 34.0679362666 8.99070676688)
      (xy 31.8658522222 8.43490961131)
      (xy 31.6606423936 8.38942848419)
      (xy 31.4590071239 8.34706376775)
      (xy 31.2536687374 8.3086187793)
      (xy 31.0373495584 8.27489683619)
      (xy 30.8027719111 8.24670125575)
      (xy 30.8019252444 8.23402947797)
      (xy 34.0011907111 8.01508994463)
      (xy 33.9331243555 7.02046545572)
      (xy 29.2450886888 7.3412900335)
      (xy 29.3404685111 8.73503036687)
      (xy 32.8535735555 9.47479972244)
      (xy 32.8544202222 9.48747150022)
      (xy 29.4796153555 10.7686277447)
      (xy 29.5728277111 12.1306914558)
      (xy 34.2608633777 11.8098668781)
      (xy 34.2608436222 11.8098640558)
    )
    (layer F.SilkS)
    (width 0.0)
  )
  (fp_poly
    (pts 
      (xy 33.6156102444 5.42723352235)
      (xy 32.7779436444 5.1951988779)
      (xy 32.7848431415 5.39426589025)
      (xy 32.7075225102 5.54537958408)
      (xy 32.5420482 5.63062261124)
      (xy 32.3926892751 5.63361411453)
      (xy 32.2482624971 5.57357661536)
      (xy 32.1083932944 5.44716123346)
      (xy 31.9727070954 5.2510190886)
      (xy 31.8408293286 4.98180130053)
      (xy 31.7123854222 4.636158989)
      (xy 32.3263880888 4.50123983344)
      (xy 32.47237966 4.61595227476)
      (xy 32.600141175 4.76697428067)
      (xy 32.7039150357 4.95861882407)
      (xy 32.7779436444 5.1951988779)
      (xy 33.6156102444 5.42723352235)
      (xy 33.5482674753 5.19623868387)
      (xy 33.4544024024 4.99165968859)
      (xy 33.3347666777 4.81116428344)
      (xy 33.190111953 4.65242021533)
      (xy 33.0211898802 4.51309523117)
      (xy 32.8287521111 4.39085707788)
      (xy 33.0846373555 4.3126882251)
      (xy 33.2961572666 4.21013325565)
      (xy 33.0781067333 3.21780887785)
      (xy 32.9468189399 3.29206604244)
      (xy 32.7768694361 3.35958109452)
      (xy 32.5610829864 3.42375922161)
      (xy 32.2922843555 3.48800561119)
      (xy 31.0208676 3.76738303342)
      (xy 30.7805893714 3.83205294896)
      (xy 30.5698785208 3.91464539236)
      (xy 30.389208081 4.01607064883)
      (xy 30.2390510844 4.13723900356)
      (xy 30.1198805638 4.27906074177)
      (xy 30.032169552 4.44244614864)
      (xy 29.9763910814 4.62830550937)
      (xy 29.9530181848 4.83754910918)
      (xy 29.962523895 5.07108723325)
      (xy 30.0053812444 5.32983016679)
      (xy 30.0831417734 5.62118341341)
      (xy 30.1785305309 5.87833972722)
      (xy 30.2886194721 6.10392344415)
      (xy 30.4104805527 6.30055890015)
      (xy 30.5411857281 6.47087043114)
      (xy 30.6778069538 6.61748237307)
      (xy 30.8174161852 6.74301906187)
      (xy 30.9570853777 6.85010483349)
      (xy 31.4350004888 6.30298601126)
      (xy 31.2603802302 6.14313940859)
      (xy 31.1029940408 5.96515043258)
      (xy 30.9681352808 5.76754385124)
      (xy 30.8610973102 5.54884443257)
      (xy 30.7871734888 5.30757694457)
      (xy 30.7793948172 5.03766734621)
      (xy 30.8852613901 4.86414729847)
      (xy 31.0859790888 4.77381005567)
      (xy 31.1666071555 4.75608650011)
      (xy 31.2784741664 5.09433245969)
      (xy 31.3958739186 5.39673313963)
      (xy 31.5190586579 5.66382005847)
      (xy 31.6482806304 5.89612473471)
      (xy 31.7837920819 6.09417868687)
      (xy 31.9258452583 6.25851343348)
      (xy 32.0746924055 6.38966049305)
      (xy 32.2305857695 6.4881513841)
      (xy 32.3937775961 6.55451762515)
      (xy 32.5645201313 6.58929073472)
      (xy 32.743065621 6.59300223133)
      (xy 32.9296663111 6.56618363349)
      (xy 33.1512350036 6.49073239455)
      (xy 33.3320192444 6.3751122281)
      (xy 33.4717743641 6.22597314543)
      (xy 33.5702556934 6.0499651578)
      (xy 33.6272185628 5.85373827649)
      (xy 33.6424183029 5.64394251277)
      (xy 33.6156102444 5.4272278779)
      (xy 33.6156102444 5.42723352235)
    )
    (layer F.SilkS)
    (width 0.0)
  )
  (fp_poly
    (pts 
      (xy 32.8948175111 2.59990025562)
      (xy 32.5796176222 1.62735118893)
      (xy 31.7097635777 1.90926861115)
      (xy 31.1415401777 1.65954145559)
      (xy 32.2213506222 0.521909322234)
      (xy 31.8963632666 -0.480843166678)
      (xy 30.2390048 1.28453021114)
      (xy 28.6962624222 0.623046477792)
      (xy 29.0349544888 1.66808432226)
      (xy 30.5620363555 2.28124032227)
      (xy 28.1095224222 3.07609098896)
      (xy 28.4247223111 4.04863723343)
      (xy 32.8948175111 2.59990025562)
    )
    (layer F.SilkS)
    (width 0.0)
  )
  (fp_poly
    (pts 
      (xy 31.2338212 -2.21392467783)
      (xy 31.128569195 -2.43750174761)
      (xy 31.0088368204 -2.64162547823)
      (xy 30.874683565 -2.82644130875)
      (xy 30.7261689175 -2.99209467824)
      (xy 30.5633523668 -3.13873102576)
      (xy 30.3862934017 -3.26649579039)
      (xy 30.1950515111 -3.37553441119)
      (xy 29.7854285333 -2.77651492229)
      (xy 29.9581071482 -2.682303771)
      (xy 30.1311545034 -2.55651154664)
      (xy 30.2941785445 -2.40105537348)
      (xy 30.436787217 -2.21785237579)
      (xy 30.5485884666 -2.00881967782)
      (xy 30.6098718201 -1.81489819068)
      (xy 30.6257788576 -1.62698325477)
      (xy 30.5914862444 -1.4474496917)
      (xy 30.502170646 -1.27867232307)
      (xy 30.3530087279 -1.1230259705)
      (xy 30.1391771555 -0.982885455578)
      (xy 29.5780601111 -0.761027744462)
      (xy 29.3087372732 -0.721815517972)
      (xy 29.0838130935 -0.744554636551)
      (xy 28.9027478727 -0.821084317263)
      (xy 28.7650019116 -0.943243777177)
      (xy 28.6700355111 -1.10287223336)
      (xy 28.6146281317 -1.3060550291)
      (xy 28.6259899694 -1.49430099924)
      (xy 28.7049653879 -1.66796411817)
      (xy 28.8523987509 -1.82739836031)
      (xy 29.0691344222 -1.97295770005)
      (xy 29.5780601111 -0.761027744462)
      (xy 30.1391771555 -0.982885455578)
      (xy 29.2712958444 -3.0496044334)
      (xy 29.1307830444 -2.99059741118)
      (xy 28.8056205722 -2.83531897153)
      (xy 28.5358565486 -2.66838987918)
      (xy 28.3174416628 -2.49193592402)
      (xy 28.1463266041 -2.30808289594)
      (xy 28.0184620617 -2.11895658484)
      (xy 27.929798725 -1.9266827806)
      (xy 27.8762872831 -1.73338727312)
      (xy 27.8538784255 -1.5411958523)
      (xy 27.8585228413 -1.35223430802)
      (xy 27.8861712198 -1.16862843017)
      (xy 27.9327742504 -0.992504008652)
      (xy 27.9942826222 -0.825986833352)
      (xy 28.0729397047 -0.663554285754)
      (xy 28.1733969546 -0.501428311843)
      (xy 28.295217192 -0.344351548272)
      (xy 28.437963237 -0.197066631692)
      (xy 28.6011979098 -0.064316198754)
      (xy 28.7844840305 0.04915711389)
      (xy 28.9873844193 0.138610669589)
      (xy 29.2094618963 0.199301831692)
      (xy 29.4502792816 0.226487963547)
      (xy 29.7093993953 0.215426428503)
      (xy 29.9863850577 0.161374589909)
      (xy 30.2807990888 0.059589811113)
      (xy 30.5594363376 -0.075995581612)
      (xy 30.7939013008 -0.228161039923)
      (xy 30.9865791875 -0.394871134037)
      (xy 31.1398552065 -0.57409043417)
      (xy 31.256114567 -0.763783510537)
      (xy 31.3377424777 -0.961914933356)
      (xy 31.3871241477 -1.16644927284)
      (xy 31.406644786 -1.37535109921)
      (xy 31.3986896013 -1.58658498268)
      (xy 31.3656438028 -1.79811549346)
      (xy 31.3098925994 -2.00790720177)
      (xy 31.2338212 -2.21392467783)
    )
    (layer F.SilkS)
    (width 0.0)
  )
  (fp_poly
    (pts 
      (xy 30.3098341111 -4.11984472232)
      (xy 29.8538138 -5.03485432234)
      (xy 27.9726418222 -4.09732056676)
      (xy 27.7873251833 -4.14788275503)
      (xy 27.6047751801 -4.22979287823)
      (xy 27.433175083 -4.34644803397)
      (xy 27.2807081625 -4.50124531984)
      (xy 27.1555576889 -4.69758183344)
      (xy 27.0982203639 -4.82864195289)
      (xy 27.0536444222 -4.94477745567)
      (xy 26.2352677111 -4.55110567788)
      (xy 26.2494352666 -4.52268872233)
      (xy 26.4041836952 -4.27315049887)
      (xy 26.5797602806 -4.08661274207)
      (xy 26.7680277722 -3.95369908898)
      (xy 26.9608489193 -3.86503317663)
      (xy 27.1500864714 -3.81123864206)
      (xy 27.3276031777 -3.78293912231)
      (xy 27.3304254 -3.77726645564)
      (xy 26.8246098 -3.5251799223)
      (xy 27.2806329333 -2.61017032228)
      (xy 30.3098284666 -4.11985601121)
      (xy 30.3098341111 -4.11984472232)
    )
    (layer F.SilkS)
    (width 0.0)
  )
  (fp_line
    (start -23.3174681111 -33.0086391452)
    (end -28.3506666355 -29.3522498785)
    (layer Edge.Cuts)
    (width 0.093750003)
  )
  (fp_line
    (start -28.3506666355 -29.3522498785)
    (end -26.2989158777 -18.9367202338)
    (layer Edge.Cuts)
    (width 0.093750003)
  )
  (fp_line
    (start -26.2989158777 -18.9367202338)
    (end -24.7548089555 -16.4605363226)
    (layer Edge.Cuts)
    (width 0.093750003)
  )
  (fp_line
    (start -24.7548089555 -16.4605363226)
    (end -21.0585134666 -12.8724504781)
    (layer Edge.Cuts)
    (width 0.093750003)
  )
  (fp_line
    (start -21.0585134666 -12.8724504781)
    (end -25.6672616222 -6.52909116682)
    (layer Edge.Cuts)
    (width 0.093750003)
  )
  (fp_line
    (start -25.6672616222 -6.52909116682)
    (end -30.2217847288 -8.93591332243)
    (layer Edge.Cuts)
    (width 0.093750003)
  )
  (fp_line
    (start -30.2217847288 -8.93591332243)
    (end -33.0537653488 -9.639157478)
    (layer Edge.Cuts)
    (width 0.093750003)
  )
  (fp_line
    (start -33.0537653488 -9.639157478)
    (end -43.5939023133 -8.37224498908)
    (layer Edge.Cuts)
    (width 0.093750003)
  )
  (fp_line
    (start -43.5939023133 -8.37224498908)
    (end -45.5161912466 -2.45491141117)
    (layer Edge.Cuts)
    (width 0.093750003)
  )
  (fp_line
    (start -45.5161912466 -2.45491141117)
    (end -37.7343407533 4.76518252233)
    (layer Edge.Cuts)
    (width 0.093750003)
  )
  (fp_line
    (start -37.7343407533 4.76518252233)
    (end -35.0299722733 5.8605377668)
    (layer Edge.Cuts)
    (width 0.093750003)
  )
  (fp_line
    (start -35.0299722733 5.8605377668)
    (end -29.9300152111 6.5907595446)
    (layer Edge.Cuts)
    (width 0.093750003)
  )
  (fp_line
    (start -29.9300152111 6.5907595446)
    (end -29.9297442777 14.431259767)
    (layer Edge.Cuts)
    (width 0.093750003)
  )
  (fp_line
    (start -29.9297442777 14.431259767)
    (end -35.02980802 15.1616170115)
    (layer Edge.Cuts)
    (width 0.093750003)
  )
  (fp_line
    (start -35.02980802 15.1616170115)
    (end -37.7340734888 16.2570512782)
    (layer Edge.Cuts)
    (width 0.093750003)
  )
  (fp_line
    (start -37.7340734888 16.2570512782)
    (end -45.516252771 23.4773484117)
    (layer Edge.Cuts)
    (width 0.093750003)
  )
  (fp_line
    (start -45.516252771 23.4773484117)
    (end -43.5936821799 29.3944110562)
    (layer Edge.Cuts)
    (width 0.093750003)
  )
  (fp_line
    (start -43.5936821799 29.3944110562)
    (end -33.0537822822 30.6615069896)
    (layer Edge.Cuts)
    (width 0.093750003)
  )
  (fp_line
    (start -33.0537822822 30.6615069896)
    (end -30.22210618 29.9582035674)
    (layer Edge.Cuts)
    (width 0.093750003)
  )
  (fp_line
    (start -30.22210618 29.9582035674)
    (end -25.6669427111 27.5508085006)
    (layer Edge.Cuts)
    (width 0.093750003)
  )
  (fp_line
    (start -25.6669427111 27.5508085006)
    (end -21.0584626666 33.894588323)
    (layer Edge.Cuts)
    (width 0.093750003)
  )
  (fp_line
    (start -21.0584626666 33.894588323)
    (end -24.7552012444 37.4830297675)
    (layer Edge.Cuts)
    (width 0.093750003)
  )
  (fp_line
    (start -24.7552012444 37.4830297675)
    (end -26.2992477711 39.9587790565)
    (layer Edge.Cuts)
    (width 0.093750003)
  )
  (fp_line
    (start -26.2992477711 39.9587790565)
    (end -28.35103296 50.3740151901)
    (layer Edge.Cuts)
    (width 0.093750003)
  )
  (fp_line
    (start -28.35103296 50.3740151901)
    (end -23.3177475111 54.0313442568)
    (layer Edge.Cuts)
    (width 0.093750003)
  )
  (fp_line
    (start -23.3177475111 54.0313442568)
    (end -14.0459262444 48.8609597678)
    (layer Edge.Cuts)
    (width 0.093750003)
  )
  (fp_line
    (start -14.0459262444 48.8609597678)
    (end -12.1681606889 46.6274305233)
    (layer Edge.Cuts)
    (width 0.093750003)
  )
  (fp_line
    (start -12.1681606889 46.6274305233)
    (end -9.89833766665 42.0026634343)
    (layer Edge.Cuts)
    (width 0.093750003)
  )
  (fp_line
    (start -9.89833766665 42.0026634343)
    (end -2.44108111111 44.4261169455)
    (layer Edge.Cuts)
    (width 0.093750003)
  )
  (fp_line
    (start -2.44108111111 44.4261169455)
    (end -3.3224216 49.5015675234)
    (layer Edge.Cuts)
    (width 0.093750003)
  )
  (fp_line
    (start -3.3224216 49.5015675234)
    (end -3.11616795555 52.4124470345)
    (layer Edge.Cuts)
    (width 0.093750003)
  )
  (fp_line
    (start -3.11616795555 52.4124470345)
    (end 1.34602784444 62.0447789681)
    (layer Edge.Cuts)
    (width 0.093750003)
  )
  (fp_line
    (start 1.34602784444 62.0447789681)
    (end 7.56714259999 62.0444967459)
    (layer Edge.Cuts)
    (width 0.093750003)
  )
  (fp_line
    (start 7.56714259999 62.0444967459)
    (end 12.0295049111 52.4126276568)
    (layer Edge.Cuts)
    (width 0.093750003)
  )
  (fp_line
    (start 12.0295049111 52.4126276568)
    (end 12.2353295778 49.5017425011)
    (layer Edge.Cuts)
    (width 0.093750003)
  )
  (fp_line
    (start 12.2353295778 49.5017425011)
    (end 11.3540060222 44.425806501)
    (layer Edge.Cuts)
    (width 0.093750003)
  )
  (fp_line
    (start 11.3540060222 44.425806501)
    (end 18.8107489333 42.0029654121)
    (layer Edge.Cuts)
    (width 0.093750003)
  )
  (fp_line
    (start 18.8107489333 42.0029654121)
    (end 21.0813057333 46.6275123677)
    (layer Edge.Cuts)
    (width 0.093750003)
  )
  (fp_line
    (start 21.0813057333 46.6275123677)
    (end 22.9587975333 48.8614847011)
    (layer Edge.Cuts)
    (width 0.093750003)
  )
  (fp_line
    (start 22.9587975333 48.8614847011)
    (end 32.2303930222 54.0309237457)
    (layer Edge.Cuts)
    (width 0.093750003)
  )
  (fp_line
    (start 32.2303930222 54.0309237457)
    (end 37.2635921111 50.3745344789)
    (layer Edge.Cuts)
    (width 0.093750003)
  )
  (fp_line
    (start 37.2635921111 50.3745344789)
    (end 35.2118422 39.9589991898)
    (layer Edge.Cuts)
    (width 0.093750003)
  )
  (fp_line
    (start 35.2118422 39.9589991898)
    (end 33.6677338666 37.4828181009)
    (layer Edge.Cuts)
    (width 0.093750003)
  )
  (fp_line
    (start 33.6677338666 37.4828181009)
    (end 29.9714383777 33.8947294341)
    (layer Edge.Cuts)
    (width 0.093750003)
  )
  (fp_line
    (start 29.9714383777 33.8947294341)
    (end 34.5800172 27.5508480117)
    (layer Edge.Cuts)
    (width 0.093750003)
  )
  (fp_line
    (start 34.5800172 27.5508480117)
    (end 39.1347113333 29.9581951007)
    (layer Edge.Cuts)
    (width 0.093750003)
  )
  (fp_line
    (start 39.1347113333 29.9581951007)
    (end 41.9666899777 30.6614392563)
    (layer Edge.Cuts)
    (width 0.093750003)
  )
  (fp_line
    (start 41.9666899777 30.6614392563)
    (end 52.5068291999 29.3945239451)
    (layer Edge.Cuts)
    (width 0.093750003)
  )
  (fp_line
    (start 52.5068291999 29.3945239451)
    (end 54.4291181333 23.4771931894)
    (layer Edge.Cuts)
    (width 0.093750003)
  )
  (fp_line
    (start 54.4291181333 23.4771931894)
    (end 46.647266511 16.2570992559)
    (layer Edge.Cuts)
    (width 0.093750003)
  )
  (fp_line
    (start 46.647266511 16.2570992559)
    (end 43.9428974666 15.1617440115)
    (layer Edge.Cuts)
    (width 0.093750003)
  )
  (fp_line
    (start 43.9428974666 15.1617440115)
    (end 38.8429415333 14.4315222337)
    (layer Edge.Cuts)
    (width 0.093750003)
  )
  (fp_line
    (start 38.8429415333 14.4315222337)
    (end 38.8423770888 6.59049990015)
    (layer Edge.Cuts)
    (width 0.093750003)
  )
  (fp_line
    (start 38.8423770888 6.59049990015)
    (end 43.9426095999 5.8606647668)
    (layer Edge.Cuts)
    (width 0.093750003)
  )
  (fp_line
    (start 43.9426095999 5.8606647668)
    (end 46.6468742222 4.76523050011)
    (layer Edge.Cuts)
    (width 0.093750003)
  )
  (fp_line
    (start 46.6468742222 4.76523050011)
    (end 54.4290532221 -2.45506663339)
    (layer Edge.Cuts)
    (width 0.093750003)
  )
  (fp_line
    (start 54.4290532221 -2.45506663339)
    (end 52.5064848888 -8.37213210019)
    (layer Edge.Cuts)
    (width 0.093750003)
  )
  (fp_line
    (start 52.5064848888 -8.37213210019)
    (end 41.9665827333 -9.63922521134)
    (layer Edge.Cuts)
    (width 0.093750003)
  )
  (fp_line
    (start 41.9665827333 -9.63922521134)
    (end 39.1349088888 -8.9359217891)
    (layer Edge.Cuts)
    (width 0.093750003)
  )
  (fp_line
    (start 39.1349088888 -8.9359217891)
    (end 34.5795741111 -6.52905165571)
    (layer Edge.Cuts)
    (width 0.093750003)
  )
  (fp_line
    (start 34.5795741111 -6.52905165571)
    (end 29.9712634 -12.8723065447)
    (layer Edge.Cuts)
    (width 0.093750003)
  )
  (fp_line
    (start 29.9712634 -12.8723065447)
    (end 33.6680019777 -16.4607479893)
    (layer Edge.Cuts)
    (width 0.093750003)
  )
  (fp_line
    (start 33.6680019777 -16.4607479893)
    (end 35.2120482222 -18.9364972782)
    (layer Edge.Cuts)
    (width 0.093750003)
  )
  (fp_line
    (start 35.2120482222 -18.9364972782)
    (end 37.2638348222 -29.3517334118)
    (layer Edge.Cuts)
    (width 0.093750003)
  )
  (fp_line
    (start 37.2638348222 -29.3517334118)
    (end 32.2305482444 -33.0090624785)
    (layer Edge.Cuts)
    (width 0.093750003)
  )
  (fp_line
    (start 32.2305482444 -33.0090624785)
    (end 22.9587269777 -27.8386808118)
    (layer Edge.Cuts)
    (width 0.093750003)
  )
  (fp_line
    (start 22.9587269777 -27.8386808118)
    (end 21.0809614222 -25.605148745)
    (layer Edge.Cuts)
    (width 0.093750003)
  )
  (fp_line
    (start 21.0809614222 -25.605148745)
    (end 18.8109690666 -20.9809037672)
    (layer Edge.Cuts)
    (width 0.093750003)
  )
  (fp_line
    (start 18.8109690666 -20.9809037672)
    (end 11.3538818444 -23.4038351672)
    (layer Edge.Cuts)
    (width 0.093750003)
  )
  (fp_line
    (start 11.3538818444 -23.4038351672)
    (end 12.2352223333 -28.4792857451)
    (layer Edge.Cuts)
    (width 0.093750003)
  )
  (fp_line
    (start 12.2352223333 -28.4792857451)
    (end 12.0289686889 -31.3901652563)
    (layer Edge.Cuts)
    (width 0.093750003)
  )
  (fp_line
    (start 12.0289686889 -31.3901652563)
    (end 7.56677288888 -41.0224957787)
    (layer Edge.Cuts)
    (width 0.093750003)
  )
  (fp_line
    (start 7.56677288888 -41.0224957787)
    (end 1.34565813333 -41.0221288898)
    (layer Edge.Cuts)
    (width 0.093750003)
  )
  (fp_line
    (start 1.34565813333 -41.0221288898)
    (end -3.11670135555 -31.3902603652)
    (layer Edge.Cuts)
    (width 0.093750003)
  )
  (fp_line
    (start -3.11670135555 -31.3902603652)
    (end -3.32252884444 -28.4793780318)
    (layer Edge.Cuts)
    (width 0.093750003)
  )
  (fp_line
    (start -3.32252884444 -28.4793780318)
    (end -2.44120811111 -23.4034420317)
    (layer Edge.Cuts)
    (width 0.093750003)
  )
  (fp_line
    (start -2.44120811111 -23.4034420317)
    (end -9.89794819999 -20.9806009427)
    (layer Edge.Cuts)
    (width 0.093750003)
  )
  (fp_line
    (start -9.89794819999 -20.9806009427)
    (end -12.168505 -25.6051450761)
    (layer Edge.Cuts)
    (width 0.093750003)
  )
  (fp_line
    (start -12.168505 -25.6051450761)
    (end -14.0459968 -27.8391174095)
    (layer Edge.Cuts)
    (width 0.093750003)
  )
  (fp_line
    (start -14.0459968 -27.8391174095)
    (end -23.3174681111 -33.0086391452)
    (layer Edge.Cuts)
    (width 0.093750003)
  )
)