<?xml version="1.0" encoding="UTF-8" standalone="no"?>
<!-- Created with Inkscape (http://www.inkscape.org/) -->

<svg
   xmlns:dc="http://purl.org/dc/elements/1.1/"
   xmlns:cc="http://creativecommons.org/ns#"
   xmlns:rdf="http://www.w3.org/1999/02/22-rdf-syntax-ns#"
   xmlns:svg="http://www.w3.org/2000/svg"
   xmlns="http://www.w3.org/2000/svg"
   xmlns:sodipodi="http://sodipodi.sourceforge.net/DTD/sodipodi-0.dtd"
   xmlns:inkscape="http://www.inkscape.org/namespaces/inkscape"
   width="210mm"
   height="297mm"
   viewBox="0 0 744.09448819 1052.3622047"
   id="svg2"
   version="1.1"
   inkscape:version="0.91 r13725"
   sodipodi:docname="drawing.svg">
  <sodipodi:namedview
     id="base"
     pagecolor="#ffffff"
     bordercolor="#666666"
     borderopacity="1.0"
     inkscape:pageopacity="0.0"
     inkscape:pageshadow="2"
     inkscape:zoom="2"
     inkscape:cx="292.60914"
     inkscape:cy="815.38566"
     inkscape:document-units="px"
     inkscape:current-layer="layer1"
     showgrid="false"
     inkscape:window-width="1920"
     inkscape:window-height="1051"
     inkscape:window-x="3840"
     inkscape:window-y="0"
     inkscape:window-maximized="1" />
  <defs
     id="defs4" />
  <metadata
     id="metadata7">
    <rdf:RDF>
      <cc:Work
         rdf:about="">
        <dc:format>image/svg+xml</dc:format>
        <dc:type
           rdf:resource="http://purl.org/dc/dcmitype/StillImage" />
        <dc:title></dc:title>
      </cc:Work>
    </rdf:RDF>
  </metadata>
  <g
     id="layer1"
     inkscape:groupmode="layer"
     inkscape:label="Layer 1">
    <g
       id="g4361"
       inkscape:label="Gear10"
       transform="matrix(0.66799945,0,0,0.66799945,210.19704,258.58777)"
       style="stroke-width:10.60871258;stroke-miterlimit:4;stroke-dasharray:none">
      <path
         id="path4363"
         style="fill:none;stroke:#000000;stroke-width:10.60871258;stroke-miterlimit:4;stroke-dasharray:none"
         d="m 177.79686,-30.88332 31.04614,-5.39271 13.95375,0.98849 47.56739,22.03557 0,26.50394 -47.56739,22.03557 -13.95375,0.98849 -31.04614,-5.39271 -15.80342,48.63793 28.28661,13.88566 10.7078,9.00151 25.53065,45.78657 -15.57863,21.44213 -51.43501,-10.13226 -11.86984,-7.4021 -21.94709,-22.61126 -41.3739,30.0599 14.72256,27.86019 3.37183,13.57626 -6.25793,52.04865 -25.20675,8.19016 -35.6562,-38.42991 -5.25206,-12.96534 -4.46501,-31.19307 -51.14094,0 -4.46501,31.19307 -5.25206,12.96534 -35.6562,38.42991 -25.20675,-8.19016 -6.25793,-52.04865 3.37183,-13.57626 14.72256,-27.86019 -41.3739,-30.0599 -21.94709,22.61126 -11.86984,7.4021 -51.43501,10.13226 -15.57863,-21.44213 25.53065,-45.78657 10.7078,-9.00151 28.28661,-13.88566 -15.80342,-48.63793 -31.04614,5.39271 -13.95375,-0.98849 -47.56739,-22.03557 0,-26.50394 47.56739,-22.03557 13.95375,-0.98849 31.04614,5.39271 15.80342,-48.63793 -28.28661,-13.88566 -10.7078,-9.00151 -25.53065,-45.78657 15.57863,-21.44213 51.43501,10.13226 11.86984,7.4021 21.94709,22.61126 41.3739,-30.0599 -14.72256,-27.86019 -3.37183,-13.57626 6.25793,-52.04865 25.20675,-8.19016 35.6562,38.42991 5.25206,12.96534 4.46501,31.19307 51.14094,0 4.46501,-31.19307 5.25206,-12.96534 35.6562,-38.42991 25.20675,8.19016 6.25793,52.04865 -3.37183,13.57626 -14.72256,27.86019 41.3739,30.0599 21.94709,-22.61126 11.86984,-7.4021 51.43501,-10.13226 15.57863,21.44213 -25.53065,45.78657 -10.7078,9.00151 -28.28661,13.88566 z"
         inkscape:connector-curvature="0" />
      <circle
         id="path4365"
         style="fill:none;stroke:#000000;stroke-width:10.60871258;stroke-miterlimit:4;stroke-dasharray:none"
         cx="0"
         cy="0"
         r="1.7716535" />
    </g>
    <g
       id="g7686"
       transform="translate(-90.828427,-35.085786)">
      <g
         transform="matrix(0.09972753,0,0,-0.09972753,301.02556,272.7738)"
         id="g4467"
         style="stroke:#000000;stroke-opacity:1">
        <path
           inkscape:connector-curvature="0"
           id="path4469"
           style="fill:none;stroke:#000000;stroke-width:74.03099823;stroke-linecap:round;stroke-linejoin:round;stroke-miterlimit:10;stroke-dasharray:none;stroke-opacity:1"
           d="m 0,0 0,-554.096 -185.078,-93.582 0,-425.77 m 370.154,0 0,425.77 L 0,-554.096 0,148.062 m -148.062,-555.232 296.124,0 m -296.124,185.077 333.138,0 M 0,0 -148.062,0 -527.822,-251.095 M 777.324,703.294 555.232,444.186 l 259.108,0 -148.063,-185.078 m -1443.601,444.186 222.092,-259.108 -259.108,0 148.061,-185.078 M 0,0 148.062,0 527.822,-251.095 M 0,814.34 c 183.988,0 333.139,-149.151 333.139,-333.139 0,-214.063 -185.077,-296.124 -185.077,-296.124 l 56.286,0 c 59.804,0 118.238,-17.938 167.742,-51.497 l 373.75,-253.356 c 96.986,-57.051 133.213,-179.472 82.89,-280.115 -52.845,-105.697 -181.371,-148.537 -287.066,-95.69 l -171.51,88.411 0,-740.309 c 0,-74.032 -37.015,-148.062 -148.062,-148.062 l -74.03,0 C 66.291,-1295.541 0,-1229.251 0,-1147.479 l 0,111.045 M 0,814.34 c -183.99,0 -333.139,-149.151 -333.139,-333.139 0,-214.063 185.077,-296.124 185.077,-296.124 l -56.286,0 c -59.806,0 -118.238,-17.938 -167.744,-51.497 L -745.84,-119.776 c -96.988,-57.051 -133.215,-179.472 -82.892,-280.115 52.847,-105.697 181.373,-148.537 287.066,-95.69 l 171.512,88.411 0,-740.309 c 0,-74.032 37.015,-148.062 148.06,-148.062 l 74.032,0 c 81.771,0 148.062,66.29 148.062,148.062 l 0,259.108" />
      </g>
      <g
         transform="matrix(0.09972753,0,0,-0.09972753,293.6426,219.24768)"
         id="g4471"
         style="fill:#000000;fill-opacity:1;stroke:#000000;stroke-opacity:1">
        <path
           inkscape:connector-curvature="0"
           id="path4473"
           style="fill:#000000;fill-opacity:1;fill-rule:nonzero;stroke:#000000;stroke-opacity:1"
           d="m 0,0 c 0,-30.662 -24.859,-55.522 -55.523,-55.522 -30.665,0 -55.524,24.86 -55.524,55.522 0,30.663 24.859,55.523 55.524,55.523 C -24.859,55.523 0,30.663 0,0" />
      </g>
      <g
         transform="matrix(0.09972753,0,0,-0.09972753,319.48273,219.24768)"
         id="g4475"
         style="fill:#000000;fill-opacity:1;stroke:#000000;stroke-opacity:1">
        <path
           inkscape:connector-curvature="0"
           id="path4477"
           style="fill:#000000;fill-opacity:1;fill-rule:nonzero;stroke:#000000;stroke-opacity:1"
           d="m 0,0 c 0,-30.662 -24.859,-55.522 -55.521,-55.522 -30.665,0 -55.524,24.86 -55.524,55.522 0,30.663 24.859,55.523 55.524,55.523 C -24.859,55.523 0,30.663 0,0" />
      </g>
    </g>
  </g>
</svg>
