EESchema Schematic File Version 4
EELAYER 26 0
EELAYER END
$Descr A4 11693 8268
encoding utf-8
Sheet 1 1
Title ""
Date ""
Rev ""
Comp ""
Comment1 ""
Comment2 ""
Comment3 ""
Comment4 ""
$EndDescr
$Comp
L Device:Polyfuse F1
U 1 1 5BB77EDD
P 2350 4050
F 0 "F1" V 2125 4050 50  0000 C CNN
F 1 "500 mA" V 2216 4050 50  0000 C CNN
F 2 "" H 2400 3850 50  0001 L CNN
F 3 "~" H 2350 4050 50  0001 C CNN
	1    2350 4050
	0    1    1    0   
$EndComp
$Comp
L Device:D D1
U 1 1 5BB77F5D
P 2950 4050
F 0 "D1" H 2950 3834 50  0000 C CNN
F 1 "D" H 2950 3925 50  0000 C CNN
F 2 "" H 2950 4050 50  0001 C CNN
F 3 "~" H 2950 4050 50  0001 C CNN
	1    2950 4050
	-1   0    0    1   
$EndComp
$Comp
L Device:CP1_Small C1
U 1 1 5BB77FCE
P 3350 4350
F 0 "C1" H 3441 4396 50  0000 L CNN
F 1 "10 uF" H 3441 4305 50  0000 L CNN
F 2 "" H 3350 4350 50  0001 C CNN
F 3 "~" H 3350 4350 50  0001 C CNN
	1    3350 4350
	1    0    0    -1  
$EndComp
$Comp
L Regulator_Linear:MIC5219-5.0 U1
U 1 1 5BB780FD
P 4100 4150
F 0 "U1" H 4100 4492 50  0000 C CNN
F 1 "MIC5219-5.0" H 4100 4401 50  0000 C CNN
F 2 "Package_TO_SOT_SMD:SOT-23-5" H 4100 4475 50  0001 C CNN
F 3 "http://ww1.microchip.com/downloads/en/devicedoc/mic5219.pdf" H 4100 4150 50  0001 C CNN
	1    4100 4150
	1    0    0    -1  
$EndComp
$Comp
L Device:CP1_Small C2
U 1 1 5BB78197
P 4800 4300
F 0 "C2" H 4891 4346 50  0000 L CNN
F 1 "10 uF" H 4891 4255 50  0000 L CNN
F 2 "" H 4800 4300 50  0001 C CNN
F 3 "~" H 4800 4300 50  0001 C CNN
	1    4800 4300
	1    0    0    -1  
$EndComp
$Comp
L Device:C C3
U 1 1 5BB78215
P 5250 4300
F 0 "C3" H 5365 4346 50  0000 L CNN
F 1 "1 uF" H 5365 4255 50  0000 L CNN
F 2 "" H 5288 4150 50  0001 C CNN
F 3 "~" H 5250 4300 50  0001 C CNN
	1    5250 4300
	1    0    0    -1  
$EndComp
$Comp
L Device:C C4
U 1 1 5BB7824F
P 5650 4300
F 0 "C4" H 5765 4346 50  0000 L CNN
F 1 "100 nF" H 5765 4255 50  0000 L CNN
F 2 "" H 5688 4150 50  0001 C CNN
F 3 "~" H 5650 4300 50  0001 C CNN
	1    5650 4300
	1    0    0    -1  
$EndComp
$Comp
L Device:R R1
U 1 1 5BB782BC
P 6100 4300
F 0 "R1" H 6170 4346 50  0000 L CNN
F 1 "1k" H 6170 4255 50  0000 L CNN
F 2 "" V 6030 4300 50  0001 C CNN
F 3 "~" H 6100 4300 50  0001 C CNN
	1    6100 4300
	1    0    0    -1  
$EndComp
$Comp
L Device:LED D2
U 1 1 5BB7834B
P 6100 4750
F 0 "D2" V 6138 4633 50  0000 R CNN
F 1 "LED" V 6047 4633 50  0000 R CNN
F 2 "" H 6100 4750 50  0001 C CNN
F 3 "~" H 6100 4750 50  0001 C CNN
	1    6100 4750
	0    -1   -1   0   
$EndComp
$Comp
L power:GND #PWR09
U 1 1 5BB783F0
P 6100 5050
F 0 "#PWR09" H 6100 4800 50  0001 C CNN
F 1 "GND" H 6105 4877 50  0000 C CNN
F 2 "" H 6100 5050 50  0001 C CNN
F 3 "" H 6100 5050 50  0001 C CNN
	1    6100 5050
	1    0    0    -1  
$EndComp
$Comp
L power:VCC #PWR08
U 1 1 5BB785AC
P 6100 4000
F 0 "#PWR08" H 6100 3850 50  0001 C CNN
F 1 "VCC" H 6117 4173 50  0000 C CNN
F 2 "" H 6100 4000 50  0001 C CNN
F 3 "" H 6100 4000 50  0001 C CNN
	1    6100 4000
	1    0    0    -1  
$EndComp
Text GLabel 2050 4050 0    50   Input ~ 0
USB_+5V
Text GLabel 3200 3750 0    50   Input ~ 0
RAW
$Comp
L Jumper:SolderJumper_2_Open JP1
U 1 1 5BB78884
P 4100 3550
F 0 "JP1" H 4250 3650 50  0000 C CNN
F 1 "direct" H 4100 3400 50  0001 C CNN
F 2 "" H 4100 3550 50  0001 C CNN
F 3 "~" H 4100 3550 50  0001 C CNN
	1    4100 3550
	1    0    0    -1  
$EndComp
$Comp
L power:GND #PWR07
U 1 1 5BB789D7
P 5650 4600
F 0 "#PWR07" H 5650 4350 50  0001 C CNN
F 1 "GND" H 5655 4427 50  0000 C CNN
F 2 "" H 5650 4600 50  0001 C CNN
F 3 "" H 5650 4600 50  0001 C CNN
	1    5650 4600
	1    0    0    -1  
$EndComp
$Comp
L power:GND #PWR05
U 1 1 5BB789F6
P 5250 4600
F 0 "#PWR05" H 5250 4350 50  0001 C CNN
F 1 "GND" H 5255 4427 50  0000 C CNN
F 2 "" H 5250 4600 50  0001 C CNN
F 3 "" H 5250 4600 50  0001 C CNN
	1    5250 4600
	1    0    0    -1  
$EndComp
$Comp
L power:GND #PWR04
U 1 1 5BB78A15
P 4800 4600
F 0 "#PWR04" H 4800 4350 50  0001 C CNN
F 1 "GND" H 4805 4427 50  0000 C CNN
F 2 "" H 4800 4600 50  0001 C CNN
F 3 "" H 4800 4600 50  0001 C CNN
	1    4800 4600
	1    0    0    -1  
$EndComp
$Comp
L power:GND #PWR03
U 1 1 5BB78A34
P 4100 4600
F 0 "#PWR03" H 4100 4350 50  0001 C CNN
F 1 "GND" H 4105 4427 50  0000 C CNN
F 2 "" H 4100 4600 50  0001 C CNN
F 3 "" H 4100 4600 50  0001 C CNN
	1    4100 4600
	1    0    0    -1  
$EndComp
$Comp
L power:GND #PWR02
U 1 1 5BB78A53
P 3350 4600
F 0 "#PWR02" H 3350 4350 50  0001 C CNN
F 1 "GND" H 3355 4427 50  0000 C CNN
F 2 "" H 3350 4600 50  0001 C CNN
F 3 "" H 3350 4600 50  0001 C CNN
	1    3350 4600
	1    0    0    -1  
$EndComp
Wire Wire Line
	6100 4000 6100 4050
Wire Wire Line
	6100 4450 6100 4600
Wire Wire Line
	6100 4900 6100 5050
Wire Wire Line
	5650 4450 5650 4600
Wire Wire Line
	5250 4450 5250 4600
Wire Wire Line
	4800 4400 4800 4600
Wire Wire Line
	4100 4450 4100 4600
Wire Wire Line
	3100 4050 3350 4050
Wire Wire Line
	3800 4150 3650 4150
Wire Wire Line
	3650 4150 3650 4050
Connection ~ 3650 4050
Wire Wire Line
	3650 4050 3800 4050
Wire Wire Line
	4400 4050 4800 4050
Connection ~ 6100 4050
Wire Wire Line
	6100 4050 6100 4150
Wire Wire Line
	5650 4150 5650 4050
Connection ~ 5650 4050
Wire Wire Line
	5650 4050 6100 4050
Wire Wire Line
	5250 4150 5250 4050
Connection ~ 5250 4050
Wire Wire Line
	5250 4050 5650 4050
Wire Wire Line
	4800 4050 4800 4200
Connection ~ 4800 4050
Wire Wire Line
	4800 4050 5250 4050
Wire Wire Line
	4800 4050 4800 3550
Wire Wire Line
	4800 3550 4250 3550
Connection ~ 3350 4050
Wire Wire Line
	3350 4050 3650 4050
Wire Wire Line
	3350 4250 3350 4050
Wire Wire Line
	3350 4450 3350 4600
Wire Wire Line
	2650 3550 2650 4050
Wire Wire Line
	2650 4050 2800 4050
Wire Wire Line
	2050 4050 2200 4050
Wire Wire Line
	2500 4050 2650 4050
Connection ~ 2650 4050
$Comp
L boost-converter:boost-converter M2
U 1 1 5BB7C485
P 4650 1800
F 0 "M2" H 4625 2247 60  0000 C CNN
F 1 "boost-converter" H 4625 2141 60  0000 C CNN
F 2 "" H 4700 1750 60  0000 C CNN
F 3 "" H 4700 1750 60  0000 C CNN
	1    4650 1800
	1    0    0    -1  
$EndComp
$Comp
L lipo-charger:lipo-charger M1
U 1 1 5BB7CD3E
P 2650 1800
F 0 "M1" H 2725 2247 60  0000 C CNN
F 1 "lipo-charger" H 2725 2141 60  0000 C CNN
F 2 "" H 2650 1800 60  0000 C CNN
F 3 "" H 2650 1800 60  0000 C CNN
	1    2650 1800
	1    0    0    -1  
$EndComp
$Comp
L Switch:SW_SPST SW1
U 1 1 5BB7D1DE
P 3700 1600
F 0 "SW1" H 3700 1835 50  0000 C CNN
F 1 "power switch" H 3700 1744 50  0000 C CNN
F 2 "" H 3700 1600 50  0001 C CNN
F 3 "" H 3700 1600 50  0001 C CNN
	1    3700 1600
	1    0    0    -1  
$EndComp
Wire Wire Line
	3400 1600 3500 1600
Wire Wire Line
	3900 1600 4000 1600
$Comp
L Device:Battery_Cell BT1
U 1 1 5BB7DCB2
P 3700 1800
F 0 "BT1" V 3955 1850 50  0000 C CNN
F 1 "Battery_Cell" V 3400 1850 50  0000 C CNN
F 2 "" V 3700 1860 50  0001 C CNN
F 3 "~" V 3700 1860 50  0001 C CNN
	1    3700 1800
	0    -1   -1   0   
$EndComp
Wire Wire Line
	3500 1800 3400 1800
Wire Wire Line
	3400 1800 3400 1700
Wire Wire Line
	3800 1800 3800 1950
Wire Wire Line
	3800 1950 3400 1950
Wire Wire Line
	3400 2050 4000 2050
$Comp
L power:GND #PWR06
U 1 1 5BB7F049
P 5450 1750
F 0 "#PWR06" H 5450 1500 50  0001 C CNN
F 1 "GND" V 5455 1622 50  0000 R CNN
F 2 "" H 5450 1750 50  0001 C CNN
F 3 "" H 5450 1750 50  0001 C CNN
	1    5450 1750
	0    -1   -1   0   
$EndComp
Wire Wire Line
	5450 1750 5250 1750
$Comp
L power:GND #PWR01
U 1 1 5BB7F7E6
P 2000 2200
F 0 "#PWR01" H 2000 1950 50  0001 C CNN
F 1 "GND" H 2005 2027 50  0000 C CNN
F 2 "" H 2000 2200 50  0001 C CNN
F 3 "" H 2000 2200 50  0001 C CNN
	1    2000 2200
	1    0    0    -1  
$EndComp
Wire Wire Line
	2000 2200 2000 2050
Wire Wire Line
	2000 2050 2050 2050
Wire Wire Line
	5250 1950 5400 1950
Text Label 3900 2800 0    50   ~ 0
J1
Wire Notes Line
	3750 3650 4100 3650
Wire Notes Line
	4100 3650 4100 2600
Wire Notes Line
	4100 2600 3750 2600
Wire Notes Line
	3750 2600 3750 3650
Wire Notes Line
	1150 3350 6800 3350
Wire Notes Line
	6800 3350 6800 5550
Wire Notes Line
	6800 5550 1150 5550
Wire Notes Line
	1150 5550 1150 3350
Wire Notes Line
	3350 2200 4000 2200
Wire Notes Line
	4000 2200 4000 1200
Wire Notes Line
	4000 1200 3350 1200
Wire Notes Line
	3350 1200 3350 2200
Text Notes 3350 1150 0    50   ~ 0
Charge while off mod
Wire Notes Line
	1650 950  6000 950 
Wire Notes Line
	6000 950  6000 2900
Wire Notes Line
	6000 2900 1650 2900
Wire Notes Line
	1650 2900 1650 950 
Text Notes 1700 1050 0    50   ~ 0
Badge bits
Text Notes 3750 2550 0    50   ~ 0
J1 - hack\nAllows charging\nfrom micro usb
Wire Wire Line
	3900 2700 1850 2700
Wire Wire Line
	1850 2700 1850 1600
Wire Wire Line
	1850 1600 2050 1600
Text Notes 1200 3450 0    50   ~ 0
Arduino Pro micro power supply detail
Wire Wire Line
	5400 1950 5400 3750
Wire Wire Line
	5400 3750 3350 3750
Wire Wire Line
	3350 3750 3350 4050
Connection ~ 3350 3750
Wire Wire Line
	3200 3750 3350 3750
Wire Wire Line
	2650 3550 3900 3550
Wire Wire Line
	3900 2700 3900 3550
Connection ~ 3900 3550
Wire Wire Line
	3900 3550 3950 3550
Text Notes 1900 2800 0    50   ~ 0
<----- Pixies run this way when charging
$EndSCHEMATC
