EESchema Schematic File Version 4
LIBS:cog-badge-cache
EELAYER 26 0
EELAYER END
$Descr A4 11693 8268
encoding utf-8
Sheet 1 1
Title ""
Date ""
Rev ""
Comp ""
Comment1 ""
Comment2 ""
Comment3 ""
Comment4 ""
$EndDescr
$Comp
L promicro:promicro M1
U 1 1 5B266749
P 2700 1300
F 0 "M1" H 3050 -1050 60  0000 C CNN
F 1 "promicro" H 3050 1750 60  0000 C CNN
F 2 "Housings_DIP.pretty:DIP-24_W15.24mm" H 2700 1600 60  0001 C CNN
F 3 "" H 2700 1600 60  0000 C CNN
	1    2700 1300
	1    0    0    -1  
$EndComp
$Comp
L cog-badge-rescue:CONN_01X08 P1
U 1 1 5B267B46
P 5250 1950
F 0 "P1" H 5250 2400 50  0000 C CNN
F 1 "MPU6050" V 5350 1950 50  0000 C CNN
F 2 "cog-badge:mpu6050-module" H 5250 1950 50  0001 C CNN
F 3 "" H 5250 1950 50  0000 C CNN
	1    5250 1950
	1    0    0    -1  
$EndComp
$Comp
L power:GND #PWR01
U 1 1 5B26815B
P 2400 1900
F 0 "#PWR01" H 2400 1650 50  0001 C CNN
F 1 "GND" H 2400 1750 50  0000 C CNN
F 2 "" H 2400 1900 50  0000 C CNN
F 3 "" H 2400 1900 50  0000 C CNN
	1    2400 1900
	1    0    0    -1  
$EndComp
Wire Wire Line
	2400 1900 2500 1900
Wire Wire Line
	2500 1700 2400 1700
Wire Wire Line
	2400 1700 2400 1900
Connection ~ 2400 1900
Text GLabel 2200 2100 0    60   Input ~ 0
SDA
Text GLabel 2200 2300 0    60   Input ~ 0
SCL
Wire Wire Line
	2200 2300 2500 2300
Wire Wire Line
	2500 2100 2200 2100
Wire Wire Line
	4950 1600 5050 1600
$Comp
L power:GND #PWR02
U 1 1 5B2683A7
P 4750 1600
F 0 "#PWR02" H 4750 1350 50  0001 C CNN
F 1 "GND" H 4750 1450 50  0000 C CNN
F 2 "" H 4750 1600 50  0000 C CNN
F 3 "" H 4750 1600 50  0000 C CNN
	1    4750 1600
	-1   0    0    1   
$EndComp
Text GLabel 4650 1800 0    60   Input ~ 0
SCL
Text GLabel 4950 1900 0    60   Input ~ 0
SDA
Wire Wire Line
	4750 1600 4750 1700
Wire Wire Line
	4750 1700 5050 1700
Wire Wire Line
	4650 1800 5050 1800
Wire Wire Line
	5050 1900 4950 1900
Text GLabel 2150 1300 0    60   Input ~ 0
TX
Text GLabel 2150 1500 0    60   Input ~ 0
RX
Wire Wire Line
	2150 1500 2500 1500
Wire Wire Line
	2500 1300 2150 1300
Text GLabel 3800 2100 2    60   Input ~ 0
PF4
Text GLabel 3800 2300 2    60   Input ~ 0
PF5
Wire Wire Line
	3800 2300 3600 2300
Wire Wire Line
	3600 2100 3800 2100
Wire Wire Line
	3900 1900 3600 1900
$Comp
L power:GND #PWR03
U 1 1 5B268DFA
P 3800 1500
F 0 "#PWR03" H 3800 1250 50  0001 C CNN
F 1 "GND" H 3800 1350 50  0000 C CNN
F 2 "" H 3800 1500 50  0000 C CNN
F 3 "" H 3800 1500 50  0000 C CNN
	1    3800 1500
	0    -1   -1   0   
$EndComp
Wire Wire Line
	3600 1500 3800 1500
Text GLabel 3700 1700 2    60   Input ~ 0
~Reset
Text GLabel 3800 3300 2    60   Input ~ 0
MOSI
Text GLabel 3800 3100 2    60   Input ~ 0
MISO
Text GLabel 3800 2900 2    60   Input ~ 0
SCK
Wire Wire Line
	3600 2900 3800 2900
Wire Wire Line
	3600 3100 3800 3100
Wire Wire Line
	3600 3300 3800 3300
$Comp
L cog-badge-rescue:CONN_02X03 P4
U 1 1 5B268F17
P 5200 3100
F 0 "P4" H 5200 3300 50  0000 C CNN
F 1 "isp" H 5200 2900 50  0000 C CNN
F 2 "cog-badge:6-pin-ISP-Header" H 5200 1900 50  0001 C CNN
F 3 "" H 5200 1900 50  0000 C CNN
	1    5200 3100
	1    0    0    -1  
$EndComp
Wire Wire Line
	3700 1700 3600 1700
Text GLabel 5550 3100 2    60   Input ~ 0
MOSI
Text GLabel 4500 3100 0    60   Input ~ 0
SCK
Text GLabel 4850 3000 0    60   Input ~ 0
MISO
Text GLabel 4850 3200 0    60   Input ~ 0
~Reset
Wire Wire Line
	4500 3100 4950 3100
Wire Wire Line
	4950 3000 4850 3000
Wire Wire Line
	4850 3200 4950 3200
Wire Wire Line
	5450 3100 5550 3100
$Comp
L power:GND #PWR04
U 1 1 5B2695D5
P 5550 3250
F 0 "#PWR04" H 5550 3000 50  0001 C CNN
F 1 "GND" H 5550 3100 50  0000 C CNN
F 2 "" H 5550 3250 50  0000 C CNN
F 3 "" H 5550 3250 50  0000 C CNN
	1    5550 3250
	1    0    0    -1  
$EndComp
Wire Wire Line
	5550 3250 5550 3200
Wire Wire Line
	5550 3200 5450 3200
Wire Wire Line
	5550 2900 5550 3000
Wire Wire Line
	5550 3000 5450 3000
Text GLabel 3800 2500 2    60   Input ~ 0
PF6
Wire Wire Line
	3800 2500 3600 2500
Text Notes 5500 2100 1    60   ~ 0
GY-521
Text GLabel 2200 2500 0    60   Input ~ 0
PD4
Text GLabel 2200 2700 0    60   Input ~ 0
PD6
Text GLabel 2200 2900 0    60   Input ~ 0
PD7
Text GLabel 2200 3100 0    60   Input ~ 0
PE6
Text GLabel 2200 3300 0    60   Input ~ 0
PB4
Text GLabel 2200 3500 0    60   Input ~ 0
PB5
Text GLabel 3800 3500 2    60   Input ~ 0
PB6
Text GLabel 3800 2700 2    60   Input ~ 0
PF7
Wire Wire Line
	3600 2700 3800 2700
Wire Wire Line
	3800 3500 3600 3500
Wire Wire Line
	2200 2500 2500 2500
Wire Wire Line
	2500 2700 2200 2700
Wire Wire Line
	2200 2900 2500 2900
Wire Wire Line
	2200 3100 2500 3100
Wire Wire Line
	2200 3300 2500 3300
Wire Wire Line
	2200 3500 2500 3500
$Comp
L power:+5V #PWR05
U 1 1 5B799960
P 5550 2900
F 0 "#PWR05" H 5550 2750 50  0001 C CNN
F 1 "+5V" H 5550 3040 50  0000 C CNN
F 2 "" H 5550 2900 50  0000 C CNN
F 3 "" H 5550 2900 50  0000 C CNN
	1    5550 2900
	1    0    0    -1  
$EndComp
$Comp
L power:+5V #PWR06
U 1 1 5B79997A
P 4950 1600
F 0 "#PWR06" H 4950 1450 50  0001 C CNN
F 1 "+5V" H 4950 1740 50  0000 C CNN
F 2 "" H 4950 1600 50  0000 C CNN
F 3 "" H 4950 1600 50  0000 C CNN
	1    4950 1600
	1    0    0    -1  
$EndComp
$Comp
L power:+5V #PWR07
U 1 1 5B799994
P 3900 1900
F 0 "#PWR07" H 3900 1750 50  0001 C CNN
F 1 "+5V" H 3900 2040 50  0000 C CNN
F 2 "" H 3900 1900 50  0000 C CNN
F 3 "" H 3900 1900 50  0000 C CNN
	1    3900 1900
	0    1    1    0   
$EndComp
$Comp
L power:+5VP #PWR08
U 1 1 5B7999BB
P 3900 1300
F 0 "#PWR08" H 3900 1150 50  0001 C CNN
F 1 "+5VP" H 3900 1440 50  0000 C CNN
F 2 "" H 3900 1300 50  0000 C CNN
F 3 "" H 3900 1300 50  0000 C CNN
	1    3900 1300
	0    1    1    0   
$EndComp
Wire Wire Line
	3600 1300 3900 1300
Wire Wire Line
	2650 4400 3300 4400
Wire Wire Line
	3300 4850 2650 4850
Wire Wire Line
	2750 4500 2650 4500
$Comp
L power:+5VP #PWR09
U 1 1 5B799F23
P 4700 4750
F 0 "#PWR09" H 4700 4600 50  0001 C CNN
F 1 "+5VP" H 4700 4890 50  0000 C CNN
F 2 "" H 4700 4750 50  0000 C CNN
F 3 "" H 4700 4750 50  0000 C CNN
	1    4700 4750
	0    1    1    0   
$EndComp
Wire Wire Line
	4700 4750 4550 4750
$Comp
L power:GND #PWR010
U 1 1 5B799F8B
P 4700 4550
F 0 "#PWR010" H 4700 4300 50  0001 C CNN
F 1 "GND" H 4700 4400 50  0000 C CNN
F 2 "" H 4700 4550 50  0000 C CNN
F 3 "" H 4700 4550 50  0000 C CNN
	1    4700 4550
	0    -1   -1   0   
$EndComp
Wire Wire Line
	4700 4550 4550 4550
$Comp
L LED1:WS2812B D1
U 1 1 5B7A8151
P 1400 5750
F 0 "D1" H 1600 5975 50  0000 R BNN
F 1 "WS2812B" H 1450 5525 50  0000 L TNN
F 2 "LEDs.pretty:LED_WS2812B-PLCC4" H 1450 5450 50  0001 L TNN
F 3 "" H 1500 5375 50  0001 L TNN
	1    1400 5750
	1    0    0    -1  
$EndComp
$Comp
L boost-converter:boost-converter M3
U 1 1 5B7A82AB
P 3950 4600
F 0 "M3" H 3900 4800 60  0000 C CNN
F 1 "boost-converter" H 3900 4550 60  0000 C CNN
F 2 "cog-badge:boost-converter" H 4000 4550 60  0001 C CNN
F 3 "" H 4000 4550 60  0000 C CNN
	1    3950 4600
	1    0    0    -1  
$EndComp
$Comp
L lipo-charger:lipo-charger M2
U 1 1 5B7A8439
P 1900 4600
F 0 "M2" H 1900 4750 60  0000 C CNN
F 1 "lipo-charger" H 1950 4600 60  0000 C CNN
F 2 "cog-badge:lipo-charger" H 1900 4600 60  0001 C CNN
F 3 "" H 1900 4600 60  0000 C CNN
	1    1900 4600
	1    0    0    -1  
$EndComp
Wire Wire Line
	2750 4750 2650 4750
$Comp
L LED1:WS2812B D3
U 1 1 5B7A84EF
P 2100 5750
F 0 "D3" H 2300 5975 50  0000 R BNN
F 1 "WS2812B" H 2150 5525 50  0000 L TNN
F 2 "LEDs.pretty:LED_WS2812B-PLCC4" H 2150 5450 50  0001 L TNN
F 3 "" H 2200 5375 50  0001 L TNN
	1    2100 5750
	1    0    0    -1  
$EndComp
$Comp
L LED1:WS2812B D5
U 1 1 5B7A851C
P 2800 5750
F 0 "D5" H 3000 5975 50  0000 R BNN
F 1 "WS2812B" H 2850 5525 50  0000 L TNN
F 2 "LEDs.pretty:LED_WS2812B-PLCC4" H 2850 5450 50  0001 L TNN
F 3 "" H 2900 5375 50  0001 L TNN
	1    2800 5750
	1    0    0    -1  
$EndComp
$Comp
L LED1:WS2812B D7
U 1 1 5B7A8565
P 3500 5750
F 0 "D7" H 3700 5975 50  0000 R BNN
F 1 "WS2812B" H 3550 5525 50  0000 L TNN
F 2 "LEDs.pretty:LED_WS2812B-PLCC4" H 3550 5450 50  0001 L TNN
F 3 "" H 3600 5375 50  0001 L TNN
	1    3500 5750
	1    0    0    -1  
$EndComp
$Comp
L LED1:WS2812B D9
U 1 1 5B7A8598
P 4200 5750
F 0 "D9" H 4400 5975 50  0000 R BNN
F 1 "WS2812B" H 4250 5525 50  0000 L TNN
F 2 "LEDs.pretty:LED_WS2812B-PLCC4" H 4250 5450 50  0001 L TNN
F 3 "" H 4300 5375 50  0001 L TNN
	1    4200 5750
	1    0    0    -1  
$EndComp
$Comp
L LED1:WS2812B D2
U 1 1 5B7A85EA
P 1400 6600
F 0 "D2" H 1600 6825 50  0000 R BNN
F 1 "WS2812B" H 1450 6375 50  0000 L TNN
F 2 "LEDs.pretty:LED_WS2812B-PLCC4" H 1450 6300 50  0001 L TNN
F 3 "" H 1500 6225 50  0001 L TNN
	1    1400 6600
	1    0    0    -1  
$EndComp
$Comp
L LED1:WS2812B D4
U 1 1 5B7A8681
P 2100 6600
F 0 "D4" H 2300 6825 50  0000 R BNN
F 1 "WS2812B" H 2150 6375 50  0000 L TNN
F 2 "LEDs.pretty:LED_WS2812B-PLCC4" H 2150 6300 50  0001 L TNN
F 3 "" H 2200 6225 50  0001 L TNN
	1    2100 6600
	1    0    0    -1  
$EndComp
$Comp
L LED1:WS2812B D6
U 1 1 5B7A86C4
P 2800 6600
F 0 "D6" H 3000 6825 50  0000 R BNN
F 1 "WS2812B" H 2850 6375 50  0000 L TNN
F 2 "LEDs.pretty:LED_WS2812B-PLCC4" H 2850 6300 50  0001 L TNN
F 3 "" H 2900 6225 50  0001 L TNN
	1    2800 6600
	1    0    0    -1  
$EndComp
$Comp
L LED1:WS2812B D8
U 1 1 5B7A870F
P 3500 6600
F 0 "D8" H 3700 6825 50  0000 R BNN
F 1 "WS2812B" H 3550 6375 50  0000 L TNN
F 2 "LEDs.pretty:LED_WS2812B-PLCC4" H 3550 6300 50  0001 L TNN
F 3 "" H 3600 6225 50  0001 L TNN
	1    3500 6600
	1    0    0    -1  
$EndComp
$Comp
L LED1:WS2812B D10
U 1 1 5B7A875A
P 4200 6600
F 0 "D10" H 4400 6825 50  0000 R BNN
F 1 "WS2812B" H 4250 6375 50  0000 L TNN
F 2 "LEDs.pretty:LED_WS2812B-PLCC4" H 4250 6300 50  0001 L TNN
F 3 "" H 4300 6225 50  0001 L TNN
	1    4200 6600
	1    0    0    -1  
$EndComp
Wire Wire Line
	4500 5750 4700 5750
Wire Wire Line
	4700 5750 4700 6200
Wire Wire Line
	4700 6200 900  6200
Wire Wire Line
	900  6200 900  6600
Wire Wire Line
	900  6600 1100 6600
Wire Wire Line
	1700 6600 1800 6600
Wire Wire Line
	2400 6600 2500 6600
Wire Wire Line
	3100 6600 3200 6600
Wire Wire Line
	3800 6600 3900 6600
Wire Wire Line
	1700 5750 1800 5750
Wire Wire Line
	2400 5750 2500 5750
Wire Wire Line
	3100 5750 3200 5750
Wire Wire Line
	3800 5750 3900 5750
Text GLabel 900  5750 0    60   Input ~ 0
PE6
Wire Wire Line
	900  5750 1100 5750
Text Notes 1500 3150 0    60   ~ 0
WS2812B
Wire Wire Line
	1400 5450 2100 5450
Wire Wire Line
	2100 5450 2800 5450
Wire Wire Line
	2800 5450 3500 5450
Wire Wire Line
	3500 5450 4200 5450
Wire Wire Line
	4200 5450 4800 5450
Connection ~ 2100 5450
Connection ~ 2800 5450
Connection ~ 3500 5450
Wire Wire Line
	1400 6300 2100 6300
Wire Wire Line
	2100 6300 2800 6300
Wire Wire Line
	2800 6300 3500 6300
Wire Wire Line
	3500 6300 4200 6300
Wire Wire Line
	4200 6300 4800 6300
Connection ~ 4200 5450
Connection ~ 4200 6300
Connection ~ 3500 6300
Connection ~ 2800 6300
Wire Wire Line
	800  6050 1400 6050
Wire Wire Line
	1400 6050 2100 6050
Wire Wire Line
	2100 6050 2800 6050
Wire Wire Line
	2800 6050 3500 6050
Wire Wire Line
	3500 6050 4200 6050
Connection ~ 2800 6050
Connection ~ 3500 6050
Connection ~ 2100 6050
Wire Wire Line
	800  6900 1400 6900
Wire Wire Line
	1400 6900 2100 6900
Wire Wire Line
	2100 6900 2800 6900
Wire Wire Line
	2800 6900 3500 6900
Wire Wire Line
	3500 6900 4200 6900
Connection ~ 4200 6900
Connection ~ 3500 6900
Connection ~ 2800 6900
Connection ~ 2100 6900
$Comp
L power:+5VP #PWR011
U 1 1 5B7A9318
P 4200 5350
F 0 "#PWR011" H 4200 5200 50  0001 C CNN
F 1 "+5VP" H 4200 5490 50  0000 C CNN
F 2 "" H 4200 5350 50  0000 C CNN
F 3 "" H 4200 5350 50  0000 C CNN
	1    4200 5350
	1    0    0    -1  
$EndComp
Wire Wire Line
	4200 5450 4200 5350
Wire Wire Line
	4800 6300 4800 5450
Connection ~ 2100 6300
Wire Wire Line
	800  6050 800  6900
Connection ~ 1400 6900
Connection ~ 1400 6050
$Comp
L power:GND #PWR012
U 1 1 5B7A94F7
P 4200 7050
F 0 "#PWR012" H 4200 6800 50  0001 C CNN
F 1 "GND" H 4200 6900 50  0000 C CNN
F 2 "" H 4200 7050 50  0000 C CNN
F 3 "" H 4200 7050 50  0000 C CNN
	1    4200 7050
	1    0    0    -1  
$EndComp
Wire Wire Line
	4200 6900 4200 7050
$Comp
L cog-badge-rescue:C_Small C5
U 1 1 5B7A9592
P 6200 5800
F 0 "C5" H 6210 5870 50  0000 L CNN
F 1 "100nF" H 6150 5600 50  0001 L CNN
F 2 "Capacitors_SMD.pretty:C_0603_HandSoldering" H 6200 5800 50  0001 C CNN
F 3 "" H 6200 5800 50  0000 C CNN
	1    6200 5800
	1    0    0    -1  
$EndComp
$Comp
L cog-badge-rescue:C_Small C6
U 1 1 5B7A964B
P 6400 5800
F 0 "C6" H 6410 5870 50  0000 L CNN
F 1 "100nF" H 6300 5600 50  0001 L CNN
F 2 "Capacitors_SMD.pretty:C_0603_HandSoldering" H 6400 5800 50  0001 C CNN
F 3 "" H 6400 5800 50  0000 C CNN
	1    6400 5800
	1    0    0    -1  
$EndComp
$Comp
L cog-badge-rescue:C_Small C7
U 1 1 5B7A9701
P 6600 5800
F 0 "C7" H 6610 5870 50  0000 L CNN
F 1 "100nF" H 6500 5550 50  0001 L CNN
F 2 "Capacitors_SMD.pretty:C_0603_HandSoldering" H 6600 5800 50  0001 C CNN
F 3 "" H 6600 5800 50  0000 C CNN
	1    6600 5800
	1    0    0    -1  
$EndComp
$Comp
L cog-badge-rescue:C_Small C8
U 1 1 5B7A9707
P 6800 5800
F 0 "C8" H 6810 5870 50  0000 L CNN
F 1 "100nF" H 6700 5550 50  0001 L CNN
F 2 "Capacitors_SMD.pretty:C_0603_HandSoldering" H 6800 5800 50  0001 C CNN
F 3 "" H 6800 5800 50  0000 C CNN
	1    6800 5800
	1    0    0    -1  
$EndComp
$Comp
L cog-badge-rescue:C_Small C1
U 1 1 5B7A9BE5
P 5400 5800
F 0 "C1" H 5410 5870 50  0000 L CNN
F 1 "100nF" H 5300 5550 50  0001 L CNN
F 2 "Capacitors_SMD.pretty:C_0603_HandSoldering" H 5400 5800 50  0001 C CNN
F 3 "" H 5400 5800 50  0000 C CNN
	1    5400 5800
	1    0    0    -1  
$EndComp
$Comp
L cog-badge-rescue:C_Small C2
U 1 1 5B7A9BEB
P 5600 5800
F 0 "C2" H 5610 5870 50  0000 L CNN
F 1 "100nF" H 5550 5550 50  0001 L CNN
F 2 "Capacitors_SMD.pretty:C_0603_HandSoldering" H 5600 5800 50  0001 C CNN
F 3 "" H 5600 5800 50  0000 C CNN
	1    5600 5800
	1    0    0    -1  
$EndComp
$Comp
L cog-badge-rescue:C_Small C3
U 1 1 5B7A9BF1
P 5800 5800
F 0 "C3" H 5810 5870 50  0000 L CNN
F 1 "100nF" H 5750 5550 50  0001 L CNN
F 2 "Capacitors_SMD.pretty:C_0603_HandSoldering" H 5800 5800 50  0001 C CNN
F 3 "" H 5800 5800 50  0000 C CNN
	1    5800 5800
	1    0    0    -1  
$EndComp
$Comp
L cog-badge-rescue:C_Small C4
U 1 1 5B7A9BF7
P 6000 5800
F 0 "C4" H 6010 5870 50  0000 L CNN
F 1 "100nF" H 5950 5600 50  0001 L CNN
F 2 "Capacitors_SMD.pretty:C_0603_HandSoldering" H 6000 5800 50  0001 C CNN
F 3 "" H 6000 5800 50  0000 C CNN
	1    6000 5800
	1    0    0    -1  
$EndComp
$Comp
L cog-badge-rescue:C_Small C9
U 1 1 5B7A9E5D
P 7000 5800
F 0 "C9" H 7010 5870 50  0000 L CNN
F 1 "100nF" H 6900 5550 50  0001 L CNN
F 2 "Capacitors_SMD.pretty:C_0603_HandSoldering" H 7000 5800 50  0001 C CNN
F 3 "" H 7000 5800 50  0000 C CNN
	1    7000 5800
	1    0    0    -1  
$EndComp
$Comp
L cog-badge-rescue:C_Small C10
U 1 1 5B7A9E63
P 7200 5800
F 0 "C10" H 7210 5870 50  0000 L CNN
F 1 "100nF" H 7100 5600 50  0001 L CNN
F 2 "Capacitors_SMD.pretty:C_0603_HandSoldering" H 7200 5800 50  0001 C CNN
F 3 "" H 7200 5800 50  0000 C CNN
	1    7200 5800
	1    0    0    -1  
$EndComp
Wire Wire Line
	5400 5900 5600 5900
Wire Wire Line
	5600 5900 5800 5900
Wire Wire Line
	5800 5900 6000 5900
Wire Wire Line
	6000 5900 6200 5900
Wire Wire Line
	6200 5900 6300 5900
Wire Wire Line
	6300 5900 6400 5900
Wire Wire Line
	6400 5900 6600 5900
Wire Wire Line
	6600 5900 6800 5900
Wire Wire Line
	6800 5900 7000 5900
Wire Wire Line
	7000 5900 7200 5900
Connection ~ 5600 5900
Connection ~ 5800 5900
Connection ~ 6000 5900
Connection ~ 6200 5900
Connection ~ 6400 5900
Connection ~ 6600 5900
Connection ~ 6800 5900
Connection ~ 7000 5900
Wire Wire Line
	5400 5700 5600 5700
Wire Wire Line
	5600 5700 5800 5700
Wire Wire Line
	5800 5700 6000 5700
Wire Wire Line
	6000 5700 6200 5700
Wire Wire Line
	6200 5700 6300 5700
Wire Wire Line
	6300 5700 6400 5700
Wire Wire Line
	6400 5700 6600 5700
Wire Wire Line
	6600 5700 6800 5700
Wire Wire Line
	6800 5700 7000 5700
Wire Wire Line
	7000 5700 7200 5700
Connection ~ 7000 5700
Connection ~ 6800 5700
Connection ~ 6600 5700
Connection ~ 6400 5700
Connection ~ 6200 5700
Connection ~ 6000 5700
Connection ~ 5800 5700
Connection ~ 5600 5700
$Comp
L power:GND #PWR013
U 1 1 5B7AB4F0
P 6300 6350
F 0 "#PWR013" H 6300 6100 50  0001 C CNN
F 1 "GND" H 6300 6200 50  0000 C CNN
F 2 "" H 6300 6350 50  0000 C CNN
F 3 "" H 6300 6350 50  0000 C CNN
	1    6300 6350
	1    0    0    -1  
$EndComp
Wire Wire Line
	6300 6350 6300 5900
Connection ~ 6300 5900
$Comp
L power:+5VP #PWR014
U 1 1 5B7AB5BD
P 6300 5250
F 0 "#PWR014" H 6300 5100 50  0001 C CNN
F 1 "+5VP" H 6300 5390 50  0000 C CNN
F 2 "" H 6300 5250 50  0000 C CNN
F 3 "" H 6300 5250 50  0000 C CNN
	1    6300 5250
	1    0    0    -1  
$EndComp
Wire Wire Line
	6300 5250 6300 5700
Connection ~ 6300 5700
Text Notes 7350 5950 0    60   ~ 0
10x 100nF\nDistributed with LEDs\n
$Comp
L cog-badge-rescue:TEST_1P W5
U 1 1 5B7ABFBB
P 4750 6600
F 0 "W5" H 4750 6870 50  0000 C CNN
F 1 "LED-out" H 4750 6800 50  0000 C CNN
F 2 "cog-badge:tp" H 4950 6600 50  0001 C CNN
F 3 "" H 4950 6600 50  0000 C CNN
	1    4750 6600
	0    1    1    0   
$EndComp
Wire Wire Line
	4750 6600 4500 6600
$Comp
L cog-badge-rescue:TEST_1P W24
U 1 1 5B7AD279
P 7200 5650
F 0 "W24" H 7200 5920 50  0000 C CNN
F 1 "+" H 7200 5850 50  0000 C CNN
F 2 "cog-badge:tp" H 7400 5650 50  0001 C CNN
F 3 "" H 7400 5650 50  0000 C CNN
	1    7200 5650
	1    0    0    -1  
$EndComp
Wire Wire Line
	7200 5700 7200 5650
$Comp
L cog-badge-rescue:TEST_1P W25
U 1 1 5B7ADD3C
P 7200 5950
F 0 "W25" H 7200 6220 50  0000 C CNN
F 1 "0" H 7200 6150 50  0000 C CNN
F 2 "cog-badge:tp" H 7400 5950 50  0001 C CNN
F 3 "" H 7400 5950 50  0000 C CNN
	1    7200 5950
	-1   0    0    1   
$EndComp
Wire Wire Line
	7200 5900 7200 5950
$Comp
L cog-badge-rescue:TEST_1P W3
U 1 1 5B7AE628
P 3850 3900
F 0 "W3" H 3850 4170 50  0000 C CNN
F 1 "b+" H 3850 4100 50  0000 C CNN
F 2 "cog-badge:tp" H 4050 3900 50  0001 C CNN
F 3 "" H 4050 3900 50  0000 C CNN
	1    3850 3900
	0    1    1    0   
$EndComp
$Comp
L cog-badge-rescue:TEST_1P W4
U 1 1 5B7AE704
P 2750 4750
F 0 "W4" H 2750 5020 50  0000 C CNN
F 1 "b-" H 2750 4950 50  0000 C CNN
F 2 "cog-badge:tp" H 2950 4750 50  0001 C CNN
F 3 "" H 2950 4750 50  0000 C CNN
	1    2750 4750
	0    1    1    0   
$EndComp
Wire Wire Line
	7000 5900 7000 5950
$Comp
L cog-badge-rescue:TEST_1P W23
U 1 1 5B7ADD36
P 7000 5950
F 0 "W23" H 7000 6220 50  0000 C CNN
F 1 "0" H 7000 6150 50  0000 C CNN
F 2 "cog-badge:tp" H 7200 5950 50  0001 C CNN
F 3 "" H 7200 5950 50  0000 C CNN
	1    7000 5950
	-1   0    0    1   
$EndComp
Wire Wire Line
	7000 5650 7000 5700
$Comp
L cog-badge-rescue:TEST_1P W22
U 1 1 5B7AD273
P 7000 5650
F 0 "W22" H 7000 5920 50  0000 C CNN
F 1 "+" H 7000 5850 50  0000 C CNN
F 2 "cog-badge:tp" H 7200 5650 50  0001 C CNN
F 3 "" H 7200 5650 50  0000 C CNN
	1    7000 5650
	1    0    0    -1  
$EndComp
$Comp
L cog-badge-rescue:SWITCH_INV SW1
U 1 1 5B8505E6
P 3250 4000
F 0 "SW1" H 3050 4150 50  0000 C CNN
F 1 "power-sw" H 3100 3850 50  0000 C CNN
F 2 "cog-badge:SW_SPDT_PCM12" H 3250 4000 50  0001 C CNN
F 3 "" H 3250 4000 50  0000 C CNN
	1    3250 4000
	1    0    0    -1  
$EndComp
Wire Wire Line
	3750 3900 3850 3900
Wire Wire Line
	2750 4000 2750 4500
$Comp
L cog-badge-rescue:CONN_02X02 P2
U 1 1 5B866475
P 6000 4150
F 0 "P2" H 6000 4300 50  0000 C CNN
F 1 "shitty addon" H 6000 4000 50  0000 C CNN
F 2 "cog-badge:shittyaddon" H 6000 2950 50  0001 C CNN
F 3 "" H 6000 2950 50  0000 C CNN
	1    6000 4150
	1    0    0    -1  
$EndComp
$Comp
L power:+5V #PWR015
U 1 1 5B866709
P 5650 4000
F 0 "#PWR015" H 5650 3850 50  0001 C CNN
F 1 "+5V" H 5650 4140 50  0000 C CNN
F 2 "" H 5650 4000 50  0000 C CNN
F 3 "" H 5650 4000 50  0000 C CNN
	1    5650 4000
	1    0    0    -1  
$EndComp
$Comp
L power:GND #PWR016
U 1 1 5B866765
P 5650 4300
F 0 "#PWR016" H 5650 4050 50  0001 C CNN
F 1 "GND" H 5650 4150 50  0000 C CNN
F 2 "" H 5650 4300 50  0000 C CNN
F 3 "" H 5650 4300 50  0000 C CNN
	1    5650 4300
	1    0    0    -1  
$EndComp
Text GLabel 6400 4050 2    60   Input ~ 0
SDA
Text GLabel 6400 4250 2    60   Input ~ 0
SCL
Wire Wire Line
	6400 4250 6350 4250
Wire Wire Line
	6350 4250 6350 4200
Wire Wire Line
	6350 4200 6250 4200
Wire Wire Line
	6400 4050 6350 4050
Wire Wire Line
	6350 4050 6350 4100
Wire Wire Line
	6350 4100 6250 4100
Wire Wire Line
	5750 4100 5650 4100
Wire Wire Line
	5650 4100 5650 4000
Wire Wire Line
	5750 4200 5650 4200
Wire Wire Line
	5650 4200 5650 4300
Text Label 2900 4400 0    60   ~ 0
unreg+
Text Label 2700 4750 0    60   ~ 0
b-
Text Label 3800 3900 0    60   ~ 0
b+
Text Label 3000 4850 0    60   ~ 0
unreg-
Wire Wire Line
	2500 1100 1300 1100
Wire Wire Line
	1300 1100 1300 4400
Text Notes 650  800  0    60   ~ 0
Note: J1 connects directly to USB +5V, but it's not present on a pin, \nin stead the really-raw 5V from USB is connected via a wire to the solder jumper J1\nThis connection is used to drive the battery charger, this way it's possible to program the Arduino and charge the battery via the same cable.
$EndSCHEMATC
