(export (version D)
  (design
    (source /home/ff/projects/aammf/2018/aammf-badge-2018/kicad/cog-badge.sch)
    (date "fre 14 sep 2018 19:13:25 CEST")
    (tool "Eeschema 4.0.2+dfsg1-stable")
    (sheet (number 1) (name /) (tstamps /)
      (title_block
        (title)
        (company)
        (rev)
        (date)
        (source cog-badge.sch)
        (comment (number 1) (value ""))
        (comment (number 2) (value ""))
        (comment (number 3) (value ""))
        (comment (number 4) (value "")))))
  (components
    (comp (ref M1)
      (value promicro)
      (footprint cog-badge:promicro-DIP-24)
      (libsource (lib promicro) (part promicro))
      (sheetpath (names /) (tstamps /))
      (tstamp 5B266749))
    (comp (ref P1)
      (value MPU6050)
      (footprint cog-badge:mpu6050-module)
      (libsource (lib conn) (part CONN_01X08))
      (sheetpath (names /) (tstamps /))
      (tstamp 5B267B46))
    (comp (ref P4)
      (value isp)
      (footprint cog-badge:6-pin-ISP-Header)
      (libsource (lib conn) (part CONN_02X03))
      (sheetpath (names /) (tstamps /))
      (tstamp 5B268F17))
    (comp (ref D1)
      (value WS2812B)
      (footprint LEDs.pretty:LED_WS2812B-PLCC4)
      (libsource (lib LED) (part WS2812B))
      (sheetpath (names /) (tstamps /))
      (tstamp 5B7A8151))
    (comp (ref M3)
      (value boost-converter)
      (footprint cog-badge:boost-converter)
      (libsource (lib boost-converter) (part boost-converter))
      (sheetpath (names /) (tstamps /))
      (tstamp 5B7A82AB))
    (comp (ref M2)
      (value lipo-charger)
      (footprint cog-badge:lipo-charger)
      (libsource (lib lipo-charger) (part lipo-charger))
      (sheetpath (names /) (tstamps /))
      (tstamp 5B7A8439))
    (comp (ref D3)
      (value WS2812B)
      (footprint LEDs.pretty:LED_WS2812B-PLCC4)
      (libsource (lib LED) (part WS2812B))
      (sheetpath (names /) (tstamps /))
      (tstamp 5B7A84EF))
    (comp (ref D5)
      (value WS2812B)
      (footprint LEDs.pretty:LED_WS2812B-PLCC4)
      (libsource (lib LED) (part WS2812B))
      (sheetpath (names /) (tstamps /))
      (tstamp 5B7A851C))
    (comp (ref D7)
      (value WS2812B)
      (footprint LEDs.pretty:LED_WS2812B-PLCC4)
      (libsource (lib LED) (part WS2812B))
      (sheetpath (names /) (tstamps /))
      (tstamp 5B7A8565))
    (comp (ref D9)
      (value WS2812B)
      (footprint LEDs.pretty:LED_WS2812B-PLCC4)
      (libsource (lib LED) (part WS2812B))
      (sheetpath (names /) (tstamps /))
      (tstamp 5B7A8598))
    (comp (ref D2)
      (value WS2812B)
      (footprint LEDs.pretty:LED_WS2812B-PLCC4)
      (libsource (lib LED) (part WS2812B))
      (sheetpath (names /) (tstamps /))
      (tstamp 5B7A85EA))
    (comp (ref D4)
      (value WS2812B)
      (footprint LEDs.pretty:LED_WS2812B-PLCC4)
      (libsource (lib LED) (part WS2812B))
      (sheetpath (names /) (tstamps /))
      (tstamp 5B7A8681))
    (comp (ref D6)
      (value WS2812B)
      (footprint LEDs.pretty:LED_WS2812B-PLCC4)
      (libsource (lib LED) (part WS2812B))
      (sheetpath (names /) (tstamps /))
      (tstamp 5B7A86C4))
    (comp (ref D8)
      (value WS2812B)
      (footprint LEDs.pretty:LED_WS2812B-PLCC4)
      (libsource (lib LED) (part WS2812B))
      (sheetpath (names /) (tstamps /))
      (tstamp 5B7A870F))
    (comp (ref D10)
      (value WS2812B)
      (footprint LEDs.pretty:LED_WS2812B-PLCC4)
      (libsource (lib LED) (part WS2812B))
      (sheetpath (names /) (tstamps /))
      (tstamp 5B7A875A))
    (comp (ref C5)
      (value 100nF)
      (footprint Capacitors_SMD.pretty:C_0603_HandSoldering)
      (libsource (lib device) (part C_Small))
      (sheetpath (names /) (tstamps /))
      (tstamp 5B7A9592))
    (comp (ref C6)
      (value 100nF)
      (footprint Capacitors_SMD.pretty:C_0603_HandSoldering)
      (libsource (lib device) (part C_Small))
      (sheetpath (names /) (tstamps /))
      (tstamp 5B7A964B))
    (comp (ref C7)
      (value 100nF)
      (footprint Capacitors_SMD.pretty:C_0603_HandSoldering)
      (libsource (lib device) (part C_Small))
      (sheetpath (names /) (tstamps /))
      (tstamp 5B7A9701))
    (comp (ref C8)
      (value 100nF)
      (footprint Capacitors_SMD.pretty:C_0603_HandSoldering)
      (libsource (lib device) (part C_Small))
      (sheetpath (names /) (tstamps /))
      (tstamp 5B7A9707))
    (comp (ref C1)
      (value 100nF)
      (footprint Capacitors_SMD.pretty:C_0603_HandSoldering)
      (libsource (lib device) (part C_Small))
      (sheetpath (names /) (tstamps /))
      (tstamp 5B7A9BE5))
    (comp (ref C2)
      (value 100nF)
      (footprint Capacitors_SMD.pretty:C_0603_HandSoldering)
      (libsource (lib device) (part C_Small))
      (sheetpath (names /) (tstamps /))
      (tstamp 5B7A9BEB))
    (comp (ref C3)
      (value 100nF)
      (footprint Capacitors_SMD.pretty:C_0603_HandSoldering)
      (libsource (lib device) (part C_Small))
      (sheetpath (names /) (tstamps /))
      (tstamp 5B7A9BF1))
    (comp (ref C4)
      (value 100nF)
      (footprint Capacitors_SMD.pretty:C_0603_HandSoldering)
      (libsource (lib device) (part C_Small))
      (sheetpath (names /) (tstamps /))
      (tstamp 5B7A9BF7))
    (comp (ref C9)
      (value 100nF)
      (footprint Capacitors_SMD.pretty:C_0603_HandSoldering)
      (libsource (lib device) (part C_Small))
      (sheetpath (names /) (tstamps /))
      (tstamp 5B7A9E5D))
    (comp (ref C10)
      (value 100nF)
      (footprint Capacitors_SMD.pretty:C_0603_HandSoldering)
      (libsource (lib device) (part C_Small))
      (sheetpath (names /) (tstamps /))
      (tstamp 5B7A9E63))
    (comp (ref W5)
      (value LED-out)
      (footprint cog-badge:tp)
      (libsource (lib conn) (part TEST_1P))
      (sheetpath (names /) (tstamps /))
      (tstamp 5B7ABFBB))
    (comp (ref W24)
      (value +)
      (footprint cog-badge:tp)
      (libsource (lib conn) (part TEST_1P))
      (sheetpath (names /) (tstamps /))
      (tstamp 5B7AD279))
    (comp (ref W25)
      (value 0)
      (footprint cog-badge:tp)
      (libsource (lib conn) (part TEST_1P))
      (sheetpath (names /) (tstamps /))
      (tstamp 5B7ADD3C))
    (comp (ref W3)
      (value b+)
      (footprint cog-badge:tp)
      (libsource (lib conn) (part TEST_1P))
      (sheetpath (names /) (tstamps /))
      (tstamp 5B7AE628))
    (comp (ref W4)
      (value b-)
      (footprint cog-badge:tp)
      (libsource (lib conn) (part TEST_1P))
      (sheetpath (names /) (tstamps /))
      (tstamp 5B7AE704))
    (comp (ref W23)
      (value 0)
      (footprint cog-badge:tp)
      (libsource (lib conn) (part TEST_1P))
      (sheetpath (names /) (tstamps /))
      (tstamp 5B7ADD36))
    (comp (ref W22)
      (value +)
      (footprint cog-badge:tp)
      (libsource (lib conn) (part TEST_1P))
      (sheetpath (names /) (tstamps /))
      (tstamp 5B7AD273))
    (comp (ref SW1)
      (value power-sw)
      (footprint cog-badge:SW_SPDT_PCM12)
      (libsource (lib device) (part SWITCH_INV))
      (sheetpath (names /) (tstamps /))
      (tstamp 5B8505E6))
    (comp (ref P2)
      (value "shitty addon")
      (footprint cog-badge:shittyaddon)
      (libsource (lib conn) (part CONN_02X02))
      (sheetpath (names /) (tstamps /))
      (tstamp 5B866475)))
  (libparts
    (libpart (lib conn) (part CONN_01X08)
      (description "Connector 01x08")
      (footprints
        (fp Pin_Header_Straight_1X08)
        (fp Pin_Header_Angled_1X08)
        (fp Socket_Strip_Straight_1X08)
        (fp Socket_Strip_Angled_1X08))
      (fields
        (field (name Reference) P)
        (field (name Value) CONN_01X08))
      (pins
        (pin (num 1) (name P1) (type passive))
        (pin (num 2) (name P2) (type passive))
        (pin (num 3) (name P3) (type passive))
        (pin (num 4) (name P4) (type passive))
        (pin (num 5) (name P5) (type passive))
        (pin (num 6) (name P6) (type passive))
        (pin (num 7) (name P7) (type passive))
        (pin (num 8) (name P8) (type passive))))
    (libpart (lib conn) (part CONN_02X02)
      (description "Connector 02x02")
      (footprints
        (fp Pin_Header_Straight_2X02)
        (fp Pin_Header_Angled_2X02)
        (fp Socket_Strip_Straight_2X02)
        (fp Socket_Strip_Angled_2X02))
      (fields
        (field (name Reference) P)
        (field (name Value) CONN_02X02))
      (pins
        (pin (num 1) (name P1) (type passive))
        (pin (num 2) (name P2) (type passive))
        (pin (num 3) (name P3) (type passive))
        (pin (num 4) (name P4) (type passive))))
    (libpart (lib conn) (part CONN_02X03)
      (description "Connector 02x03")
      (footprints
        (fp Pin_Header_Straight_2X03)
        (fp Pin_Header_Angled_2X03)
        (fp Socket_Strip_Straight_2X03)
        (fp Socket_Strip_Angled_2X03))
      (fields
        (field (name Reference) P)
        (field (name Value) CONN_02X03))
      (pins
        (pin (num 1) (name P1) (type passive))
        (pin (num 2) (name P2) (type passive))
        (pin (num 3) (name P3) (type passive))
        (pin (num 4) (name P4) (type passive))
        (pin (num 5) (name P5) (type passive))
        (pin (num 6) (name P6) (type passive))))
    (libpart (lib device) (part C_Small)
      (description "Unpolarized capacitor")
      (footprints
        (fp C?)
        (fp C_????_*)
        (fp C_????)
        (fp SMD*_c)
        (fp Capacitor*))
      (fields
        (field (name Reference) C)
        (field (name Value) C_Small))
      (pins
        (pin (num 1) (name ~) (type passive))
        (pin (num 2) (name ~) (type passive))))
    (libpart (lib device) (part SWITCH_INV)
      (description inverseur)
      (fields
        (field (name Reference) SW)
        (field (name Value) SWITCH_INV))
      (pins
        (pin (num 1) (name 1) (type passive))
        (pin (num 2) (name 2) (type passive))
        (pin (num 3) (name 3) (type passive))))
    (libpart (lib conn) (part TEST_1P)
      (description point)
      (fields
        (field (name Reference) W)
        (field (name Value) TEST_1P))
      (pins
        (pin (num 1) (name 1) (type passive))))
    (libpart (lib LED) (part WS2812B)
      (description "RGB LED with integrated controller")
      (docs https://cdn-shop.adafruit.com/datasheets/WS2812B.pdf)
      (footprints
        (fp LED*WS2812*PLCC*5.0x5.0mm*P3.2mm*))
      (fields
        (field (name Reference) D)
        (field (name Value) WS2812B)
        (field (name Footprint) LED_SMD:LED_WS2812B_PLCC4_5.0x5.0mm_P3.2mm))
      (pins
        (pin (num 1) (name VDD) (type power_in))
        (pin (num 2) (name DOUT) (type output))
        (pin (num 3) (name VSS) (type power_in))
        (pin (num 4) (name DIN) (type input))))
    (libpart (lib boost-converter) (part boost-converter)
      (fields
        (field (name Reference) M)
        (field (name Value) boost-converter))
      (pins
        (pin (num 1) (name in+) (type power_in))
        (pin (num 2) (name in-) (type power_in))
        (pin (num 3) (name +5v) (type power_out))
        (pin (num 4) (name GND) (type power_out))))
    (libpart (lib lipo-charger) (part lipo-charger)
      (fields
        (field (name Reference) M)
        (field (name Value) lipo-charger))
      (pins
        (pin (num 1) (name in+) (type power_in))
        (pin (num 2) (name In-) (type power_in))
        (pin (num 3) (name Out-) (type power_out))
        (pin (num 4) (name Bat-) (type power_out))
        (pin (num 5) (name Bat+) (type power_out))
        (pin (num 6) (name Out+) (type power_out))))
    (libpart (lib promicro) (part promicro)
      (fields
        (field (name Reference) M)
        (field (name Value) promicro))
      (pins
        (pin (num 1) (name PD3) (type input))
        (pin (num 2) (name PD2) (type input))
        (pin (num 3) (name GND) (type input))
        (pin (num 4) (name GND) (type input))
        (pin (num 5) (name PD1) (type input))
        (pin (num 6) (name PD0) (type input))
        (pin (num 7) (name PD4) (type input))
        (pin (num 8) (name PD6) (type input))
        (pin (num 9) (name PD7) (type input))
        (pin (num 10) (name PE6) (type input))
        (pin (num 11) (name PB4) (type input))
        (pin (num 12) (name PB5) (type input))
        (pin (num 13) (name PB6) (type input))
        (pin (num 14) (name PB2) (type input))
        (pin (num 15) (name PB3) (type input))
        (pin (num 16) (name PB1) (type input))
        (pin (num 17) (name PF7) (type input))
        (pin (num 18) (name PF6) (type input))
        (pin (num 19) (name PF5) (type input))
        (pin (num 20) (name PF4) (type input))
        (pin (num 21) (name VCC) (type input))
        (pin (num 22) (name ~RESET) (type input))
        (pin (num 23) (name GND) (type input))
        (pin (num 24) (name RAW) (type input))
        (pin (num 25) (name J1) (type input)))))
  (libraries
    (library (logical device)
      (uri /usr/share/kicad/library/device.lib))
    (library (logical conn)
      (uri /usr/share/kicad/library/conn.lib))
    (library (logical boost-converter)
      (uri /home/ff/projects/aammf/2018/aammf-badge-2018/kicad/boost-converter.lib))
    (library (logical promicro)
      (uri /home/ff/projects/aammf/2018/aammf-badge-2018/kicad/promicro.lib))
    (library (logical lipo-charger)
      (uri /home/ff/projects/aammf/2018/aammf-badge-2018/kicad/lipo-charger.lib))
    (library (logical LED)
      (uri /home/ff/projects/aammf/2018/aammf-badge-2018/kicad/LED.lib)))
  (nets
    (net (code 1) (name "Net-(D10-Pad2)")
      (node (ref D10) (pin 2))
      (node (ref W5) (pin 1)))
    (net (code 2) (name "Net-(D10-Pad4)")
      (node (ref D8) (pin 2))
      (node (ref D10) (pin 4)))
    (net (code 3) (name "Net-(D6-Pad2)")
      (node (ref D8) (pin 4))
      (node (ref D6) (pin 2)))
    (net (code 4) (name "Net-(D4-Pad2)")
      (node (ref D6) (pin 4))
      (node (ref D4) (pin 2)))
    (net (code 5) (name "Net-(D2-Pad4)")
      (node (ref D9) (pin 2))
      (node (ref D2) (pin 4)))
    (net (code 6) (name "Net-(D2-Pad2)")
      (node (ref D2) (pin 2))
      (node (ref D4) (pin 4)))
    (net (code 7) (name "Net-(D7-Pad2)")
      (node (ref D9) (pin 4))
      (node (ref D7) (pin 2)))
    (net (code 8) (name PE6)
      (node (ref D1) (pin 4))
      (node (ref M1) (pin 10)))
    (net (code 9) (name "Net-(D5-Pad2)")
      (node (ref D7) (pin 4))
      (node (ref D5) (pin 2)))
    (net (code 10) (name "Net-(D3-Pad2)")
      (node (ref D5) (pin 4))
      (node (ref D3) (pin 2)))
    (net (code 11) (name "Net-(D1-Pad2)")
      (node (ref D3) (pin 4))
      (node (ref D1) (pin 2)))
    (net (code 12) (name +5V)
      (node (ref M1) (pin 21))
      (node (ref P1) (pin 1))
      (node (ref P4) (pin 2))
      (node (ref P2) (pin 1)))
    (net (code 13) (name SCL)
      (node (ref P1) (pin 3))
      (node (ref P2) (pin 4))
      (node (ref M1) (pin 6)))
    (net (code 14) (name SDA)
      (node (ref P2) (pin 2))
      (node (ref P1) (pin 4))
      (node (ref M1) (pin 5)))
    (net (code 15) (name "Net-(M2-Pad5)")
      (node (ref M2) (pin 5))
      (node (ref SW1) (pin 2)))
    (net (code 16) (name "Net-(SW1-Pad3)")
      (node (ref SW1) (pin 3)))
    (net (code 17) (name "Net-(M1-Pad25)")
      (node (ref M1) (pin 25))
      (node (ref M2) (pin 1)))
    (net (code 18) (name /b+)
      (node (ref SW1) (pin 1))
      (node (ref W3) (pin 1)))
    (net (code 19) (name /b-)
      (node (ref M2) (pin 4))
      (node (ref W4) (pin 1)))
    (net (code 20) (name PF5)
      (node (ref M1) (pin 19)))
    (net (code 21) (name PF4)
      (node (ref M1) (pin 20)))
    (net (code 22) (name TX)
      (node (ref M1) (pin 1)))
    (net (code 23) (name RX)
      (node (ref M1) (pin 2)))
    (net (code 24) (name MISO)
      (node (ref P4) (pin 1))
      (node (ref M1) (pin 15)))
    (net (code 25) (name ~Reset)
      (node (ref P4) (pin 5))
      (node (ref M1) (pin 22)))
    (net (code 26) (name MOSI)
      (node (ref P4) (pin 4))
      (node (ref M1) (pin 14)))
    (net (code 27) (name SCK)
      (node (ref P4) (pin 3))
      (node (ref M1) (pin 16)))
    (net (code 28) (name PB6)
      (node (ref M1) (pin 13)))
    (net (code 29) (name "Net-(P1-Pad5)")
      (node (ref P1) (pin 5)))
    (net (code 30) (name "Net-(P1-Pad8)")
      (node (ref P1) (pin 8)))
    (net (code 31) (name "Net-(P1-Pad7)")
      (node (ref P1) (pin 7)))
    (net (code 32) (name "Net-(P1-Pad6)")
      (node (ref P1) (pin 6)))
    (net (code 33) (name PF6)
      (node (ref M1) (pin 18)))
    (net (code 34) (name PF7)
      (node (ref M1) (pin 17)))
    (net (code 35) (name "Net-(M2-Pad2)")
      (node (ref M2) (pin 2)))
    (net (code 36) (name /unreg+)
      (node (ref M3) (pin 1))
      (node (ref M2) (pin 6)))
    (net (code 37) (name /unreg-)
      (node (ref M2) (pin 3))
      (node (ref M3) (pin 2)))
    (net (code 38) (name GND)
      (node (ref D3) (pin 3))
      (node (ref M1) (pin 23))
      (node (ref P1) (pin 2))
      (node (ref M1) (pin 3))
      (node (ref M1) (pin 4))
      (node (ref D5) (pin 3))
      (node (ref M3) (pin 4))
      (node (ref D1) (pin 3))
      (node (ref D7) (pin 3))
      (node (ref W23) (pin 1))
      (node (ref D8) (pin 3))
      (node (ref D6) (pin 3))
      (node (ref D10) (pin 3))
      (node (ref D4) (pin 3))
      (node (ref D2) (pin 3))
      (node (ref P2) (pin 3))
      (node (ref C2) (pin 2))
      (node (ref C1) (pin 2))
      (node (ref C8) (pin 2))
      (node (ref C7) (pin 2))
      (node (ref C6) (pin 2))
      (node (ref C5) (pin 2))
      (node (ref C3) (pin 2))
      (node (ref D9) (pin 3))
      (node (ref W25) (pin 1))
      (node (ref C4) (pin 2))
      (node (ref P4) (pin 6))
      (node (ref C10) (pin 2))
      (node (ref C9) (pin 2)))
    (net (code 39) (name +5VP)
      (node (ref C7) (pin 1))
      (node (ref D3) (pin 1))
      (node (ref C8) (pin 1))
      (node (ref C5) (pin 1))
      (node (ref C1) (pin 1))
      (node (ref C2) (pin 1))
      (node (ref C6) (pin 1))
      (node (ref W22) (pin 1))
      (node (ref D4) (pin 1))
      (node (ref M1) (pin 24))
      (node (ref D2) (pin 1))
      (node (ref C3) (pin 1))
      (node (ref M3) (pin 3))
      (node (ref C4) (pin 1))
      (node (ref D1) (pin 1))
      (node (ref C9) (pin 1))
      (node (ref C10) (pin 1))
      (node (ref D6) (pin 1))
      (node (ref D9) (pin 1))
      (node (ref D7) (pin 1))
      (node (ref W24) (pin 1))
      (node (ref D10) (pin 1))
      (node (ref D5) (pin 1))
      (node (ref D8) (pin 1)))
    (net (code 40) (name PB4)
      (node (ref M1) (pin 11)))
    (net (code 41) (name PD7)
      (node (ref M1) (pin 9)))
    (net (code 42) (name PD6)
      (node (ref M1) (pin 8)))
    (net (code 43) (name PD4)
      (node (ref M1) (pin 7)))
    (net (code 44) (name PB5)
      (node (ref M1) (pin 12)))))