<svg xmlns='http://www.w3.org/2000/svg' width='20' height='20' fill='none' viewBox='0 0 20 20'>
	<path fill='#1A181E' fill-rule='evenodd' d='M1.767 9.998c.092.158.214.36.365.595.385.595.954 1.387 1.694 2.176C5.32 14.364 7.41 15.845 10 15.845c2.59 0 4.68-1.482 6.174-3.076.74-.789 1.31-1.58 1.694-2.176.151-.234.273-.437.365-.595-.092-.158-.214-.36-.365-.595-.384-.595-.954-1.387-1.694-2.176C14.68 5.632 12.59 4.15 10 4.15c-2.59 0-4.68 1.481-6.174 3.076-.74.789-1.31 1.58-1.694 2.176-.151.234-.273.437-.365.595zm17.407 0l.739-.37-.002-.003-.003-.005L19.9 9.6l-.034-.064c-.029-.055-.07-.133-.126-.23-.11-.196-.271-.471-.483-.8-.424-.655-1.053-1.53-1.877-2.41C15.746 4.355 13.249 2.5 10 2.5c-3.249 0-5.746 1.855-7.379 3.597-.824.88-1.453 1.755-1.876 2.41-.213.329-.374.604-.484.8-.055.097-.097.175-.126.23L.1 9.6l-.01.019-.002.005-.001.002s0 .002.738.371l-.739-.37c-.116.233-.116.507 0 .74l.739-.37-.739.37.002.002.003.006.01.019.033.064c.029.055.07.133.126.23.11.196.271.471.484.8.423.655 1.052 1.53 1.876 2.41 1.633 1.742 4.13 3.597 7.38 3.597 3.248 0 5.745-1.855 7.378-3.597.824-.88 1.453-1.755 1.877-2.41.212-.329.373-.604.483-.8.055-.097.097-.175.126-.23l.034-.064.01-.019.002-.005.001-.003-.738-.37zm0 0l.739.37c.116-.233.116-.507 0-.74l-.739.37z' clip-rule='evenodd'></path>
	<path fill='#1A181E' fill-rule='evenodd' d='M10 8.321c-.926 0-1.676.75-1.676 1.677 0 .926.75 1.676 1.676 1.676.926 0 1.677-.75 1.677-1.676 0-.926-.751-1.677-1.677-1.677zM6.672 9.998C6.672 8.16 8.162 6.67 10 6.67c1.838 0 3.328 1.49 3.328 3.328 0 1.838-1.49 3.328-3.328 3.328-1.838 0-3.328-1.49-3.328-3.328z' clip-rule='evenodd'></path>
</svg>