<svg width='24' height='24' viewBox='0 0 24 24' fill='none' xmlns='http://www.w3.org/2000/svg' class=''>
	<title>Grid view</title>
	<mask id='path-1-inside-1' fill='white'>
		<rect x='2' y='2' width='9' height='9' rx='1'></rect>
	</mask>
	<rect x='2' y='2' width='9' height='9' rx='1' stroke='#4D4D4D' stroke-width='3.4' mask='url(#path-1-inside-1)'></rect>
	<mask id='path-2-inside-2' fill='white'>
		<rect x='2' y='13' width='9' height='9' rx='1'></rect>
	</mask>
	<rect x='2' y='13' width='9' height='9' rx='1' stroke='#4D4D4D' stroke-width='3.4' mask='url(#path-2-inside-2)'></rect>
	<mask id='path-3-inside-3' fill='white'>
		<rect x='13' y='2' width='9' height='9' rx='1'></rect>
	</mask>
	<rect x='13' y='2' width='9' height='9' rx='1' stroke='#4D4D4D' stroke-width='3.4' mask='url(#path-3-inside-3)'></rect>
	<mask id='path-4-inside-4' fill='white'>
		<rect x='13' y='13' width='9' height='9' rx='1'></rect>
	</mask>
	<rect x='13' y='13' width='9' height='9' rx='1' stroke='#4D4D4D' stroke-width='3.4' mask='url(#path-4-inside-4)'></rect>
</svg>