<?xml version="1.0" encoding="utf-8"?>
<!-- Generator: Adobe Illustrator 16.0.0, SVG Export Plug-In . SVG Version: 6.00 Build 0)  -->
<!DOCTYPE svg PUBLIC "-//W3C//DTD SVG 1.1//EN" "http://www.w3.org/Graphics/SVG/1.1/DTD/svg11.dtd">
<svg version="1.1" id="Layer_1" xmlns="http://www.w3.org/2000/svg" xmlns:xlink="http://www.w3.org/1999/xlink" x="0px" y="0px"
	 width="32px" height="32px" viewBox="0 0 32 32" enable-background="new 0 0 32 32" xml:space="preserve">
<g id="Symbols-IamElite">
	<g id="M-Header-Black-Men_x27_s-Training" transform="translate(-74.000000, -52.000000)">
		<path id="Page-1" fill="#FFFFFF" d="M90,71.669l12.44-11.363c0.798-0.762,2.082-0.777,2.88-0.015
			c0.8,0.764,0.786,1.985-0.014,2.747L91.46,75.685c-0.408,0.396-0.903,0.579-1.402,0.587c-0.078,0.005-0.097,0-0.116,0
			c-0.5-0.008-0.995-0.191-1.377-0.558c-0.007-0.006-4.631-4.231-13.872-12.676c-0.799-0.762-0.813-1.983-0.015-2.747
			c0.799-0.762,2.081-0.747,2.879,0.015L90,71.669z"/>
	</g>
</g>
</svg>
