<?xml version="1.0" encoding="UTF-8"?>
<svg width="22px" height="22px" viewBox="0 0 22 22" version="1.1" xmlns="http://www.w3.org/2000/svg" xmlns:xlink="http://www.w3.org/1999/xlink">
    <!-- Generator: Sketch 46.2 (44496) - http://www.bohemiancoding.com/sketch -->
    <title>Group Copy</title>
    <desc>Created with Sketch.</desc>
    <defs></defs>
    <g id="Welcome" stroke="none" stroke-width="1" fill="none" fill-rule="evenodd">
        <g id="11-Account" transform="translate(-317.000000, -258.000000)" stroke="#FFFFFF">
            <g id="Group-Copy" transform="translate(318.000000, 259.000000)">
                <circle id="Oval" cx="10" cy="10" r="10"></circle>
                <polyline id="Page-1" points="7.9245283 5.28301887 12.0754717 10.1886099 7.9245283 15.0943396"></polyline>
            </g>
        </g>
    </g>
</svg>