<?xml version="1.0" encoding="UTF-8"?>
<svg width="13px" height="13px" viewBox="0 0 13 13" version="1.1" xmlns="http://www.w3.org/2000/svg" xmlns:xlink="http://www.w3.org/1999/xlink">
    <!-- Generator: Sketch 46.2 (44496) - http://www.bohemiancoding.com/sketch -->
    <title>Page 1</title>
    <desc>Created with Sketch.</desc>
    <defs></defs>
    <g id="Welcome" stroke="none" stroke-width="1" fill="none" fill-rule="evenodd">
        <g id="04-Track-Your-Progress" transform="translate(-63.000000, -493.000000)" fill="#FFFFFF">
            <g id="Page-1" transform="translate(63.000000, 493.000000)">
                <path d="M0,10.0819815 C0,11.6778278 1.2468625,12.9708704 2.78571429,12.9708704 L10.2142857,12.9708704 C11.7531375,12.9708704 13,11.6778278 13,10.0819815 L13,7.67457407 C13,7.14325926 12.5846732,6.71161111 12.0714286,6.71161111 C11.5581839,6.71161111 11.1428571,7.14325926 11.1428571,7.67457407 L11.1428571,10.0819815 C11.1428571,10.3377685 11.0449207,10.5822648 10.8708089,10.7628204 C10.6966971,10.9433759 10.4609375,11.0449444 10.2142857,11.0449444 L2.78571429,11.0449444 C2.27246964,11.0449444 1.85714286,10.6142352 1.85714286,10.0819815 L1.85714286,7.67457407 C1.85714286,7.14325926 1.44181607,6.71161111 0.928571429,6.71161111 C0.415326786,6.71161111 0,7.14325926 0,7.67457407 L0,10.0819815 Z" id="Fill-1"></path>
                <path d="M6.5,10.1900741 C6.74665179,10.1900741 6.98241607,10.0894517 7.15652321,9.90888889 C7.33063036,9.72832611 7.42857143,9.48289815 7.42857143,9.22711111 L7.42857143,3.16333333 L8.83955893,4.48740741 C9.2204125,4.84382407 9.80713036,4.81373148 10.1517,4.41969907 C10.4953875,4.0256787 10.4663696,3.41629167 10.0864098,3.05989907 L7.12194554,0.279102778 C7.10562357,0.262176296 7.08476554,0.249951481 7.06663054,0.235844074 C7.04849321,0.221739074 7.02219607,0.200108519 6.99952732,0.183182037 L6.99861964,0.183182037 C6.97141482,0.165314259 6.94239696,0.149329074 6.91337911,0.134282778 L6.84355518,0.0985472222 C6.80909589,0.0853835185 6.77463661,0.0740975926 6.73927196,0.0646942593 L6.67398179,0.0458875926 C6.55700268,0.021437963 6.43640679,0.021437963 6.31852464,0.0458875926 L6.25323446,0.0646942593 L6.25414214,0.0646942593 C6.2187775,0.0741 6.18341054,0.0853835185 6.14895357,0.0985472222 L6.07912964,0.134282778 L6.08003732,0.134282778 C6.05011179,0.149329074 6.02200161,0.165316667 5.99389143,0.183182037 C5.970315,0.200110926 5.94764393,0.217035 5.92678821,0.235844074 C5.9059325,0.254653148 5.88960821,0.262176296 5.87147321,0.279102778 L2.91350893,3.05989907 C2.53356071,3.41631574 2.50454286,4.0256787 2.84821875,4.41969907 C3.19281161,4.81371944 3.77950625,4.84381204 4.16035982,4.48740741 L5.57134732,3.16333333 L5.57134732,9.22711111 C5.57134732,9.48289815 5.66928375,9.72833333 5.84339554,9.90888889 C6.01750732,10.0894444 6.25326696,10.1900741 6.49991875,10.1900741 L6.5,10.1900741 Z" id="Fill-2"></path>
            </g>
        </g>
    </g>
</svg>