com\onlineexamportal\Mapper\QuestionMapperImpl.class
com\onlineexamportal\dto\RequestStudentSelectedAnswerDto.class
com\onlineexamportal\repositories\UserRepository.class
com\onlineexamportal\services\impl\ScreenShotImageStorageServiceImpl.class
com\onlineexamportal\exceptions\UnauthorizedException.class
com\onlineexamportal\dto\ApiResponse\SuccessResponseDTO.class
com\onlineexamportal\dto\RequestQuestionImageDto.class
com\onlineexamportal\services\impl\QuestionServiceImpl.class
com\onlineexamportal\services\impl\ResultServiceImpl.class
com\onlineexamportal\dto\ResponseSelectedAnswerByCategoryDto.class
com\onlineexamportal\entities\ScreenShotImages.class
com\onlineexamportal\services\CloudinaryImageService.class
com\onlineexamportal\dto\ApiResponse\ErrorResponseDTO.class
com\onlineexamportal\entities\StudentSelectedAnswer.class
com\onlineexamportal\dto\ExamQuestionDto.class
com\onlineexamportal\controller\UserController.class
com\onlineexamportal\dto\UpdateResultStatusDto.class
com\onlineexamportal\controller\ExamController.class
com\onlineexamportal\services\impl\CategoryServiceImpl.class
com\onlineexamportal\dto\ResponseCategoryPassingMarksDto.class
com\onlineexamportal\entities\QuestionImage.class
com\onlineexamportal\controller\ResultController.class
com\onlineexamportal\dto\ResponseScreenShotImageDto.class
com\onlineexamportal\services\impl\StudentSelectedAnswerServiceImpl.class
com\onlineexamportal\Mapper\ExamMapper.class
com\onlineexamportal\Mapper\ResultMapper.class
com\onlineexamportal\dto\QuestionDto.class
com\onlineexamportal\dto\RequestUserDto.class
com\onlineexamportal\exceptions\BadRequestException.class
com\onlineexamportal\services\RoleService.class
com\onlineexamportal\dto\RequestSelectedAnswerByCategoryDto.class
com\onlineexamportal\services\impl\CloudinaryImageServiceImpl.class
com\onlineexamportal\services\ExamService.class
com\onlineexamportal\dto\ResponseStudentSelectedAnswerDto.class
com\onlineexamportal\security\JwtAuthenticationFilter.class
com\onlineexamportal\controller\CloudinaryController.class
com\onlineexamportal\dto\ResponseQuestionImageDto.class
com\onlineexamportal\repositories\QuestionImageRepository.class
com\onlineexamportal\dto\RequestExamStudentDto.class
com\onlineexamportal\entities\JwtRequest.class
com\onlineexamportal\enums\Difficulty.class
com\onlineexamportal\services\ScreenShotImageStorageService.class
com\onlineexamportal\dto\FinalResultResponseDto.class
com\onlineexamportal\dto\QuestionToSelectedAnswerDto.class
com\onlineexamportal\services\ExamStudentService.class
com\onlineexamportal\services\CategoryPassingMarksService.class
com\onlineexamportal\Mapper\CategoryMapperImpl.class
com\onlineexamportal\dto\ResponseUserDto.class
com\onlineexamportal\services\StudentSelectedAnswerService.class
com\onlineexamportal\dto\ResponseUserStudentDto.class
com\onlineexamportal\dto\RequestSelectedAnswerToMarkDto.class
com\onlineexamportal\dto\ResponseResultDto.class
com\onlineexamportal\dto\ResponseResultDetailDto.class
com\onlineexamportal\dto\RequestCategoryDto.class
com\onlineexamportal\services\UserService.class
com\onlineexamportal\services\ResultService.class
com\onlineexamportal\controller\QuestionController.class
com\onlineexamportal\Mapper\ExamMapperImpl.class
com\onlineexamportal\repositories\StudentSelectedAnswerRepository.class
com\onlineexamportal\entities\User.class
com\onlineexamportal\repositories\ResultRepository.class
com\onlineexamportal\security\JwtAuthenticationEntryPoint.class
com\onlineexamportal\repositories\CategoryRepository.class
com\onlineexamportal\dto\RequestGenerateExamDto.class
com\onlineexamportal\dto\ResponseResultWithExamDetailDto.class
com\onlineexamportal\repositories\QuestionRepository.class
com\onlineexamportal\dto\AdminDashboardDto.class
com\onlineexamportal\Mapper\CategoryMapper.class
com\onlineexamportal\config\ProjectConfig.class
com\onlineexamportal\entities\Question.class
com\onlineexamportal\dto\CategoryQuestionCountDto.class
com\onlineexamportal\dto\ResponseObtainedMarkDto.class
com\onlineexamportal\enums\UserRole.class
com\onlineexamportal\config\AppConfig.class
com\onlineexamportal\controller\AuthController.class
com\onlineexamportal\controller\AdminController.class
com\onlineexamportal\dto\RequestCategoryPassingMarksDto.class
com\onlineexamportal\dto\ResponseCategoryDto.class
com\onlineexamportal\entities\Category.class
com\onlineexamportal\dto\StudentDashboardDto.class
com\onlineexamportal\Mapper\UserMapper.class
com\onlineexamportal\repositories\ScreenShotImagesRepository.class
com\onlineexamportal\dto\RoleDto.class
com\onlineexamportal\security\JwtHelper.class
com\onlineexamportal\Mapper\StudentSelectedAnswerMapper.class
com\onlineexamportal\config\CorsConfiguration.class
com\onlineexamportal\entities\Result.class
com\onlineexamportal\Mapper\ResultMapperImpl.class
com\onlineexamportal\Mapper\UserMapperImpl.class
com\onlineexamportal\services\QuestionService.class
com\onlineexamportal\services\CategoryService.class
com\onlineexamportal\enums\Category.class
com\onlineexamportal\dto\ApiResponse\SuccessResponseDTO$SuccessResponseDTOBuilder.class
com\onlineexamportal\dto\LoginRequestDto.class
com\onlineexamportal\repositories\ExamRepository.class
com\onlineexamportal\services\impl\UserServiceImpl.class
com\onlineexamportal\exceptionHandler\RestExceptionHandler.class
com\onlineexamportal\exceptions\NotEnoughQuestionsException.class
com\onlineexamportal\Mapper\ResponseQuestionImageDto.class
com\onlineexamportal\controller\StudentSelectedAnswerController.class
com\onlineexamportal\security\SecurityConfig.class
com\onlineexamportal\StartApplication.class
com\onlineexamportal\dto\RequestResultDto.class
com\onlineexamportal\services\impl\ExamServiceImpl.class
com\onlineexamportal\controller\ScreenShotImagesController.class
com\onlineexamportal\entities\JwtResponse.class
com\onlineexamportal\entities\ScreenShotImages$ScreenShotImagesBuilder.class
com\onlineexamportal\dto\RequestExamDto.class
com\onlineexamportal\exceptions\MinMarksAlreadySetException.class
com\onlineexamportal\dto\ApiResponse\ErrorResponseDTO$ErrorResponseDTOBuilder.class
com\onlineexamportal\controller\CategoryController.class
com\onlineexamportal\dto\ResponseQuestionDto.class
com\onlineexamportal\repositories\ExamStudentRepository.class
com\onlineexamportal\entities\Exam.class
com\onlineexamportal\dto\ResponseExamDto.class
com\onlineexamportal\Mapper\QuestionMapper.class
com\onlineexamportal\Mapper\StudentSelectedAnswerMapperImpl.class
