/Users/arky/IdeaProjects/school/src/main/java/com/plusitsolution/intership/school/config/ElasticsearchConfig.java
/Users/arky/IdeaProjects/school/src/main/java/com/plusitsolution/intership/school/controller/Controller.java
/Users/arky/IdeaProjects/school/src/main/java/com/plusitsolution/intership/school/es/StudentEntity.java
/Users/arky/IdeaProjects/school/src/main/java/com/plusitsolution/intership/school/service/StudentService.java
/Users/arky/IdeaProjects/school/src/main/java/com/plusitsolution/intership/school/App.java
/Users/arky/IdeaProjects/school/src/main/java/com/plusitsolution/intership/school/repo/StudentRepo.java
/Users/arky/IdeaProjects/school/src/main/java/com/plusitsolution/intership/school/config/SwaggerConfig.java
/Users/arky/IdeaProjects/school/src/main/java/com/plusitsolution/intership/school/domain/Student.java
