{
	"info": {
		"_postman_id": "e58cfff5-065c-4e0c-ad5f-28ab77581d56",
		"name": "Qa Refresher GoRest",
		"schema": "https://schema.getpostman.com/json/collection/v2.1.0/collection.json"
	},
	"item": [
		{
			"name": "New Request",
			"request": {
				"method": "GET",
				"header": [],
				"url": {
					"raw": "https://gorest.co.in/public/v2/users",
					"protocol": "https",
					"host": [
						"gorest",
						"co",
						"in"
					],
					"path": [
						"public",
						"v2",
						"users"
					]
				}
			},
			"response": []
		},
		{
			"name": "New Request",
			"event": [
				{
					"listen": "test",
					"script": {
						"exec": [
							"pm.test(\"fetching id value from response body\", function(){",
							"   const jsonData=pm.response.json();",
							"   const id= jsonData.id;",
							"   pm.collectionVariables.set(\"idValue\", id);",
							"})",
							"",
							""
						],
						"type": "text/javascript"
					}
				}
			],
			"request": {
				"method": "POST",
				"header": [
					{
						"key": "Authorization",
						"value": "Bearer 3846b690bee1fd1f2ae522d7dd4f7f2be4eb8036137474ec0857ab00226eb003",
						"type": "default"
					}
				],
				"body": {
					"mode": "raw",
					"raw": " {\n        \"name\": \"Aaditya Patil\",\n        \"email\": \"aadityapatil12@gmail.com\",\n        \"gender\": \"male\",\n        \"status\": \"active\"\n    }",
					"options": {
						"raw": {
							"language": "json"
						}
					}
				},
				"url": {
					"raw": "https://gorest.co.in/public/v2/users",
					"protocol": "https",
					"host": [
						"gorest",
						"co",
						"in"
					],
					"path": [
						"public",
						"v2",
						"users"
					]
				}
			},
			"response": []
		},
		{
			"name": "New Request",
			"request": {
				"method": "PUT",
				"header": [
					{
						"key": "Authorization",
						"value": "Bearer 3846b690bee1fd1f2ae522d7dd4f7f2be4eb8036137474ec0857ab00226eb003",
						"type": "default"
					}
				],
				"body": {
					"mode": "raw",
					"raw": "{\n    \"name\": \"Aaditya QA\",\n    \"email\": \"aadityapatil111@gmail.com\",\n    \"gender\": \"male\",\n    \"status\": \"active\"\n}",
					"options": {
						"raw": {
							"language": "json"
						}
					}
				},
				"url": {
					"raw": "https://gorest.co.in/public/v2/users/{{idValue}}",
					"protocol": "https",
					"host": [
						"gorest",
						"co",
						"in"
					],
					"path": [
						"public",
						"v2",
						"users",
						"{{idValue}}"
					]
				}
			},
			"response": []
		},
		{
			"name": "New Request",
			"request": {
				"method": "DELETE",
				"header": [
					{
						"key": "Authorization",
						"value": "Bearer 3846b690bee1fd1f2ae522d7dd4f7f2be4eb8036137474ec0857ab00226eb003",
						"type": "default"
					}
				],
				"url": {
					"raw": "https://gorest.co.in/public/v2/users/{{idValue}}",
					"protocol": "https",
					"host": [
						"gorest",
						"co",
						"in"
					],
					"path": [
						"public",
						"v2",
						"users",
						"{{idValue}}"
					]
				}
			},
			"response": []
		}
	],
	"variable": [
		{
			"key": "idValue",
			"value": ""
		}
	]
}