// Jest Snapshot v1, https://goo.gl/fbAQLP

exports[`transitionTimingFunctionUtilities should work with custom values 1`] = `
".twic-foo {
    --twic-transition-timing-function: bar
}"
`;

exports[`transitionTimingFunctionUtilities should work with predefined tailwind transitionTimingFunctions values 1`] = `
".twic-linear {
    --twic-transition-timing-function: linear
}
.twic-in {
    --twic-transition-timing-function: cubic-bezier(0.4, 0, 1, 1)
}
.twic-out {
    --twic-transition-timing-function: cubic-bezier(0, 0, 0.2, 1)
}
.twic-in-out {
    --twic-transition-timing-function: cubic-bezier(0.4, 0, 0.2, 1)
}"
`;
