// Jest Snapshot v1, https://goo.gl/fbAQLP

exports[`modeUtilities should work with predefined values 1`] = `
".twic-mode-cover {
    --twic-mode: cover
}
.twic-mode-contain {
    --twic-mode: contain
}"
`;
