// Jest Snapshot v1, https://goo.gl/fbAQLP

exports[`zoomUtilities should work with custom values 1`] = `
".twic-zoom-custom {
    --twic-zoom: 2
}"
`;

exports[`zoomUtilities should work with predefined values 1`] = `
".twic-zoom-1 {
    --twic-zoom: 1
}"
`;
