{
  "pluginsConfig": {
    "@nx/js": {
      "analyzeSourceFiles": true
    }
  },
  "extends": "nx/presets/npm.json",
  "$schema": "./node_modules/nx/schemas/nx-schema.json",
  "targetDefaults": {
    "build": {
      "cache": true
    },
    "@nx/jest:jest": {
      "inputs": ["default", "^default", "{workspaceRoot}/jest.preset.js"],
      "cache": true,
      "options": {
        "passWithNoTests": true
      },
      "configurations": {
        "ci": {
          "ci": true,
          "codeCoverage": true,
          "coverageReporters": ["text", "cobertura"],
          "reporters": ["jest-junit"]
        }
      }
    },
    "@nx/eslint:lint": {
      "inputs": [
        "default",
        "{workspaceRoot}/.eslintrc.json",
        "{workspaceRoot}/.eslintignore",
        "{workspaceRoot}/eslint.config.js"
      ],
      "cache": true
    }
  },
  "neverConnectToCloud": true,
  "useInferencePlugins": false,
  "useLegacyCache": true
}
