// Jest Snapshot v1, https://goo.gl/fbAQLP

exports[`transitionDelayUtilities should work with custom values 1`] = `
".twic-delay-2 {
    --twic-transition-delay: 2ms
}"
`;

exports[`transitionDelayUtilities should work with predefined tailwind transitionDelay values 1`] = `
".twic-delay-0 {
    --twic-transition-delay: 0s
}
.twic-delay-75 {
    --twic-transition-delay: 75ms
}
.twic-delay-150 {
    --twic-transition-delay: 150ms
}
.twic-delay-300 {
    --twic-transition-delay: 300ms
}
.twic-delay-500 {
    --twic-transition-delay: 500ms
}
.twic-delay-700 {
    --twic-transition-delay: 700ms
}
.twic-delay-1000 {
    --twic-transition-delay: 1000ms
}"
`;
