\select@language {english}
\contentsline {chapter}{\numberline {1}useful \#1 -- auto members}{3}{chapter.1}
\contentsline {chapter}{\numberline {2}useful \#2 -- explicit members}{5}{chapter.2}
\contentsline {chapter}{\numberline {3}Indices and tables}{7}{chapter.3}
\contentsline {chapter}{Python Module Index}{9}{section*.16}
\contentsline {chapter}{Index}{11}{section*.17}
