0.100000 0.100000
0.400000 0.700000
1.200000 0.600000
1.800000 1.100000
2.000000 0.900000

-0.500000 -1.343172
-0.490000 -1.319119
-0.480000 -1.295066
-0.470000 -1.271013
-0.460000 -1.246960
-0.450000 -1.222907
-0.440000 -1.198854
-0.430000 -1.174802
-0.420000 -1.150749
-0.410000 -1.126696
-0.400000 -1.102643
-0.390000 -1.078590
-0.380000 -1.054537
-0.370000 -1.030484
-0.360000 -1.006432
-0.350000 -0.982379
-0.340000 -0.958326
-0.330000 -0.934273
-0.320000 -0.910220
-0.310000 -0.886167
-0.300000 -0.862114
-0.290000 -0.838062
-0.280000 -0.814009
-0.270000 -0.789956
-0.260000 -0.765903
-0.250000 -0.741850
-0.240000 -0.717797
-0.230000 -0.693744
-0.220000 -0.669692
-0.210000 -0.645639
-0.200000 -0.621586
-0.190000 -0.597533
-0.180000 -0.573480
-0.170000 -0.549427
-0.160000 -0.525374
-0.150000 -0.501322
-0.140000 -0.477269
-0.130000 -0.453216
-0.120000 -0.429163
-0.110000 -0.405110
-0.100000 -0.381057
-0.090000 -0.357004
-0.080000 -0.332951
-0.070000 -0.308899
-0.060000 -0.284846
-0.050000 -0.260793
-0.040000 -0.236740
-0.030000 -0.212687
-0.020000 -0.188634
-0.010000 -0.164581
0.000000 -0.140529
0.010000 -0.116476
0.020000 -0.092423
0.030000 -0.068370
0.040000 -0.044317
0.050000 -0.020264
0.060000 0.003789
0.070000 0.027841
0.080000 0.051894
0.090000 0.075947
0.100000 0.100000
0.110000 0.124048
0.120000 0.148070
0.130000 0.172037
0.140000 0.195923
0.150000 0.219701
0.160000 0.243344
0.170000 0.266825
0.180000 0.290117
0.190000 0.313193
0.200000 0.336025
0.210000 0.358588
0.220000 0.380853
0.230000 0.402794
0.240000 0.424383
0.250000 0.445595
0.260000 0.466401
0.270000 0.486775
0.280000 0.506689
0.290000 0.526117
0.300000 0.545032
0.310000 0.563406
0.320000 0.581213
0.330000 0.598426
0.340000 0.615017
0.350000 0.630959
0.360000 0.646227
0.370000 0.660791
0.380000 0.674626
0.390000 0.687705
0.400000 0.700000
0.410000 0.711492
0.420000 0.722192
0.430000 0.732117
0.440000 0.741285
0.450000 0.749716
0.460000 0.757426
0.470000 0.764434
0.480000 0.770758
0.490000 0.776416
0.500000 0.781426
0.510000 0.785807
0.520000 0.789575
0.530000 0.792750
0.540000 0.795350
0.550000 0.797391
0.560000 0.798894
0.570000 0.799874
0.580000 0.800352
0.590000 0.800344
0.600000 0.799869
0.610000 0.798945
0.620000 0.797590
0.630000 0.795823
0.640000 0.793660
0.650000 0.791120
0.660000 0.788222
0.670000 0.784983
0.680000 0.781421
0.690000 0.777555
0.700000 0.773403
0.710000 0.768982
0.720000 0.764310
0.730000 0.759407
0.740000 0.754290
0.750000 0.748976
0.760000 0.743484
0.770000 0.737833
0.780000 0.732039
0.790000 0.726122
0.800000 0.720100
0.810000 0.713989
0.820000 0.707809
0.830000 0.701578
0.840000 0.695313
0.850000 0.689032
0.860000 0.682755
0.870000 0.676498
0.880000 0.670281
0.890000 0.664120
0.900000 0.658034
0.910000 0.652041
0.920000 0.646160
0.930000 0.640408
0.940000 0.634803
0.950000 0.629363
0.960000 0.624107
0.970000 0.619053
0.980000 0.614218
0.990000 0.609621
1.000000 0.605280
1.010000 0.601212
1.020000 0.597437
1.030000 0.593971
1.040000 0.590834
1.050000 0.588043
1.060000 0.585615
1.070000 0.583571
1.080000 0.581926
1.090000 0.580700
1.100000 0.579911
1.110000 0.579576
1.120000 0.579713
1.130000 0.580342
1.140000 0.581479
1.150000 0.583143
1.160000 0.585352
1.170000 0.588125
1.180000 0.591478
1.190000 0.595430
1.200000 0.600000
1.210000 0.605198
1.220000 0.611005
1.230000 0.617395
1.240000 0.624342
1.250000 0.631821
1.260000 0.639805
1.270000 0.648268
1.280000 0.657185
1.290000 0.666528
1.300000 0.676273
1.310000 0.686393
1.320000 0.696862
1.330000 0.707654
1.340000 0.718743
1.350000 0.730104
1.360000 0.741709
1.370000 0.753534
1.380000 0.765551
1.390000 0.777735
1.400000 0.790061
1.410000 0.802501
1.420000 0.815031
1.430000 0.827623
1.440000 0.840252
1.450000 0.852892
1.460000 0.865517
1.470000 0.878101
1.480000 0.890617
1.490000 0.903041
1.500000 0.915345
1.510000 0.927504
1.520000 0.939492
1.530000 0.951283
1.540000 0.962850
1.550000 0.974168
1.560000 0.985211
1.570000 0.995952
1.580000 1.006366
1.590000 1.016427
1.600000 1.026108
1.610000 1.035384
1.620000 1.044229
1.630000 1.052616
1.640000 1.060520
1.650000 1.067914
1.660000 1.074773
1.670000 1.081070
1.680000 1.086780
1.690000 1.091876
1.700000 1.096333
1.710000 1.100124
1.720000 1.103223
1.730000 1.105605
1.740000 1.107243
1.750000 1.108112
1.760000 1.108185
1.770000 1.107436
1.780000 1.105840
1.790000 1.103370
1.800000 1.100000
1.810000 1.095716
1.820000 1.090554
1.830000 1.084557
1.840000 1.077774
1.850000 1.070251
1.860000 1.062033
1.870000 1.053167
1.880000 1.043699
1.890000 1.033676
1.900000 1.023144
1.910000 1.012148
1.920000 1.000737
1.930000 0.988955
1.940000 0.976849
1.950000 0.964465
1.960000 0.951850
1.970000 0.939049
1.980000 0.926110
1.990000 0.913078
2.000000 0.900000
2.010000 0.886914
2.020000 0.873828
2.030000 0.860743
2.040000 0.847657
2.050000 0.834571
2.060000 0.821485
2.070000 0.808399
2.080000 0.795313
2.090000 0.782228
2.100000 0.769142
2.110000 0.756056
2.120000 0.742970
2.130000 0.729884
2.140000 0.716799
2.150000 0.703713
2.160000 0.690627
2.170000 0.677541
2.180000 0.664455
2.190000 0.651369
2.200000 0.638284
2.210000 0.625198
2.220000 0.612112
2.230000 0.599026
2.240000 0.585940
2.250000 0.572854
2.260000 0.559769
2.270000 0.546683
2.280000 0.533597
2.290000 0.520511
2.300000 0.507425
2.310000 0.494340
2.320000 0.481254
2.330000 0.468168
2.340000 0.455082
2.350000 0.441996
2.360000 0.428910
2.370000 0.415825
2.380000 0.402739
2.390000 0.389653
2.400000 0.376567
2.410000 0.363481
2.420000 0.350396
2.430000 0.337310
2.440000 0.324224
2.450000 0.311138
2.460000 0.298052
2.470000 0.284966
2.480000 0.271881
2.490000 0.258795

