{
  "books" : [ {
    "id" : 0,
    "ns" : "someText",
    "author" : "Marco Polo",
    "title" : "Everyday Italian",
    "price" : 50,
    "year" : 2005
  }, {
    "id" : 1,
    "ns" : "someText",
    "author" : "Leo Tolstoy",
    "title" : "War And Peace",
    "price" : 10500,
    "year" : 1863
  }, {
    "id" : 2,
    "ns" : "someText",
    "author" : "Автор 123",
    "title" : "Java for Beginner",
    "price" : 123,
    "year" : 2005
  } ]
}