[api-updater (non-obsolete-error-filter)] 3/21/2023 7:01:36 PM : Starting /Applications/Unity/Hub/Editor/2020.3.22f1/Unity.app/Contents/Tools/ScriptUpdater/APIUpdater.NonObsoleteApiUpdaterDetector.exe
[api-updater (non-obsolete-error-filter)] 
----------------------------------
jit/startup time      : 102.285ms
moved types parse time: 41ms
candidates parse time : 1ms
C# parse time         : 193ms
candidates check time : 28ms
console write time    : 0ms

[api-updater (non-obsolete-error-filter)] 3/21/2023 7:01:50 PM : Starting /Applications/Unity/Hub/Editor/2020.3.22f1/Unity.app/Contents/Tools/ScriptUpdater/APIUpdater.NonObsoleteApiUpdaterDetector.exe
[api-updater (non-obsolete-error-filter)] 
----------------------------------
jit/startup time      : 36.892ms
moved types parse time: 34ms
candidates parse time : 1ms
C# parse time         : 150ms
candidates check time : 27ms
console write time    : 0ms

[api-updater (non-obsolete-error-filter)] 3/21/2023 7:01:59 PM : Starting /Applications/Unity/Hub/Editor/2020.3.22f1/Unity.app/Contents/Tools/ScriptUpdater/APIUpdater.NonObsoleteApiUpdaterDetector.exe
[api-updater (non-obsolete-error-filter)] 
----------------------------------
jit/startup time      : 39.026ms
moved types parse time: 34ms
candidates parse time : 1ms
C# parse time         : 159ms
candidates check time : 30ms
console write time    : 0ms

[api-updater (non-obsolete-error-filter)] 3/21/2023 7:02:26 PM : Starting /Applications/Unity/Hub/Editor/2020.3.22f1/Unity.app/Contents/Tools/ScriptUpdater/APIUpdater.NonObsoleteApiUpdaterDetector.exe
[api-updater (non-obsolete-error-filter)] 
----------------------------------
jit/startup time      : 38.471ms
moved types parse time: 34ms
candidates parse time : 1ms
C# parse time         : 149ms
candidates check time : 24ms
console write time    : 0ms

[api-updater (non-obsolete-error-filter)] 3/21/2023 7:02:33 PM : Starting /Applications/Unity/Hub/Editor/2020.3.22f1/Unity.app/Contents/Tools/ScriptUpdater/APIUpdater.NonObsoleteApiUpdaterDetector.exe
[api-updater (non-obsolete-error-filter)] 
----------------------------------
jit/startup time      : 37.477ms
moved types parse time: 34ms
candidates parse time : 1ms
C# parse time         : 149ms
candidates check time : 24ms
console write time    : 0ms

[api-updater (non-obsolete-error-filter)] 3/21/2023 7:14:24 PM : Starting /Applications/Unity/Hub/Editor/2020.3.22f1/Unity.app/Contents/Tools/ScriptUpdater/APIUpdater.NonObsoleteApiUpdaterDetector.exe
[api-updater (non-obsolete-error-filter)] 
----------------------------------
jit/startup time      : 83.07ms
moved types parse time: 39ms
candidates parse time : 1ms
C# parse time         : 154ms
candidates check time : 20ms
console write time    : 0ms

[api-updater (non-obsolete-error-filter)] 3/21/2023 7:14:38 PM : Starting /Applications/Unity/Hub/Editor/2020.3.22f1/Unity.app/Contents/Tools/ScriptUpdater/APIUpdater.NonObsoleteApiUpdaterDetector.exe
[api-updater (non-obsolete-error-filter)] 
----------------------------------
jit/startup time      : 41.066ms
moved types parse time: 36ms
candidates parse time : 1ms
C# parse time         : 139ms
candidates check time : 20ms
console write time    : 0ms

[api-updater (non-obsolete-error-filter)] 3/21/2023 7:14:45 PM : Starting /Applications/Unity/Hub/Editor/2020.3.22f1/Unity.app/Contents/Tools/ScriptUpdater/APIUpdater.NonObsoleteApiUpdaterDetector.exe
[api-updater (non-obsolete-error-filter)] 
----------------------------------
jit/startup time      : 37.975ms
moved types parse time: 34ms
candidates parse time : 1ms
C# parse time         : 134ms
candidates check time : 20ms
console write time    : 0ms

[api-updater (non-obsolete-error-filter)] 3/21/2023 7:20:43 PM : Starting /Applications/Unity/Hub/Editor/2020.3.22f1/Unity.app/Contents/Tools/ScriptUpdater/APIUpdater.NonObsoleteApiUpdaterDetector.exe
[api-updater (non-obsolete-error-filter)] 
----------------------------------
jit/startup time      : 204.233ms
moved types parse time: 41ms
candidates parse time : 1ms
C# parse time         : 211ms
candidates check time : 27ms
console write time    : 0ms

[api-updater (non-obsolete-error-filter)] 3/21/2023 7:34:14 PM : Starting /Applications/Unity/Hub/Editor/2020.3.22f1/Unity.app/Contents/Tools/ScriptUpdater/APIUpdater.NonObsoleteApiUpdaterDetector.exe
[api-updater (non-obsolete-error-filter)] 
----------------------------------
jit/startup time      : 81.125ms
moved types parse time: 40ms
candidates parse time : 1ms
C# parse time         : 170ms
candidates check time : 30ms
console write time    : 0ms

[api-updater (non-obsolete-error-filter)] 3/21/2023 7:55:19 PM : Starting /Applications/Unity/Hub/Editor/2020.3.22f1/Unity.app/Contents/Tools/ScriptUpdater/APIUpdater.NonObsoleteApiUpdaterDetector.exe
[api-updater (non-obsolete-error-filter)] 
----------------------------------
jit/startup time      : 85.175ms
moved types parse time: 37ms
candidates parse time : 1ms
C# parse time         : 167ms
candidates check time : 19ms
console write time    : 0ms

[api-updater (non-obsolete-error-filter)] 3/21/2023 7:55:57 PM : Starting /Applications/Unity/Hub/Editor/2020.3.22f1/Unity.app/Contents/Tools/ScriptUpdater/APIUpdater.NonObsoleteApiUpdaterDetector.exe
[api-updater (non-obsolete-error-filter)] 
----------------------------------
jit/startup time      : 38.733ms
moved types parse time: 34ms
candidates parse time : 1ms
C# parse time         : 135ms
candidates check time : 19ms
console write time    : 0ms

[api-updater (non-obsolete-error-filter)] 3/21/2023 7:56:38 PM : Starting /Applications/Unity/Hub/Editor/2020.3.22f1/Unity.app/Contents/Tools/ScriptUpdater/APIUpdater.NonObsoleteApiUpdaterDetector.exe
[api-updater (non-obsolete-error-filter)] 
----------------------------------
jit/startup time      : 38.349ms
moved types parse time: 34ms
candidates parse time : 1ms
C# parse time         : 153ms
candidates check time : 25ms
console write time    : 0ms

[api-updater (non-obsolete-error-filter)] 3/21/2023 7:56:44 PM : Starting /Applications/Unity/Hub/Editor/2020.3.22f1/Unity.app/Contents/Tools/ScriptUpdater/APIUpdater.NonObsoleteApiUpdaterDetector.exe
[api-updater (non-obsolete-error-filter)] 
----------------------------------
jit/startup time      : 37.866ms
moved types parse time: 35ms
candidates parse time : 1ms
C# parse time         : 150ms
candidates check time : 25ms
console write time    : 0ms

[api-updater (non-obsolete-error-filter)] 3/21/2023 7:56:47 PM : Starting /Applications/Unity/Hub/Editor/2020.3.22f1/Unity.app/Contents/Tools/ScriptUpdater/APIUpdater.NonObsoleteApiUpdaterDetector.exe
[api-updater (non-obsolete-error-filter)] 
----------------------------------
jit/startup time      : 38.278ms
moved types parse time: 35ms
candidates parse time : 1ms
C# parse time         : 148ms
candidates check time : 25ms
console write time    : 0ms

[api-updater (non-obsolete-error-filter)] 3/21/2023 7:58:18 PM : Starting /Applications/Unity/Hub/Editor/2020.3.22f1/Unity.app/Contents/Tools/ScriptUpdater/APIUpdater.NonObsoleteApiUpdaterDetector.exe
[api-updater (non-obsolete-error-filter)] 
----------------------------------
jit/startup time      : 41.55ms
moved types parse time: 34ms
candidates parse time : 1ms
C# parse time         : 143ms
candidates check time : 22ms
console write time    : 0ms

[api-updater (non-obsolete-error-filter)] 3/21/2023 7:59:31 PM : Starting /Applications/Unity/Hub/Editor/2020.3.22f1/Unity.app/Contents/Tools/ScriptUpdater/APIUpdater.NonObsoleteApiUpdaterDetector.exe
[api-updater (non-obsolete-error-filter)] 
----------------------------------
jit/startup time      : 39.141ms
moved types parse time: 34ms
candidates parse time : 1ms
C# parse time         : 140ms
candidates check time : 22ms
console write time    : 0ms

[api-updater (non-obsolete-error-filter)] 3/21/2023 7:59:44 PM : Starting /Applications/Unity/Hub/Editor/2020.3.22f1/Unity.app/Contents/Tools/ScriptUpdater/APIUpdater.NonObsoleteApiUpdaterDetector.exe
[api-updater (non-obsolete-error-filter)] 
----------------------------------
jit/startup time      : 39.389ms
moved types parse time: 36ms
candidates parse time : 1ms
C# parse time         : 141ms
candidates check time : 22ms
console write time    : 0ms

[api-updater (non-obsolete-error-filter)] 3/21/2023 7:59:48 PM : Starting /Applications/Unity/Hub/Editor/2020.3.22f1/Unity.app/Contents/Tools/ScriptUpdater/APIUpdater.NonObsoleteApiUpdaterDetector.exe
[api-updater (non-obsolete-error-filter)] 
----------------------------------
jit/startup time      : 39.019ms
moved types parse time: 35ms
candidates parse time : 1ms
C# parse time         : 151ms
candidates check time : 24ms
console write time    : 0ms

[api-updater (non-obsolete-error-filter)] 3/21/2023 7:59:49 PM : Starting /Applications/Unity/Hub/Editor/2020.3.22f1/Unity.app/Contents/Tools/ScriptUpdater/APIUpdater.NonObsoleteApiUpdaterDetector.exe
[api-updater (non-obsolete-error-filter)] 
----------------------------------
jit/startup time      : 40.08ms
moved types parse time: 34ms
candidates parse time : 1ms
C# parse time         : 144ms
candidates check time : 22ms
console write time    : 0ms

[api-updater (non-obsolete-error-filter)] 3/21/2023 7:59:58 PM : Starting /Applications/Unity/Hub/Editor/2020.3.22f1/Unity.app/Contents/Tools/ScriptUpdater/APIUpdater.NonObsoleteApiUpdaterDetector.exe
[api-updater (non-obsolete-error-filter)] 
----------------------------------
jit/startup time      : 40.368ms
moved types parse time: 34ms
candidates parse time : 1ms
C# parse time         : 150ms
candidates check time : 26ms
console write time    : 0ms

[api-updater (non-obsolete-error-filter)] 3/21/2023 8:00:01 PM : Starting /Applications/Unity/Hub/Editor/2020.3.22f1/Unity.app/Contents/Tools/ScriptUpdater/APIUpdater.NonObsoleteApiUpdaterDetector.exe
[api-updater (non-obsolete-error-filter)] 
----------------------------------
jit/startup time      : 42.471ms
moved types parse time: 34ms
candidates parse time : 1ms
C# parse time         : 152ms
candidates check time : 26ms
console write time    : 0ms

[api-updater (non-obsolete-error-filter)] 3/22/2023 11:02:41 AM : Starting /Applications/Unity/Hub/Editor/2020.3.22f1/Unity.app/Contents/Tools/ScriptUpdater/APIUpdater.NonObsoleteApiUpdaterDetector.exe
[api-updater (non-obsolete-error-filter)] 
----------------------------------
jit/startup time      : 195.35ms
moved types parse time: 39ms
candidates parse time : 1ms
C# parse time         : 183ms
candidates check time : 22ms
console write time    : 0ms

[api-updater (non-obsolete-error-filter)] 3/22/2023 11:16:52 AM : Starting /Applications/Unity/Hub/Editor/2020.3.22f1/Unity.app/Contents/Tools/ScriptUpdater/APIUpdater.NonObsoleteApiUpdaterDetector.exe
[api-updater (non-obsolete-error-filter)] 
----------------------------------
jit/startup time      : 102.934ms
moved types parse time: 41ms
candidates parse time : 1ms
C# parse time         : 207ms
candidates check time : 36ms
console write time    : 0ms

[api-updater (non-obsolete-error-filter)] 3/22/2023 11:17:10 AM : Starting /Applications/Unity/Hub/Editor/2020.3.22f1/Unity.app/Contents/Tools/ScriptUpdater/APIUpdater.NonObsoleteApiUpdaterDetector.exe
[api-updater (non-obsolete-error-filter)] 
----------------------------------
jit/startup time      : 39.476ms
moved types parse time: 34ms
candidates parse time : 1ms
C# parse time         : 155ms
candidates check time : 35ms
console write time    : 0ms

[api-updater (non-obsolete-error-filter)] 3/22/2023 11:17:22 AM : Starting /Applications/Unity/Hub/Editor/2020.3.22f1/Unity.app/Contents/Tools/ScriptUpdater/APIUpdater.NonObsoleteApiUpdaterDetector.exe
[api-updater (non-obsolete-error-filter)] 
----------------------------------
jit/startup time      : 41.455ms
moved types parse time: 34ms
candidates parse time : 1ms
C# parse time         : 157ms
candidates check time : 35ms
console write time    : 0ms

[api-updater (non-obsolete-error-filter)] 3/22/2023 11:17:33 AM : Starting /Applications/Unity/Hub/Editor/2020.3.22f1/Unity.app/Contents/Tools/ScriptUpdater/APIUpdater.NonObsoleteApiUpdaterDetector.exe
[api-updater (non-obsolete-error-filter)] 
----------------------------------
jit/startup time      : 38.986ms
moved types parse time: 34ms
candidates parse time : 1ms
C# parse time         : 152ms
candidates check time : 36ms
console write time    : 0ms

[api-updater (non-obsolete-error-filter)] 3/22/2023 11:17:34 AM : Starting /Applications/Unity/Hub/Editor/2020.3.22f1/Unity.app/Contents/Tools/ScriptUpdater/APIUpdater.NonObsoleteApiUpdaterDetector.exe
[api-updater (non-obsolete-error-filter)] 
----------------------------------
jit/startup time      : 40.498ms
moved types parse time: 33ms
candidates parse time : 1ms
C# parse time         : 148ms
candidates check time : 28ms
console write time    : 0ms

[api-updater (non-obsolete-error-filter)] 3/22/2023 11:17:43 AM : Starting /Applications/Unity/Hub/Editor/2020.3.22f1/Unity.app/Contents/Tools/ScriptUpdater/APIUpdater.NonObsoleteApiUpdaterDetector.exe
[api-updater (non-obsolete-error-filter)] 
----------------------------------
jit/startup time      : 39.183ms
moved types parse time: 34ms
candidates parse time : 1ms
C# parse time         : 154ms
candidates check time : 30ms
console write time    : 0ms

[api-updater (non-obsolete-error-filter)] 3/22/2023 12:13:47 PM : Starting /Applications/Unity/Hub/Editor/2020.3.22f1/Unity.app/Contents/Tools/ScriptUpdater/APIUpdater.NonObsoleteApiUpdaterDetector.exe
[api-updater (non-obsolete-error-filter)] 
----------------------------------
jit/startup time      : 99.141ms
moved types parse time: 39ms
candidates parse time : 1ms
C# parse time         : 208ms
candidates check time : 44ms
console write time    : 0ms

[api-updater (non-obsolete-error-filter)] 3/22/2023 12:46:55 PM : Starting /Applications/Unity/Hub/Editor/2020.3.22f1/Unity.app/Contents/Tools/ScriptUpdater/APIUpdater.NonObsoleteApiUpdaterDetector.exe
[api-updater (non-obsolete-error-filter)] 
----------------------------------
jit/startup time      : 99.285ms
moved types parse time: 43ms
candidates parse time : 1ms
C# parse time         : 208ms
candidates check time : 34ms
console write time    : 0ms

[api-updater (non-obsolete-error-filter)] 3/22/2023 12:47:04 PM : Starting /Applications/Unity/Hub/Editor/2020.3.22f1/Unity.app/Contents/Tools/ScriptUpdater/APIUpdater.NonObsoleteApiUpdaterDetector.exe
[api-updater (non-obsolete-error-filter)] 
----------------------------------
jit/startup time      : 37.442ms
moved types parse time: 35ms
candidates parse time : 1ms
C# parse time         : 154ms
candidates check time : 29ms
console write time    : 0ms

[api-updater (non-obsolete-error-filter)] 3/22/2023 1:15:27 PM : Starting /Applications/Unity/Hub/Editor/2020.3.22f1/Unity.app/Contents/Tools/ScriptUpdater/APIUpdater.NonObsoleteApiUpdaterDetector.exe
[api-updater (non-obsolete-error-filter)] 
----------------------------------
jit/startup time      : 87.526ms
moved types parse time: 40ms
candidates parse time : 1ms
C# parse time         : 183ms
candidates check time : 29ms
console write time    : 0ms

[api-updater (non-obsolete-error-filter)] 3/22/2023 3:00:20 PM : Starting /Applications/Unity/Hub/Editor/2020.3.22f1/Unity.app/Contents/Tools/ScriptUpdater/APIUpdater.NonObsoleteApiUpdaterDetector.exe
[api-updater (non-obsolete-error-filter)] 
----------------------------------
jit/startup time      : 247.799ms
moved types parse time: 42ms
candidates parse time : 1ms
C# parse time         : 236ms
candidates check time : 33ms
console write time    : 0ms

[api-updater (non-obsolete-error-filter)] 3/22/2023 3:58:51 PM : Starting /Applications/Unity/Hub/Editor/2020.3.22f1/Unity.app/Contents/Tools/ScriptUpdater/APIUpdater.NonObsoleteApiUpdaterDetector.exe
[api-updater (non-obsolete-error-filter)] 
----------------------------------
jit/startup time      : 89.491ms
moved types parse time: 38ms
candidates parse time : 1ms
C# parse time         : 194ms
candidates check time : 29ms
console write time    : 0ms

[api-updater (non-obsolete-error-filter)] 3/22/2023 4:02:20 PM : Starting /Applications/Unity/Hub/Editor/2020.3.22f1/Unity.app/Contents/Tools/ScriptUpdater/APIUpdater.NonObsoleteApiUpdaterDetector.exe
[api-updater (non-obsolete-error-filter)] 
----------------------------------
jit/startup time      : 49.608ms
moved types parse time: 40ms
candidates parse time : 2ms
C# parse time         : 173ms
candidates check time : 32ms
console write time    : 0ms

[api-updater (non-obsolete-error-filter)] 3/22/2023 4:02:53 PM : Starting /Applications/Unity/Hub/Editor/2020.3.22f1/Unity.app/Contents/Tools/ScriptUpdater/APIUpdater.NonObsoleteApiUpdaterDetector.exe
[api-updater (non-obsolete-error-filter)] 
----------------------------------
jit/startup time      : 38.996ms
moved types parse time: 34ms
candidates parse time : 1ms
C# parse time         : 166ms
candidates check time : 33ms
console write time    : 0ms

[api-updater (non-obsolete-error-filter)] 3/22/2023 4:04:17 PM : Starting /Applications/Unity/Hub/Editor/2020.3.22f1/Unity.app/Contents/Tools/ScriptUpdater/APIUpdater.NonObsoleteApiUpdaterDetector.exe
[api-updater (non-obsolete-error-filter)] 
----------------------------------
jit/startup time      : 38.981ms
moved types parse time: 34ms
candidates parse time : 1ms
C# parse time         : 167ms
candidates check time : 32ms
console write time    : 0ms

[api-updater (non-obsolete-error-filter)] 3/22/2023 4:04:30 PM : Starting /Applications/Unity/Hub/Editor/2020.3.22f1/Unity.app/Contents/Tools/ScriptUpdater/APIUpdater.NonObsoleteApiUpdaterDetector.exe
[api-updater (non-obsolete-error-filter)] 
----------------------------------
jit/startup time      : 39.325ms
moved types parse time: 34ms
candidates parse time : 1ms
C# parse time         : 166ms
candidates check time : 32ms
console write time    : 0ms

[api-updater (non-obsolete-error-filter)] 3/22/2023 4:04:54 PM : Starting /Applications/Unity/Hub/Editor/2020.3.22f1/Unity.app/Contents/Tools/ScriptUpdater/APIUpdater.NonObsoleteApiUpdaterDetector.exe
[api-updater (non-obsolete-error-filter)] 
----------------------------------
jit/startup time      : 39ms
moved types parse time: 36ms
candidates parse time : 1ms
C# parse time         : 168ms
candidates check time : 31ms
console write time    : 0ms

