{
    "name": "Tariff customer match",
    "country-code": "UK",
    "description": "Customer match data to determine count of dual fuel and multi-fuel customers",
    "type": "facts",
    "version": "1.0.2",
    "sample_size" : 15300,
    "no_of_columns" : 10,
    "row_id_column" : "Unique customer identifier",
    "supplier" : "",

    "formats" : ["%d-%m-%Y"],
    "columns": [
        {
            "name": "date",
            "to": "date",
            "type_to": "date",
            "type": "string",
            "nullable": false,
            "optional": false,
            "format": "",
            "pii": "nc",
            "enum": [],
            "description": "Snapshot date of when the data applies - this should be the first day of the new cap charge period."
        },
        {
            "name": "gas_tariff_uid_1",
            "to": "gas_tariff_uid_1",
            "type_to": "alphanum",
            "type": "string",
            "nullable": true,
            "optional": false,
            "format": "",
            "pii": "nc",
            "enum": [],
            "description": "A code created by the supplier to uniquely identify the tariff."
        },
        {
            "name": "gas_tariff_uid_2",
            "to": "gas_tariff_uid_2",
            "type_to": "alphanum",
            "type": "string",
            "nullable": true,
            "optional": false,
            "format": "",
            "pii": "nc",
            "enum": [],
            "description": "A code created by the supplier to uniquely identify the tariff."
        },
        {
            "name": "gas_tariff_uid_3",
            "to": "gas_tariff_uid_3",
            "type_to": "alphanum",
            "type": "string",
            "nullable": true,
            "optional": false,
            "format": "",
            "pii": "nc",
            "enum": [],
            "description": "A code created by the supplier to uniquely identify the tariff."
        },
        {
            "name": "gas_tariff_uid_4",
            "to": "gas_tariff_uid_4",
            "type_to": "alphanum",
            "type": "string",
            "nullable": true,
            "optional": false,
            "format": "",
            "pii": "nc",
            "enum": [],
            "description": "A code created by the supplier to uniquely identify the tariff."
        },
        {
            "name": "gas_tariff_uid_5",
            "to": "gas_tariff_uid_5",
            "type_to": "alphanum",
            "type": "string",
            "nullable": true,
            "optional": false,
            "format": "",
            "pii": "nc",
            "enum": [],
            "description": "A code created by the supplier to uniquely identify the tariff."
        },
        {
            "name": "electricity_tariff_uid_1",
            "to": "electricity_tariff_uid_1",
            "type_to": "alphanum",
            "type": "string",
            "nullable": true,
            "optional": false,
            "format": "",
            "pii": "nc",
            "enum": [],
            "description": "A code created by the supplier to uniquely identify the tariff."
        },
        {
            "name": "electricity_tariff_uid_2",
            "to": "electricity_tariff_uid_2",
            "type_to": "alphanum",
            "type": "string",
            "nullable": true,
            "optional": false,
            "format": "",
            "pii": "nc",
            "enum": [],
            "description": "A code created by the supplier to uniquely identify the tariff."
        },
        {
            "name": "electricity_tariff_uid_3",
            "to": "electricity_tariff_uid_3",
            "type_to": "alphanum",
            "type": "string",
            "nullable": true,
            "optional": false,
            "format": "",
            "pii": "nc",
            "enum": [],
            "description": "A code created by the supplier to uniquely identify the tariff."
        },
        {
            "name": "electricity_tariff_uid_4",
            "to": "electricity_tariff_uid_4",
            "type_to": "alphanum",
            "type": "string",
            "nullable": true,
            "optional": false,
            "format": "",
            "pii": "nc",
            "enum": [],
            "description": "A code created by the supplier to uniquely identify the tariff."
        },
        {
            "name": "electricity_tariff_uid_5",
            "to": "electricity_tariff_uid_5",
            "type_to": "alphanum",
            "type": "string",
            "nullable": true,
            "optional": false,
            "format": "",
            "pii": "nc",
            "enum": [],
            "description": "A code created by the supplier to uniquely identify the tariff."
        },
        {
            "name": "region",
            "to": "region",
            "type_to": "string",
            "type": "string",
            "nullable": false,
            "optional": false,
            "format": "",
            "pii": "nc",
            "enum": ["east_england", "east_midlands", "london", "merseyside_and_north_wales", "midlands", "north_east", "north_scotland", "north_west", "south_east", "south_scotland", "south_wales", "south_west", "southern", "yorkshire"],
            "description": "For both electricity and gas, this is the region in which the tariff is offered."
        },
        {
            "name": "payment_method_gas_1",
            "to": "payment_method_gas_1",
            "type_to": "string",
            "type": "string",
            "nullable": true,
            "optional": false,
            "default-value": "NULL",
            "format": "",
            "pii": "nc",
            "enum": ["D", "S", "P", "X", "O", ""],
            "description": "The required payment method for this tariff."
        },
        {
            "name": "payment_method_gas_2",
            "to": "payment_method_gas_2",
            "type_to": "string",
            "type": "string",
            "nullable": true,
            "optional": false,
            "default-value": "NULL",
            "format": "",
            "pii": "nc",
            "enum": ["D", "S", "P", "X", "O", ""],
            "description": "The required payment method for this tariff."
        },
        {
            "name": "payment_method_gas_3",
            "to": "payment_method_gas_3",
            "type_to": "string",
            "type": "string",
            "nullable": true,
            "optional": false,
            "default-value": "NULL",
            "format": "",
            "pii": "nc",
            "enum": ["D", "S", "P", "X", "O", ""],
            "description": "The required payment method for this tariff."
        },
        {
            "name": "payment_method_gas_4",
            "to": "payment_method_gas_4",
            "type_to": "string",
            "type": "string",
            "nullable": true,
            "optional": false,
            "default-value": "NULL",
            "format": "",
            "pii": "nc",
            "enum": ["D", "S", "P", "X", "O", ""],
            "description": "The required payment method for this tariff."
        },
        {
            "name": "payment_method_gas_5",
            "to": "payment_method_gas_5",
            "type_to": "string",
            "type": "string",
            "nullable": true,
            "optional": false,
            "default-value": "NULL",
            "format": "",
            "pii": "nc",
            "enum": ["D", "S", "P", "X", "O", ""],
            "description": "The required payment method for this tariff."
        },
        {
            "name": "payment_method_electricity_1",
            "to": "payment_method_electricity_1",
            "type_to": "string",
            "type": "string",
            "nullable": true,
            "optional": false,
            "default-value": "NULL",
            "format": "",
            "pii": "nc",
            "enum": ["D", "S", "P", "X", "O", ""],
            "description": "The required payment method for this tariff."
        },
        {
            "name": "payment_method_electricity_2",
            "to": "payment_method_electricity_2",
            "type_to": "string",
            "type": "string",
            "nullable": true,
            "optional": false,
            "default-value": "NULL",
            "format": "",
            "pii": "nc",
            "enum": ["D", "S", "P", "X", "O", ""],
            "description": "The required payment method for this tariff."
        },
        {
            "name": "payment_method_electricity_3",
            "to": "payment_method_electricity_3",
            "type_to": "string",
            "type": "string",
            "nullable": true,
            "optional": false,
            "default-value": "NULL",
            "format": "",
            "pii": "nc",
            "enum": ["D", "S", "P", "X", "O", ""],
            "description": "The required payment method for this tariff."
        },
        {
            "name": "payment_method_electricity_4",
            "to": "payment_method_electricity_4",
            "type_to": "string",
            "type": "string",
            "nullable": true,
            "optional": false,
            "default-value": "NULL",
            "format": "",
            "pii": "nc",
            "enum": ["D", "S", "P", "X", "O", ""],
            "description": "The required payment method for this tariff."
        },
        {
            "name": "payment_method_electricity_5",
            "to": "payment_method_electricity_5",
            "type_to": "string",
            "type": "string",
            "nullable": true,
            "optional": false,
            "default-value": "NULL",
            "format": "",
            "pii": "nc",
            "enum": ["D", "S", "P", "X", "O", ""],
            "description": "The required payment method for this tariff."
        },
        {
            "name": "default_3_years_gas_1",
            "to": "default_3_years_gas_1",
            "type_to": "string",
            "type": "string",
            "nullable": true,
            "optional": false,
            "default-value": "NULL",
            "format": "",
            "pii": "nc",
            "length": 1,
            "enum": [true, false, ""],
            "description": "Y and N will get converted to true and false after loading data file."
        },
        {
            "name": "default_3_years_gas_2",
            "to": "default_3_years_gas_2",
            "type_to": "string",
            "type": "string",
            "nullable": true,
            "optional": false,
            "default-value": "NULL",
            "format": "",
            "pii": "nc",
            "length": 1,
            "enum": [true, false, ""],
            "description": "Y and N will get converted to true and false after loading data file."
        },
        {
            "name": "default_3_years_gas_3",
            "to": "default_3_years_gas_3",
            "type_to": "string",
            "type": "string",
            "nullable": true,
            "optional": false,
            "default-value": "NULL",
            "format": "",
            "pii": "nc",
            "length": 1,
            "enum": [true, false, ""],
            "description": "Y and N will get converted to true and false after loading data file."
        },
        {
            "name": "default_3_years_gas_4",
            "to": "default_3_years_gas_4",
            "type_to": "string",
            "type": "string",
            "nullable": true,
            "optional": false,
            "default-value": "NULL",
            "format": "",
            "pii": "nc",
            "length": 1,
            "enum": [true, false, ""],
            "description": "Y and N will get converted to true and false after loading data file."
        },
        {
            "name": "default_3_years_gas_5",
            "to": "default_3_years_gas_5",
            "type_to": "string",
            "type": "string",
            "nullable": true,
            "optional": false,
            "default-value": "NULL",
            "format": "",
            "pii": "nc",
            "length": 1,
            "enum": [true, false, ""],
            "description": "Y and N will get converted to true and false after loading data file."
        },
        {
            "name": "default_3_years_electricity_1",
            "to": "default_3_years_electricity_1",
            "type_to": "string",
            "type": "string",
            "nullable": true,
            "optional": false,
            "default-value": "NULL",
            "format": "",
            "pii": "nc",
            "length": 1,
            "enum": [true, false, ""],
            "description": "Y and N will get converted to true and false after loading data file."
        },
        {
            "name": "default_3_years_electricity_2",
            "to": "default_3_years_electricity_2",
            "type_to": "string",
            "type": "string",
            "nullable": true,
            "optional": false,
            "default-value": "NULL",
            "format": "",
            "pii": "nc",
            "length": 1,
            "enum": [true, false, ""],
            "description": "Y and N will get converted to true and false after loading data file."
        },
        {
            "name": "default_3_years_electricity_3",
            "to": "default_3_years_electricity_3",
            "type_to": "string",
            "type": "string",
            "nullable": true,
            "optional": false,
            "default-value": "NULL",
            "format": "",
            "pii": "nc",
            "length": 1,
            "enum": [true, false, ""],
            "description": "Y and N will get converted to true and false after loading data file."
        },
        {
            "name": "default_3_years_electricity_4",
            "to": "default_3_years_electricity_4",
            "type_to": "string",
            "type": "string",
            "nullable": true,
            "optional": false,
            "default-value": "NULL",
            "format": "",
            "pii": "nc",
            "length": 1,
            "enum": [true, false, ""],
            "description": "Y and N will get converted to true and false after loading data file."
        },
        {
            "name": "default_3_years_electricity_5",
            "to": "default_3_years_electricity_5",
            "type_to": "string",
            "type": "string",
            "nullable": true,
            "optional": false,
            "default-value": "NULL",
            "format": "",
            "pii": "nc",
            "length": 1,
            "enum": [true, false, ""],
            "description": "Y and N will get converted to true and false after loading data file."
        }, 
        {
            "name": "number_accounts",
            "to": "number_accounts",
            "type_to": "double",
            "type": "string",
            "nullable": false,
            "optional": false,
            "format": "",
            "pii": "nc",
            "enum": [],
            "description": ""
        },
        {
            "name": "supplier_name",
            "to": "supplier_name",
            "type_to": "string",
            "type": "string",
            "nullable": false,
            "optional": false,
            "format": "",
            "pii": "nc",
            "enum": [],
            "description": "Hive dynamic partition column, must be the last column in the schema."
         }
    
  ],
  "conditional_validation": [
     {
      "name": "If gas_tariff_uid_1 is not blank/null - then payment_method_gas_1 must not be blank/null - and default_3_years_gas_1 must not be blank/null",
      "expressions": {
        "if": [{"column": "gas_tariff_uid_1", "value": "", "operator": "!=" }],
        "then": [{"column": "payment_method_gas_1", "value": "", "operator": "!="},
          {"column": "default_3_years_gas_1", "value": "", "operator": "!="} ]
      }
    },
     {
      "name": "If gas_tariff_uid_2 is not blank/null - then payment_method_gas_2 must not be blank/null - and default_3_years_gas_2 must not be blank/null",
      "expressions": {
        "if": [{"column": "gas_tariff_uid_2", "value": "", "operator": "!=" }],
        "then": [{"column": "payment_method_gas_2", "value": "", "operator": "!="},
          {"column": "default_3_years_gas_2", "value": "", "operator": "!="} ]
      }
    },
     {
      "name": "If gas_tariff_uid_3 is not blank/null - then payment_method_gas_3 must not be blank/null - and default_3_years_gas_3 must not be blank/null",
      "expressions": {
        "if": [{"column": "gas_tariff_uid_3", "value": "", "operator": "!=" }],
        "then": [{"column": "payment_method_gas_3", "value": "", "operator": "!="},
          {"column": "default_3_years_gas_3", "value": "", "operator": "!="} ]
      }
    },
      {
      "name": "If gas_tariff_uid_4 is not blank/null - then payment_method_gas_4 must not be blank/null - and default_3_years_gas_4 must not be blank/null",
      "expressions": {
        "if": [{"column": "gas_tariff_uid_4", "value": "", "operator": "!=" }],
        "then": [{"column": "payment_method_gas_4", "value": "", "operator": "!="},
          {"column": "default_3_years_gas_4", "value": "", "operator": "!="} ]
      }
    },
      {
      "name": "If gas_tariff_uid_5 is not blank/null - then payment_method_gas_5 must not be blank/null - and default_3_years_gas_5 must not be blank/null",
      "expressions": {
        "if": [{"column": "gas_tariff_uid_5", "value": "", "operator": "!=" }],
        "then": [{"column": "payment_method_gas_5", "value": "", "operator": "!="},
          {"column": "default_3_years_gas_5", "value": "", "operator": "!="} ]
      }
    },
    {
      "name": "If electricity_tariff_uid_1 is not blank/null - then payment_method_electricity_1 must not be blank/null - and default_3_years_electricity_1 must not be blank/null",
      "expressions": {
        "if": [{"column": "electricity_tariff_uid_1", "value": "", "operator": "!=" }],
        "then": [{"column": "payment_method_electricity_1", "value": "", "operator": "!="},
          {"column": "default_3_years_electricity_1", "value": "", "operator": "!="} ]
      }
    },
     {
      "name": "If electricity_tariff_uid_2 is not blank/null - then payment_method_electricity_2 must not be blank/null - and default_3_years_electricity_2 must not be blank/null",
      "expressions": {
        "if": [{"column": "electricity_tariff_uid_2", "value": "", "operator": "!=" }],
        "then": [{"column": "payment_method_electricity_2", "value": "", "operator": "!="},
          {"column": "default_3_years_electricity_2", "value": "", "operator": "!="} ]
      }
    },
     {
      "name": "If electricity_tariff_uid_3 is not blank/null - then payment_method_electricity_3 must not be blank/null - and default_3_years_electricity_3 must not be blank/null",
      "expressions": {
        "if": [{"column": "electricity_tariff_uid_3", "value": "", "operator": "!=" }],
        "then": [{"column": "payment_method_electricity_3", "value": "", "operator": "!="},
          {"column": "default_3_years_electricity_3", "value": "", "operator": "!="} ]
      }
    },
      {
      "name": "If electricity_tariff_uid_4 is not blank/null - then payment_method_electricity_4 must not be blank/null - and default_3_years_electricity_4 must not be blank/null",
      "expressions": {
        "if": [{"column": "electricity_tariff_uid_4", "value": "", "operator": "!=" }],
        "then": [{"column": "payment_method_electricity_4", "value": "", "operator": "!="},
          {"column": "default_3_years_electricity_4", "value": "", "operator": "!="} ]
      }
    },
      {
      "name": "If electricity_tariff_uid_5 is not blank/null - then payment_method_electricity_5 must not be blank/null - and default_3_years_electricity_5 must not be blank/null",
      "expressions": {
        "if": [{"column": "electricity_tariff_uid_5", "value": "", "operator": "!=" }],
        "then": [{"column": "payment_method_electricity_5", "value": "", "operator": "!="},
          {"column": "default_3_years_electricity_5", "value": "", "operator": "!="} ]
      }
    }
     ]
}