<svg xmlns="http://www.w3.org/2000/svg" width="10.902" height="20.813" viewBox="0 0 10.902 20.813">
    <path fill="#989898" d="M19.166 6.71v10.9a3.964 3.964 0 1 1-7.929 0V6.215a2.478 2.478 0 1 1 4.956 0v11.4a.991.991 0 0 1-1.982 0V8.2h-1.488v9.416a2.478 2.478 0 0 0 4.956 0V6.215a3.965 3.965 0 1 0-7.929 0v11.4a5.451 5.451 0 0 0 10.9 0V6.71z" transform="translate(-9.75 -2.25)"/>
</svg>
