<svg xmlns="http://www.w3.org/2000/svg" id="Composant_13_20" width="19.653" height="19.653" data-name="Composant 13 – 20" viewBox="0 0 19.653 19.653">
    <defs>
        <style>
            .cls-1{fill:#ff6e6e}
        </style>
    </defs>
    <path id="Tracé_87" d="M13.2 4.7a8.5 8.5 0 1 1-6.014 2.49A8.447 8.447 0 0 1 13.2 4.7m0-1.323a9.826 9.826 0 1 0 9.828 9.823A9.825 9.825 0 0 0 13.2 3.375z" class="cls-1" data-name="Tracé 87" transform="translate(-3.375 -3.375)"/>
    <path id="Icon_metro-cancel" d="M16.037 9.64l-2.213 2.213-2.213-2.213-1.328 1.328 2.217 2.213-2.213 2.213 1.328 1.328 2.213-2.213 2.213 2.213 1.328-1.328-2.213-2.213 2.213-2.213z" class="cls-1" data-name="Icon metro-cancel" transform="translate(-3.697 -3.355)"/>
</svg>
