<svg xmlns="http://www.w3.org/2000/svg" width="13.586" height="7.643" viewBox="0 0 13.586 7.643">
    <path id="Icon_feather-chevron-down" fill="none" stroke="#e9502b" stroke-linecap="round" stroke-linejoin="round" stroke-width="1.7px" d="M20.182 13.5l-5.591 5.591L9 13.5" data-name="Icon feather-chevron-down" transform="translate(-7.798 -12.298)"/>
</svg>
