CTAB;CACC;LIB1
040;004;AFGHANISTAN
040;008;ALBANIE
040;010;ANTARCTIQUE
040;012;ALGERIE
040;016;SAMOA AMERICAINES
040;020;ANDORRE
040;024;ANGOLA
040;028;ANTIGUA
040;031;AZERBAIJAN
040;032;ARGENTINE
040;036;AUSTRALIE
040;040;AUTRICHE
040;044;ILES BAHAMAS
040;048;BAHREIN
040;050;BANGLADESH
040;051;ARMENIE
040;052;ILES BARBADOS
040;056;BELGIQUE
040;060;BERMUDES
040;064;BHOUTAN
040;068;BOLIVIE
040;070;BOSNIE HERZEGOVINE
040;072;BOTSWANA
040;074;ILE DE BOUVET
040;076;BRESIL
040;084;BELIZE
040;090;ILES DE SALOMON
040;092;ILES DE VIERGES BRITANNIQUES
040;096;BRUNEI
040;100;BULGARIE
040;104;BIRMANIE
040;108;BURUNDI
040;112;BIOLORUSSIE
040;116;COMBODGE
040;120;CAMEROUN
040;124;CANADA
040;126;ILES CANARIES
040;128;ILES DE CANTON ET ENDERBURY
040;132;ILES DU CAP-VERT
040;136;ILES DE CAIMANES (GB)
040;140;REPUBLIQUE CENTRE AFRICAINE
040;144;CEYLAN
040;148;TCHAD
040;152;CHILI
040;156;CHINE CONTINENTALE
040;158;TAIWAN
040;162;ILE DE CHRISTMAS
040;166;ILES DES COCOS
040;170;COLOMBIE
040;174;ILES COMORES
040;178;CONGO
040;180;ZAIRE
040;184;ILE DE COOK
040;188;COSTA RICA
040;191;CROATIE
040;192;CUBA
040;196;CHYPRE
040;200;TCHECOSLOVAQUIE
040;203;REPUBLIQUE TCHEQUE
040;204;BENIN
040;208;DANEMARK
040;212;DOMINICA
040;214;REPUBLIQUE DOMINICAINE
040;216;TERRE DE LA REINE MAUD
040;218;EQUATEUR
040;222;SALVADOR
040;226;GUINEE EQUATORIALE
040;228;ERYTHREE
040;230;ETHIOPIE
040;233;ESTONIE
040;234;ILES DE FEROE
040;238;ILES DE FALKLAND
040;242;FIDJI
040;246;FINLANDE
040;250;FRANCE
040;254;GUYANE FRANCAISE
040;258;POLYNESIE FRANCAISE
040;262;DJIBOUTI
040;266;REPUBLIQUE GABONAISE
040;268;GEORGIE
040;270;REPUBLIQUE DE GAMBIE
040;276;ALLEMAGNE
040;278;REP. DEMOCRATIQUE D'ALLEMAGNE
040;280;REP. FEDERALE D'ALLEMAGNE
040;288;GHANA
040;292;GIBRALTAR
040;296;KIRIBATI
040;300;GRECE
040;304;GROENLAND
040;308;GRENADE
040;312;GUADELOUPE
040;316;GUAM
040;320;GUATEMALA
040;324;GUINEE
040;328;GUYANE
040;332;HAITI
040;334;ILES HEARD ET MC DONALD
040;336;VATICAN
040;340;HONDURAS
040;344;HONG KONG
040;348;HONGRIE
040;352;ISLANDE
040;356;INDE
040;360;INDONESIE
040;364;IRAN
040;368;IRAK
040;372;IRLANDE
040;380;ITALIE
040;384;COTE D IVOIRE
040;388;JAMAIQUE
040;392;JAPON
040;396;ILE DE JOHNSTON
040;398;KAZAKHISTAN
040;400;JORDANIE
040;404;KENYA
040;408;COREE DU NORD
040;410;COREE DU SUD
040;414;KOWEIT
040;417;KIRGHIZISTAN
040;418;LAOS
040;422;LIBAN
040;426;LESOTHO
040;428;LETTONIE
040;430;LIBERIA
040;434;LYBIE
040;438;LIECHTENSTEIN
040;440;LITHUANIE
040;442;LUXEMBOURG
040;446;MACAO
040;450;REPUBLIQUE MALGACHE
040;454;MALAWIE
040;458;MALAISIE
040;462;MALDIVES
040;466;MALI
040;470;MALTE
040;474;MARTINIQUE
040;478;MAURITANIE
040;480;ILE MAURICE
040;484;MEXIQUE
040;488;ILES DE MIDWAY
040;492;MONACO
040;496;MONGOLIE
040;498;MOLDAVIE
040;500;MONTSERRAT
040;504;MAROC
040;508;MOZAMBIQUE
040;512;OMAN
040;516;NAMIBIE
040;520;NAURU
040;524;NEPAL
040;528;PAYS BAS
040;532;ANTILLES NEERLANDAISES
040;536;ZONE NEUTRE
040;540;NOUVELLE-CALEDONIE
040;548;VANUATU
040;554;NOUVELLE ZELANDE
040;558;NICARAGUA
040;562;NIGER
040;566;NIGERIA
040;570;NIOUE
040;574;ILE DE NORFOLK
040;578;NORVEGE
040;582;ILES DU PACIFIQUE
040;586;PAKISTAN
040;588;PALESTINE
040;590;PANAMA
040;598;PAPOUASIE NOUVELLE-GUINEE
040;600;PARAGUAY
040;604;PEROU
040;608;PHILIPPINE
040;612;ILE DE PITCAIRN
040;616;POLOGNE
040;620;PORTUGAL
040;624;GUINEE-BISSAU
040;626;TIMOR ORIENTAL
040;630;PORTO RICO
040;634;QATAR
040;638;REUNION
040;642;ROUMANIE
040;643;RUSSIE
040;646;RWANDA
040;654;SAINTE-HELENE
040;658;ST-CHRISTOPHE NIEVES ANGUILLA
040;662;SAINT-LUCIE
040;666;SAINT-PIERRE-ET-MIQUELON
040;670;SAINT-VINCENT-ET-GRENADINES
040;674;SAINT-MARIN
040;678;SAO TOME-ET-PRINCIPE
040;682;ARABIE SEOUDITE
040;686;SENEGAL
040;690;SEYCHELLES
040;694;SIERRA LEONE
040;702;SINGAPOUR
040;703;SLOVAQUIE
040;704;VIETNAM
040;705;SLOVENIE
040;706;SOMALIE
040;710;AFRIQUE DU SUD
040;716;ZIMBABWE
040;720;YEMEN DU NORD
040;724;ESPAGNE
040;732;SAHARA OCCIDENTAL
040;736;SOUDAN
040;740;SURINAME
040;744;SVALBARD ET ILE JAN MAYEN
040;748;SWAZILAND
040;752;SUEDE
040;756;SUISSE
040;760;SYRIE
040;762;TADJIKISTAN
040;764;THAILAND
040;768;TOGO
040;772;TOKELAOU
040;776;TONGA
040;780;TRINITE-ET-TOBAGO
040;784;ETATS DES EMIRATS ARABES UNIS
040;792;TURQUIE
040;795;TURKMENISTAN
040;796;ILES DE TURKS ET CAIQUES
040;798;TUVALU
040;800;OUGANDA
040;804;UKRAINE
040;810;U.R.S.S.
040;818;EGYPTE
040;826;GRANDE BRETAGNE
040;834;TANZANIE
040;840;ETATS UNIS D'AMERIQUE
040;849;DIVERSE ILE DU PACIFIQUE (USA)
040;850;ILES DE VIERGES AMERICAINES
040;854;HAUTE VOLTA
040;858;URUGUAY
040;860;OUZBEKISTAN
040;862;VENEZUELA
040;872;ILE DE WAKE
040;876;ILES DE WALIS ET FUTUNA
040;882;SAMOA
040;886;YEMEN DU SUD
040;887;YEMEN
040;890;YOUGOSLAVIE
040;894;ZAMBIE
