{
  "fluentMethods": true,
  "clientRootFolder": "",
  "relationships": [],
  "fields": [
    {
      "fieldName": "rue",
      "fieldType": "String"
    },
    {
      "fieldName": "codePostal",
      "fieldType": "Long"
    },
    {
      "fieldName": "ville",
      "fieldType": "String"
    },
    {
      "fieldName": "pays",
      "fieldType": "String"
    }
  ],
  "changelogDate": "20210320095457",
  "dto": "mapstruct",
  "searchEngine": false,
  "service": "serviceImpl",
  "entityTableName": "adresse",
  "databaseType": "sql",
  "readOnly": false,
  "jpaMetamodelFiltering": false,
  "pagination": "no"
}
