{
  "fluentMethods": true,
  "clientRootFolder": "",
  "relationships": [],
  "fields": [
    {
      "fieldName": "email",
      "fieldType": "String"
    },
    {
      "fieldName": "token",
      "fieldType": "String",
      "fieldValidateRules": []
    },
    {
      "fieldName": "dateCreation",
      "fieldType": "LocalDate"
    },
    {
      "fieldName": "valide",
      "fieldType": "Boolean"
    }
  ],
  "changelogDate": "20210216135006",
  "dto": "mapstruct",
  "searchEngine": false,
  "service": "serviceImpl",
  "entityTableName": "authentitfication_to_sign",
  "databaseType": "sql",
  "readOnly": false,
  "jpaMetamodelFiltering": false,
  "pagination": "no"
}
