{
  "fluentMethods": true,
  "clientRootFolder": "",
  "relationships": [
    {
      "relationshipName": "category",
      "otherEntityName": "category",
      "relationshipType": "many-to-one",
      "otherEntityField": "id",
      "otherEntityRelationshipName": "financialInfo"
    },
    {
      "relationshipName": "activity",
      "otherEntityName": "activity",
      "relationshipType": "many-to-one",
      "otherEntityField": "id",
      "otherEntityRelationshipName": "financialInfo"
    },
    {
      "relationshipName": "request",
      "otherEntityName": "request",
      "relationshipType": "one-to-one",
      "otherEntityField": "id",
      "ownerSide": true,
      "useJPADerivedIdentifier": false,
      "otherEntityRelationshipName": "financialInfo"
    }
  ],
  "fields": [
    {
      "fieldName": "monthlyNetIncome",
      "fieldType": "Double"
    }
  ],
  "changelogDate": "20201214142427",
  "dto": "mapstruct",
  "searchEngine": false,
  "service": "serviceImpl",
  "entityTableName": "financial_info",
  "databaseType": "sql",
  "readOnly": true,
  "jpaMetamodelFiltering": false,
  "pagination": "no"
}
