{
  "fluentMethods": true,
  "clientRootFolder": "",
  "relationships": [
    {
      "relationshipName": "offer",
      "otherEntityName": "offer",
      "relationshipType": "many-to-many",
      "ownerSide": false,
      "otherEntityRelationshipName": "detailOffer"
    }
  ],
  "fields": [
    {
      "fieldName": "description",
      "fieldType": "String"
    }
  ],
  "changelogDate": "20201214144445",
  "dto": "mapstruct",
  "searchEngine": false,
  "service": "serviceImpl",
  "entityTableName": "detail_offer",
  "databaseType": "sql",
  "readOnly": true,
  "jpaMetamodelFiltering": false,
  "pagination": "no"
}
