{
  "fluentMethods": true,
  "clientRootFolder": "",
  "relationships": [
    {
      "relationshipName": "offer",
      "otherEntityName": "offer",
      "relationshipType": "many-to-one",
      "otherEntityField": "id",
      "otherEntityRelationshipName": "request"
    },
    {
      "relationshipName": "agency",
      "otherEntityName": "agency",
      "relationshipType": "many-to-one",
      "otherEntityField": "id",
      "otherEntityRelationshipName": "request"
    },
    {
      "relationshipName": "personalInfo",
      "otherEntityName": "personalInfo",
      "relationshipType": "one-to-one",
      "ownerSide": false,
      "otherEntityRelationshipName": "request"
    },
    {
      "relationshipName": "financialInfo",
      "otherEntityName": "financialInfo",
      "relationshipType": "one-to-one",
      "ownerSide": false,
      "otherEntityRelationshipName": "request"
    },
    {
      "relationshipName": "requiredDoc",
      "otherEntityName": "requiredDoc",
      "relationshipType": "one-to-one",
      "ownerSide": false,
      "otherEntityRelationshipName": "request"
    },
    {
      "relationshipName": "bankAccount",
      "otherEntityName": "bankAccount",
      "relationshipType": "one-to-many",
      "otherEntityRelationshipName": "request"
    }
  ],
  "fields": [
    {
      "fieldName": "visio_date",
      "fieldType": "LocalDate"
    },
    {
      "fieldName": "sendingMailDate",
      "fieldType": "LocalDate"
    },
    {
      "fieldName": "state",
      "fieldType": "Boolean"
    }
  ],
  "changelogDate": "20201214140543",
  "dto": "mapstruct",
  "searchEngine": false,
  "service": "serviceImpl",
  "entityTableName": "request",
  "databaseType": "sql",
  "readOnly": true,
  "jpaMetamodelFiltering": false,
  "pagination": "no"
}
