{
  "fluentMethods": true,
  "clientRootFolder": "",
  "relationships": [
    {
      "relationshipName": "requiredDoc",
      "otherEntityName": "requiredDoc",
      "relationshipType": "many-to-one",
      "otherEntityField": "id",
      "otherEntityRelationshipName": "requiredDocIncome"
    }
  ],
  "fields": [
    {
      "fieldName": "type",
      "fieldType": "String"
    },
    {
      "fieldName": "path",
      "fieldType": "String"
    }
  ],
  "changelogDate": "20201214144330",
  "dto": "mapstruct",
  "searchEngine": false,
  "service": "serviceImpl",
  "entityTableName": "req_doc_income",
  "databaseType": "sql",
  "readOnly": true,
  "jpaMetamodelFiltering": false,
  "pagination": "no"
}
