{
  "fluentMethods": true,
  "clientRootFolder": "",
  "relationships": [
    {
      "relationshipName": "requiredDocIncome",
      "otherEntityName": "requiredDocIncome",
      "relationshipType": "one-to-many",
      "otherEntityRelationshipName": "requiredDoc"
    },
    {
      "relationshipName": "requiredDocResidency",
      "otherEntityName": "requiredDocResidency",
      "relationshipType": "one-to-many",
      "otherEntityRelationshipName": "requiredDoc"
    },
    {
      "relationshipName": "request",
      "otherEntityName": "request",
      "relationshipType": "one-to-one",
      "otherEntityField": "id",
      "ownerSide": true,
      "useJPADerivedIdentifier": false,
      "otherEntityRelationshipName": "requiredDoc"
    }
  ],
  "fields": [
    {
      "fieldName": "label",
      "fieldType": "String"
    },
    {
      "fieldName": "type",
      "fieldType": "String"
    },
    {
      "fieldName": "numCIN",
      "fieldType": "String"
    },
    {
      "fieldName": "deliveryDateCIN",
      "fieldType": "LocalDate"
    },
    {
      "fieldName": "rectoCIN",
      "fieldType": "String"
    },
    {
      "fieldName": "versoCIN",
      "fieldType": "String"
    },
    {
      "fieldName": "facta",
      "fieldType": "String"
    }
  ],
  "changelogDate": "20201214143943",
  "dto": "mapstruct",
  "searchEngine": false,
  "service": "serviceImpl",
  "entityTableName": "required_doc",
  "databaseType": "sql",
  "readOnly": true,
  "jpaMetamodelFiltering": false,
  "pagination": "no"
}
