PCBNEW-LibModule-V1  
# encoding utf-8
Units mm
$INDEX
CUI_SJ1-3525N
$EndINDEX
$MODULE CUI_SJ1-3525N
Po 0 0 0 15 00000000 00000000 ~~
Li CUI_SJ1-3525N
Cd 
Sc 00000000
At STD
Op 0 0 0
.SolderMask 0
.SolderPaste 0
T0 -0.96045 -7.93865 1.00046 1.00046 0 0.05 N V 21 "CUI_SJ1-3525N"
T1 -0.325095 7.63734 1.00031 1.00031 0 0.05 N V 21 "VAL**"
T2 -12.501400 -6.000650 1 1 0 .05 N V 49 "PCB~edge"
DS -0.4 -0.75 0.4 -0.75 0.0001 28
DS 0.4 -0.75 0.4 0.75 0.0001 28
DS 0.4 0.75 -0.4 0.75 0.0001 28
DS -0.4 0.75 -0.4 -0.75 0.0001 28
DS -4.5 -6 -4.5 -2 0.0001 28
DS -4.5 -2 -3.3 -2 0.0001 28
DS -3.3 -2 -3.3 2 0.0001 28
DS -3.3 2 -4.5 2 0.0001 28
DS -4.5 2 -4.5 6 0.0001 28
DS 4.25 -2.1 4.25 -2.9 0.0001 28
DS 4.25 -2.9 5.75 -2.9 0.0001 28
DS 5.75 -2.9 5.75 -2.1 0.0001 28
DS 5.75 -2.1 4.25 -2.1 0.0001 28
DS 4.25 -4.6 4.25 -5.4 0.0001 28
DS 4.25 -5.4 5.75 -5.4 0.0001 28
DS 5.75 -5.4 5.75 -4.6 0.0001 28
DS 5.75 -4.6 4.25 -4.6 0.0001 28
DS 4.25 2.9 4.25 2.1 0.0001 28
DS 4.25 2.1 5.75 2.1 0.0001 28
DS 5.75 2.1 5.75 2.9 0.0001 28
DS 5.75 2.9 4.25 2.9 0.0001 28
DS 4.25 5.4 4.25 4.6 0.0001 28
DS 4.25 4.6 5.75 4.6 0.0001 28
DS 5.75 4.6 5.75 5.4 0.0001 28
DS 5.75 5.4 4.25 5.4 0.0001 28
DS 7.5 -6.2 7.5 6.2 0.127 21
DS 7.5 6.2 -3.5 6.2 0.127 21
DS 7.5 -6.2 -3.5 -6.2 0.127 21
DS 7.75 -6.45 7.75 6.45 0.05 26
DS 7.75 6.45 -4.75 6.45 0.05 26
DS -4.75 -6.45 7.75 -6.45 0.05 26
DS 7.5 -6.2 -3.5 -6.2 0.127 24
DS 7.5 -6.2 7.5 6.2 0.127 24
DS 7.5 6.2 -3.5 6.2 0.127 24
DS -3.5 -6.2 -3.5 -4.5 0.127 24
DS -3.5 -4.5 -4.5 -4.5 0.127 24
DS -4.5 -4.5 -4.5 -3 0.127 24
DS -4.5 -3 -4.5 3 0.127 24
DS -4.5 3 -4.5 4.5 0.127 24
DS -4.5 4.5 -3.5 4.5 0.127 24
DS -3.5 4.5 -3.5 6.2 0.127 24
DS -3.5 -6.2 -3.5 -4.5 0.127 21
DS -3.5 4.5 -3.5 6.2 0.127 21
DS -3.5 -4.5 -4.3 -4.5 0.127 21
DS -3.5 4.5 -4.3 4.5 0.127 21
DS -4.5 -3 -6.5 -3 0.127 24
DS -6.5 -3 -6.5 3 0.127 24
DS -6.5 3 -4.5 3 0.127 24
DS -4.75 -6.45 -4.75 -3.25 0.05 26
DS -4.75 -3.25 -6.75 -3.25 0.05 26
DS -6.75 -3.25 -6.75 3.25 0.05 26
DS -6.75 3.25 -4.75 3.25 0.05 26
DS -4.75 3.25 -4.75 6.45 0.05 26
DC 0 -6.8 0.17 -6.8 0.34 21
$PAD
Sh "1" O 2.616 1.308 0 0 900
Dr 0.8 0 0
At STD N 00C0FFFF
.SolderMask 0
Ne 0 ""
Po 0 0
$EndPAD
$PAD
Sh "2" O 2.616 1.308 0 0 1800
Dr 0.8 0 0
At STD N 00C0FFFF
.SolderMask 0
Ne 0 ""
Po 5 5
$EndPAD
$PAD
Sh "10" O 2.616 1.308 0 0 1800
Dr 0.8 0 0
At STD N 00C0FFFF
.SolderMask 0
Ne 0 ""
Po 5 2.5
$EndPAD
$PAD
Sh "11" O 2.616 1.308 0 0 1800
Dr 0.8 0 0
At STD N 00C0FFFF
.SolderMask 0
Ne 0 ""
Po 5 -2.5
$EndPAD
$PAD
Sh "3" O 2.616 1.308 0 0 1800
Dr 0.8 0 0
At STD N 00C0FFFF
.SolderMask 0
Ne 0 ""
Po 5 -5
$EndPAD
$PAD
Sh "Hole" C 1.2 1.2 0 0 0
Dr 1.2 0 0
At HOLE N 00E0FFFF
Po -2.5 -5
$EndPAD
$PAD
Sh "Hole" C 1.2 1.2 0 0 0
Dr 1.2 0 0
At HOLE N 00E0FFFF
Po 0 -5
$EndPAD
$PAD
Sh "Hole" C 1.2 1.2 0 0 0
Dr 1.2 0 0
At HOLE N 00E0FFFF
Po 5 0
$EndPAD
$PAD
Sh "Hole" C 1.2 1.2 0 0 0
Dr 1.2 0 0
At HOLE N 00E0FFFF
Po -2.5 5
$EndPAD
$PAD
Sh "Hole" C 1.2 1.2 0 0 0
Dr 1.2 0 0
At HOLE N 00E0FFFF
Po 0 5
$EndPAD
$EndMODULE CUI_SJ1-3525N
