G04 #@! TF.GenerationSoftware,KiCad,Pcbnew,(5.0.0-3-g5ebb6b6)*
G04 #@! TF.CreationDate,2018-12-26T15:38:02+01:00*
G04 #@! TF.ProjectId,sensor,73656E736F722E6B696361645F706362,rev?*
G04 #@! TF.SameCoordinates,Original*
G04 #@! TF.FileFunction,Drawing*
%FSLAX46Y46*%
G04 Gerber Fmt 4.6, Leading zero omitted, Abs format (unit mm)*
G04 Created by KiCad (PCBNEW (5.0.0-3-g5ebb6b6)) date Wednesday, 26. December 2018 um 15:38:02*
%MOMM*%
%LPD*%
G01*
G04 APERTURE LIST*
%ADD10C,0.127000*%
%ADD11C,0.200000*%
%ADD12C,0.250000*%
G04 APERTURE END LIST*
D10*
G04 #@! TO.C,J2*
X136850000Y-57610000D02*
X136850000Y-51610000D01*
X136850000Y-51610000D02*
X122350000Y-51610000D01*
X122350000Y-51610000D02*
X122350000Y-57610000D01*
X122350000Y-57610000D02*
X136850000Y-57610000D01*
D11*
X137750000Y-57910000D02*
G75*
G03X137750000Y-57910000I-100000J0D01*
G01*
D10*
X136850000Y-52110000D02*
X139350000Y-52110000D01*
X139350000Y-52110000D02*
X139350000Y-57110000D01*
X139350000Y-57110000D02*
X136850000Y-57110000D01*
G04 #@! TO.C,S1*
X141844288Y-79390158D02*
X140802399Y-85299005D01*
X140802399Y-85299005D02*
X146711246Y-86340894D01*
X146711246Y-86340894D02*
X147753135Y-80432047D01*
X147753135Y-80432047D02*
X141844288Y-79390158D01*
G04 #@! TO.C,SW1*
X138400000Y-60150000D02*
X138400000Y-66850000D01*
X138400000Y-66850000D02*
X141000000Y-66850000D01*
X141000000Y-66850000D02*
X141000000Y-65000000D01*
X141000000Y-65000000D02*
X141000000Y-62000000D01*
X141000000Y-62000000D02*
X141000000Y-60150000D01*
X141000000Y-60150000D02*
X138400000Y-60150000D01*
X141000000Y-62000000D02*
X142500000Y-62000000D01*
X142500000Y-62000000D02*
X142500000Y-65000000D01*
X142500000Y-65000000D02*
X141000000Y-65000000D01*
D12*
X137300000Y-60300000D02*
G75*
G03X137300000Y-60300000I-100000J0D01*
G01*
G04 #@! TD*
M02*
