G04 #@! TF.GenerationSoftware,KiCad,Pcbnew,(5.0.0-3-g5ebb6b6)*
G04 #@! TF.CreationDate,2018-12-26T16:09:50+01:00*
G04 #@! TF.ProjectId,sensor,73656E736F722E6B696361645F706362,rev?*
G04 #@! TF.SameCoordinates,Original*
G04 #@! TF.FileFunction,Other,User*
%FSLAX46Y46*%
G04 Gerber Fmt 4.6, Leading zero omitted, Abs format (unit mm)*
G04 Created by KiCad (PCBNEW (5.0.0-3-g5ebb6b6)) date Wednesday, 26. December 2018 um 16:09:50*
%MOMM*%
%LPD*%
G01*
G04 APERTURE LIST*
%ADD10C,0.050000*%
G04 APERTURE END LIST*
D10*
G04 #@! TO.C,BZ1*
X138604126Y-91689908D02*
G75*
G03X138604126Y-91689908I-6250000J0D01*
G01*
G04 #@! TO.C,C1*
X140554126Y-85439908D02*
X138654126Y-85439908D01*
X138654126Y-85439908D02*
X138654126Y-89139908D01*
X138654126Y-89139908D02*
X140554126Y-89139908D01*
X140554126Y-89139908D02*
X140554126Y-85439908D01*
G04 #@! TO.C,C2*
X142504126Y-89139908D02*
X142504126Y-85439908D01*
X140604126Y-89139908D02*
X142504126Y-89139908D01*
X140604126Y-85439908D02*
X140604126Y-89139908D01*
X142504126Y-85439908D02*
X140604126Y-85439908D01*
G04 #@! TO.C,D1*
X138504126Y-97989908D02*
X145004126Y-97989908D01*
X145004126Y-97989908D02*
X145004126Y-104439908D01*
X145004126Y-104439908D02*
X138504126Y-104439908D01*
X138504126Y-104439908D02*
X138504126Y-97989908D01*
G04 #@! TO.C,D3*
X138689126Y-89994908D02*
X144189126Y-89994908D01*
X144189126Y-89994908D02*
X144189126Y-96894908D01*
X144189126Y-96894908D02*
X138689126Y-96894908D01*
X138689126Y-96894908D02*
X138689126Y-89994908D01*
G04 #@! TO.C,D4*
X144309126Y-96894908D02*
X144309126Y-89994908D01*
X149809126Y-96894908D02*
X144309126Y-96894908D01*
X149809126Y-89994908D02*
X149809126Y-96894908D01*
X144309126Y-89994908D02*
X149809126Y-89994908D01*
G04 #@! TO.C,R1*
X128004126Y-110539908D02*
X128004126Y-106839908D01*
X126104126Y-110539908D02*
X128004126Y-110539908D01*
X126104126Y-106839908D02*
X126104126Y-110539908D01*
X128004126Y-106839908D02*
X126104126Y-106839908D01*
G04 #@! TO.C,R2*
X129954126Y-106839908D02*
X128054126Y-106839908D01*
X128054126Y-106839908D02*
X128054126Y-110539908D01*
X128054126Y-110539908D02*
X129954126Y-110539908D01*
X129954126Y-110539908D02*
X129954126Y-106839908D01*
G04 #@! TO.C,R3*
X133854126Y-106829908D02*
X131954126Y-106829908D01*
X131954126Y-106829908D02*
X131954126Y-110529908D01*
X131954126Y-110529908D02*
X133854126Y-110529908D01*
X133854126Y-110529908D02*
X133854126Y-106829908D01*
G04 #@! TO.C,R4*
X131904126Y-106839908D02*
X130004126Y-106839908D01*
X130004126Y-106839908D02*
X130004126Y-110539908D01*
X130004126Y-110539908D02*
X131904126Y-110539908D01*
X131904126Y-110539908D02*
X131904126Y-106839908D01*
G04 #@! TO.C,R5*
X135804126Y-110529908D02*
X135804126Y-106829908D01*
X133904126Y-110529908D02*
X135804126Y-110529908D01*
X133904126Y-106829908D02*
X133904126Y-110529908D01*
X135804126Y-106829908D02*
X133904126Y-106829908D01*
G04 #@! TO.C,R6*
X146954126Y-100879908D02*
X146954126Y-97179908D01*
X145054126Y-100879908D02*
X146954126Y-100879908D01*
X145054126Y-97179908D02*
X145054126Y-100879908D01*
X146954126Y-97179908D02*
X145054126Y-97179908D01*
G04 #@! TO.C,RV1*
X149894126Y-89759908D02*
X155194126Y-89759908D01*
X155194126Y-89759908D02*
X155194126Y-96259908D01*
X155194126Y-96259908D02*
X149894126Y-96259908D01*
X149894126Y-96259908D02*
X149894126Y-89759908D01*
G04 #@! TO.C,U1*
X143884126Y-79909908D02*
X154584126Y-79909908D01*
X154584126Y-79909908D02*
X154584126Y-89709908D01*
X154584126Y-89709908D02*
X143884126Y-89709908D01*
X143884126Y-89709908D02*
X143884126Y-79909908D01*
G04 #@! TD*
M02*
