{
  "$schema": "https://json-schema.org/draft/2020-12/schema",
  "$id": "https://hakkes.com/schemes/user_credential_put.json",
  "type": "object",
  "additionalProperties": false,
  "required": ["brokerId", "apiKey", "isActive"],
  "properties": {
    "brokerId": {
      "type": "string"
    },
    "apiKey": {
      "type": "string"
    },
    "isActive": {
      "type": "integer"
    }
  }
}