{
  "$schema": "https://json-schema.org/draft/2020-12/schema",
  "$id": "https://hakkes.com/schemes/user_credential_broker_account_post.json",
  "type": "object",
  "additionalProperties": false,
  "required": ["userAccount", "credentialId"],
  "properties": {
    "userAccount": {
      "type": "array",
      "items": {
        "type": "object",
        "requires": ["externalId", "isActive"],
        "additionalProperties": false,
        "properties": {
          "externalId" : {
            "type": "string"
          },
          "isActive": {
            "type": "integer"
          }
        }
      }
    },
    "credentialId": {
      "type": "integer"
    }
  }
}