{
  "$schema": "https://json-schema.org/draft/2020-12/schema",
  "$id": "https://hakkes.com/schemes/price.json",
  "type": ["null", "object"],
  "additionalProperties": false,
  "required": ["amount", "currency"],
  "properties": {
    "amount": {
      "type": "integer"
    },
    "currency": {
      "type": "string"
    }
  }
}