{
  "$schema": "https://json-schema.org/draft/2020-12/schema",
  "$id": "https://hakkes.com/schemes/user_data_put.json",
  "additionalProperties": false,
  "type": "object",
  "properties": {
    "language": {
      "type": ["string", "null"]
    }
  }
}