{
  "$schema": "https://json-schema.org/draft/2020-12/schema",
  "$id": "https://hakkes.com/schemes/user_loan_item_add_post.json",
  "type": "object",
  "additionalProperties": false,
  "required": ["loanId", "itemId", "name", "amount", "currency", "isActive", "date", "paymentAmount", "paymentCurrency", "payoutFrequency", "payoutFrequencyPeriod", "interestPercent"],
  "properties": {
    "loanId": {
      "type": "number"
    },
    "itemId": {
      "type": "number"
    },
    "name": {
      "type": "string"
    },
    "amount": {
      "type": "number"
    },
    "currency": {
      "type": "string"
    },
    "isActive": {
      "type": "number"
    },
    "closedDate": {
      "$ref": "https://hakkes.com/schemes/date.json"
    },
    "date": {
      "$ref": "https://hakkes.com/schemes/date.json"
    },
    "paymentAmount": {
      "type": "number"
    },
    "paymentCurrency": {
      "type": "string"
    },
    "payoutFrequency": {
      "type": "integer"
    },
    "payoutFrequencyPeriod": {
      "type": "string"
    },
    "interestPercent": {
      "type": "number"
    }
  }
}