{
  "$schema": "https://json-schema.org/draft/2020-12/schema",
  "$id": "https://hakkes.com/schemes/user_stategy_share_put.json",
  "additionalProperties": false,
  "type": "array",
  "items": {
    "type": "object",
    "requires": [
      "name",
      "value"
    ],
    "additionalProperties": false,
    "properties": {
      "externalId": {
        "type": "string"
      },
      "value": {
        "type": "number"
      }
    }
  }
}