{
  "$schema": "https://json-schema.org/draft/2020-12/schema",
  "$id": "https://hakkes.com/schemes/auth_unlink_delete.json",
  "type": "object",
  "additionalProperties": false,
  "required": ["code"],
  "properties": {
    "code": {
      "type": "string"
    }
  }
}