{
  "$schema": "https://json-schema.org/draft/2020-12/schema",
  "$id": "https://hakkes.com/schemes/operation_add_post.json",
  "type": "object",
  "additionalProperties": true,
  "required": ["itemOperationId", "brokerId", "itemId", "operationType", "date", "amount", "currencyIso", "status"],
  "properties": {
    "itemOperationId": {
      "type": "null"
    },
    "itemId": {
      "type": "integer"
    },
    "brokerId": {
      "type": ["string", "null"]
    },
    "operationType": {
      "type": "string"
    },
    "externalId": {
      "type": ["string", "null"]
    },
    "quantity": {
      "type": ["number", "null"]
    },
    "date": {
      "type": "object",
      "additionalProperties": false,
      "required": ["date", "timezone"],
      "properties": {
        "date": {
          "type": "string"
        },
        "timezone": {
          "type": "string"
        }
      }
    },
    "amount": {
      "type": "number"
    },
    "currencyIso": {
      "type": "string"
    },
    "status": {
      "type": "string"
    }
  }
}