{
  "$schema": "https://json-schema.org/draft/2020-12/schema",
  "$id": "https://hakkes.com/schemes/stock_list_get.json",
  "type": "object",
  "additionalProperties": false,
  "required": [],
  "properties": {
    "country": {
      "type": "string"
    },
    "currency": {
      "type": "string"
    },
    "sector": {
      "type": "string"
    }
  }
}