{
  "$schema": "https://json-schema.org/draft/2020-12/schema",
  "$id": "https://hakkes.com/schemes/real_estate_sell_put.json",
  "type": ["null", "object"],
  "additionalProperties": false,
  "required": ["price"],
  "properties": {
    "price": {
      "$ref": "https://hakkes.com/schemes/price.json"
    }
  }
}