[
    {
        "title" : "zkittlez",
        "price" : "13 €",
        "url" : "https://www.barneysfarm.com/images/products/__watermelon-zkittlez_circle_new_21_202888.jpg",
        "article" : "001",
        "color" : "purple",
        "isFav": false
    },
    {
        "title" : "skywalker og auto",
        "price" : "12 €",
        "url" : "https://www.barneysfarm.com/images/products/__skywalker-og-auto_circle_new_21_360424.jpg",
        "article" : "002",
        "color" : "green",
        "isFav": false
    },
    {
        "title" : "runtz auto",
        "price" : "14 €",
        "url" : "https://www.barneysfarm.com/images/products/__runtz-auto_circle_new_21_536734.jpg",
        "article" : "003",
        "color" : "orange",
        "isFav": false  
    },
    {
        "title" : "watermelon auto",
        "price" : "13 €",
        "url" : "https://www.barneysfarm.com/images/products/__watermelon-zkittlez-auto_circle_new_21_298173.jpg",
        "article" : "004",
        "color" : "green",
        "isFav": false
    },
    {
        "title" : "runtz muffin",
        "price" : "14 €",
        "url" : "https://www.barneysfarm.com/images/products/__runtz-muffin_circle_new_21_842083.jpg",
        "article" : "005",
        "color" : "orange",
        "isFav": false
    },
    {
        "title" : "gorilla zkittlez",
        "price" : "13 €",
        "url" : "https://www.barneysfarm.com/images/products/__gorilla-zkittlez_circle_new_12_045989.jpg",
        "article" : "006",
        "color" : "green",
        "isFav": false
    },
    {
        "title" : "wedding cake",
        "price" : "13 €",
        "url" : "https://www.barneysfarm.com/images/products/__wedding-cake_circle_new_12_035893.jpg",
        "article" : "007",
        "color" : "green",
        "isFav": false
    },
    {
        "title" : "dos si dos",
        "price" : "13 €",
        "url" : "https://www.barneysfarm.com/images/products/__dos-si-dos-33_circle_new_12_697693.jpg",
        "article" : "008",
        "color" : "grey",
        "isFav": false
    },
    {
        "title" : "glookies",
        "price" : "12 €",
        "url" : "https://www.barneysfarm.com/images/products/__glookies_circle_new_12_479821.jpg",
        "article" : "009",
        "color" : "purple",
        "isFav": false
    },
    {
        "title" : "purple punch auto",
        "price" : "11 €",
        "url" : "https://www.barneysfarm.com/images/products/__purple-punch-auto_circle_new_12_864925.jpg",
        "article" : "010",
        "color" : "purple",
        "isFav": false
    }
]