{
  "$schema": "https://json.schemastore.org/nest-cli",
  "collection": "@nestjs/schematics",
  "sourceRoot": "src",
  "compilerOptions": {
    "assets": [
      { "include": "../config/*.yaml", "outDir": "./dist/config" },
      { "include": "./gen-pdf/templates/*.ejs", "outDir": "./dist/src" },
      { "include": "../config/jwt/*.pem", "outDir": "./dist/config" }
    ]
  }
}
