EESchema Schematic File Version 4
EELAYER 30 0
EELAYER END
$Descr A4 11693 8268
encoding utf-8
Sheet 1 1
Title ""
Date ""
Rev "1"
Comp "aswoboda"
Comment1 "https://www.cern.ch/cern-ohl"
Comment2 "This source describes Open Hardware and is licensed under the CERN-OHL-Pv2"
Comment3 ""
Comment4 ""
$EndDescr
$Comp
L Connector:USB_C_Receptacle_USB2.0 J1
U 1 1 60A15B9B
P 1650 1850
F 0 "J1" H 1757 2717 50  0000 C CNN
F 1 "USB_C_Receptacle_USB2.0" H 1757 2626 50  0000 C CNN
F 2 "project_specific_footprints:USB_C_Receptacle_GCT_USB4085" H 1800 1850 50  0001 C CNN
F 3 "https://www.usb.org/sites/default/files/documents/usb_type-c.zip" H 1800 1850 50  0001 C CNN
	1    1650 1850
	1    0    0    -1  
$EndComp
$Comp
L MCU_Microchip_ATmega:ATmega32U4-AU U1
U 1 1 60A17154
P 5400 2650
F 0 "U1" H 5400 761 50  0000 C CNN
F 1 "ATmega32U4-AU" H 5400 670 50  0000 C CNN
F 2 "Package_QFP:TQFP-44_10x10mm_P0.8mm" H 5400 2650 50  0001 C CIN
F 3 "http://ww1.microchip.com/downloads/en/DeviceDoc/Atmel-7766-8-bit-AVR-ATmega16U4-32U4_Datasheet.pdf" H 5400 2650 50  0001 C CNN
	1    5400 2650
	1    0    0    -1  
$EndComp
$Comp
L Device:Crystal_GND24_Small Y1
U 1 1 60A192DA
P 3850 1600
F 0 "Y1" H 3994 1646 50  0000 L CNN
F 1 "16MHz" H 3994 1555 50  0000 L CNN
F 2 "Crystal:Crystal_SMD_SeikoEpson_TSX3225-4Pin_3.2x2.5mm_HandSoldering" H 3850 1600 50  0001 C CNN
F 3 "~" H 3850 1600 50  0001 C CNN
	1    3850 1600
	1    0    0    -1  
$EndComp
$Comp
L Device:C_Small C7
U 1 1 60A19B8F
P 4700 2650
F 0 "C7" H 4792 2696 50  0000 L CNN
F 1 "1uF" H 4792 2605 50  0000 L CNN
F 2 "Capacitor_SMD:C_0603_1608Metric_Pad1.08x0.95mm_HandSolder" H 4700 2650 50  0001 C CNN
F 3 "~" H 4700 2650 50  0001 C CNN
	1    4700 2650
	1    0    0    -1  
$EndComp
$Comp
L Device:R_Small R1
U 1 1 60A1AE66
P 2450 1450
F 0 "R1" V 2254 1450 50  0000 C CNN
F 1 "5.1K" V 2345 1450 50  0000 C CNN
F 2 "Resistor_SMD:R_0603_1608Metric_Pad0.98x0.95mm_HandSolder" H 2450 1450 50  0001 C CNN
F 3 "~" H 2450 1450 50  0001 C CNN
	1    2450 1450
	0    1    1    0   
$EndComp
$Comp
L Device:R_Small R2
U 1 1 60A1B923
P 2450 1550
F 0 "R2" V 2254 1550 50  0000 C CNN
F 1 "5.1K" V 2345 1550 50  0000 C CNN
F 2 "Resistor_SMD:R_0603_1608Metric_Pad0.98x0.95mm_HandSolder" H 2450 1550 50  0001 C CNN
F 3 "~" H 2450 1550 50  0001 C CNN
	1    2450 1550
	0    1    1    0   
$EndComp
$Comp
L Device:R_Small R3
U 1 1 60A1BD0C
P 2850 1800
F 0 "R3" V 2654 1800 50  0000 C CNN
F 1 "22R" V 2745 1800 50  0000 C CNN
F 2 "Resistor_SMD:R_0603_1608Metric_Pad0.98x0.95mm_HandSolder" H 2850 1800 50  0001 C CNN
F 3 "~" H 2850 1800 50  0001 C CNN
	1    2850 1800
	0    1    1    0   
$EndComp
NoConn ~ 2250 2350
NoConn ~ 2250 2450
$Comp
L power:VCC #PWR0101
U 1 1 60A1C933
P 2350 1150
F 0 "#PWR0101" H 2350 1000 50  0001 C CNN
F 1 "VCC" H 2365 1323 50  0000 C CNN
F 2 "" H 2350 1150 50  0001 C CNN
F 3 "" H 2350 1150 50  0001 C CNN
	1    2350 1150
	1    0    0    -1  
$EndComp
$Comp
L power:VCC #PWR0102
U 1 1 60A1CF75
P 5600 750
F 0 "#PWR0102" H 5600 600 50  0001 C CNN
F 1 "VCC" V 5615 878 50  0000 L CNN
F 2 "" H 5600 750 50  0001 C CNN
F 3 "" H 5600 750 50  0001 C CNN
	1    5600 750 
	0    1    1    0   
$EndComp
$Comp
L power:GND #PWR0103
U 1 1 60A1DBE1
P 5200 4550
F 0 "#PWR0103" H 5200 4300 50  0001 C CNN
F 1 "GND" V 5205 4422 50  0000 R CNN
F 2 "" H 5200 4550 50  0001 C CNN
F 3 "" H 5200 4550 50  0001 C CNN
	1    5200 4550
	0    1    1    0   
$EndComp
$Comp
L power:GND #PWR0104
U 1 1 60A1E855
P 1750 2850
F 0 "#PWR0104" H 1750 2600 50  0001 C CNN
F 1 "GND" V 1755 2722 50  0000 R CNN
F 2 "" H 1750 2850 50  0001 C CNN
F 3 "" H 1750 2850 50  0001 C CNN
	1    1750 2850
	0    -1   -1   0   
$EndComp
$Comp
L power:GND #PWR0105
U 1 1 60A1FB3F
P 2850 1050
F 0 "#PWR0105" H 2850 800 50  0001 C CNN
F 1 "GND" V 2855 922 50  0000 R CNN
F 2 "" H 2850 1050 50  0001 C CNN
F 3 "" H 2850 1050 50  0001 C CNN
	1    2850 1050
	0    1    1    0   
$EndComp
$Comp
L power:VCC #PWR0106
U 1 1 60A202BD
P 2850 650
F 0 "#PWR0106" H 2850 500 50  0001 C CNN
F 1 "VCC" V 2865 777 50  0000 L CNN
F 2 "" H 2850 650 50  0001 C CNN
F 3 "" H 2850 650 50  0001 C CNN
	1    2850 650 
	0    -1   -1   0   
$EndComp
$Comp
L Device:C_Small C1
U 1 1 60A20792
P 2950 850
F 0 "C1" H 3042 896 50  0000 L CNN
F 1 "4.7uF" H 3042 805 50  0000 L CNN
F 2 "Capacitor_SMD:C_0603_1608Metric_Pad1.08x0.95mm_HandSolder" H 2950 850 50  0001 C CNN
F 3 "~" H 2950 850 50  0001 C CNN
	1    2950 850 
	1    0    0    -1  
$EndComp
$Comp
L Device:C_Small C2
U 1 1 60A21E89
P 3150 850
F 0 "C2" H 3242 896 50  0000 L CNN
F 1 "220nF" H 3242 805 50  0000 L CNN
F 2 "Capacitor_SMD:C_0603_1608Metric_Pad1.08x0.95mm_HandSolder" H 3150 850 50  0001 C CNN
F 3 "~" H 3150 850 50  0001 C CNN
	1    3150 850 
	1    0    0    -1  
$EndComp
$Comp
L Device:C_Small C4
U 1 1 60A22344
P 3350 850
F 0 "C4" H 3442 896 50  0000 L CNN
F 1 "220nF" H 3442 805 50  0000 L CNN
F 2 "Capacitor_SMD:C_0603_1608Metric_Pad1.08x0.95mm_HandSolder" H 3350 850 50  0001 C CNN
F 3 "~" H 3350 850 50  0001 C CNN
	1    3350 850 
	1    0    0    -1  
$EndComp
$Comp
L Device:C_Small C5
U 1 1 60A2271E
P 3550 850
F 0 "C5" H 3642 896 50  0000 L CNN
F 1 "220nF" H 3642 805 50  0000 L CNN
F 2 "Capacitor_SMD:C_0603_1608Metric_Pad1.08x0.95mm_HandSolder" H 3550 850 50  0001 C CNN
F 3 "~" H 3550 850 50  0001 C CNN
	1    3550 850 
	1    0    0    -1  
$EndComp
Wire Wire Line
	2850 650  2950 650 
Wire Wire Line
	3550 650  3550 750 
Wire Wire Line
	3550 950  3550 1050
Wire Wire Line
	3550 1050 3350 1050
Wire Wire Line
	2950 1050 2950 950 
Connection ~ 2950 1050
Wire Wire Line
	2950 1050 2850 1050
Wire Wire Line
	2950 750  2950 650 
Connection ~ 2950 650 
Wire Wire Line
	2950 650  3150 650 
Wire Wire Line
	3150 650  3150 750 
Connection ~ 3150 650 
Wire Wire Line
	3150 650  3350 650 
Wire Wire Line
	3150 950  3150 1050
Connection ~ 3150 1050
Wire Wire Line
	3150 1050 2950 1050
Wire Wire Line
	3350 950  3350 1050
Connection ~ 3350 1050
Wire Wire Line
	3350 1050 3150 1050
Wire Wire Line
	3350 750  3350 650 
Connection ~ 3350 650 
Wire Wire Line
	3350 650  3550 650 
Wire Wire Line
	2250 1250 2350 1250
Wire Wire Line
	2350 1250 2350 1150
Wire Wire Line
	2250 1750 2300 1750
Wire Wire Line
	2300 1750 2300 1800
Wire Wire Line
	2300 1800 2350 1800
Wire Wire Line
	2300 1800 2300 1850
Wire Wire Line
	2300 1850 2250 1850
Connection ~ 2300 1800
Wire Wire Line
	2250 1950 2300 1950
Wire Wire Line
	2300 1950 2300 2000
Wire Wire Line
	2300 2000 2350 2000
Wire Wire Line
	2300 2000 2300 2050
Wire Wire Line
	2300 2050 2250 2050
Connection ~ 2300 2000
Text Label 2350 1800 0    50   ~ 0
d-
Text Label 2350 2000 0    50   ~ 0
d+
Text Label 2700 2000 2    50   ~ 0
d+
Text Label 2700 1800 2    50   ~ 0
d-
Text Label 3000 1800 0    50   ~ 0
D-
Text Label 3000 2000 0    50   ~ 0
D+
Wire Wire Line
	3000 2000 2950 2000
Wire Wire Line
	2950 1800 3000 1800
Wire Wire Line
	2750 1800 2700 1800
Wire Wire Line
	2700 2000 2750 2000
Wire Wire Line
	5300 850  5300 750 
Wire Wire Line
	5300 750  5400 750 
Wire Wire Line
	5400 850  5400 750 
Connection ~ 5400 750 
Wire Wire Line
	5400 750  5500 750 
Wire Wire Line
	5500 850  5500 750 
Connection ~ 5500 750 
Wire Wire Line
	5500 750  5600 750 
Wire Wire Line
	4800 2450 4700 2450
Wire Wire Line
	4700 2450 4700 2550
$Comp
L power:VCC #PWR0107
U 1 1 60A30819
P 4700 1850
F 0 "#PWR0107" H 4700 1700 50  0001 C CNN
F 1 "VCC" V 4715 1977 50  0000 L CNN
F 2 "" H 4700 1850 50  0001 C CNN
F 3 "" H 4700 1850 50  0001 C CNN
	1    4700 1850
	0    -1   -1   0   
$EndComp
$Comp
L power:GND #PWR0108
U 1 1 60A30D95
P 4700 2850
F 0 "#PWR0108" H 4700 2600 50  0001 C CNN
F 1 "GND" H 4705 2677 50  0000 C CNN
F 2 "" H 4700 2850 50  0001 C CNN
F 3 "" H 4700 2850 50  0001 C CNN
	1    4700 2850
	1    0    0    -1  
$EndComp
Wire Wire Line
	4700 2850 4700 2750
Wire Wire Line
	4700 1950 4800 1950
Text Label 4750 2150 2    50   ~ 0
D+
Text Label 4750 2250 2    50   ~ 0
D-
Wire Wire Line
	4800 2150 4750 2150
Wire Wire Line
	4750 2250 4800 2250
Wire Wire Line
	5400 4450 5400 4550
Wire Wire Line
	5400 4550 5300 4550
Wire Wire Line
	5300 4450 5300 4550
Connection ~ 5300 4550
Wire Wire Line
	5300 4550 5200 4550
Wire Wire Line
	1650 2750 1650 2850
Wire Wire Line
	1650 2850 1750 2850
$Comp
L power:GND #PWR0109
U 1 1 60A38961
P 2650 1500
F 0 "#PWR0109" H 2650 1250 50  0001 C CNN
F 1 "GND" V 2655 1372 50  0000 R CNN
F 2 "" H 2650 1500 50  0001 C CNN
F 3 "" H 2650 1500 50  0001 C CNN
	1    2650 1500
	0    -1   -1   0   
$EndComp
Wire Wire Line
	2250 1550 2350 1550
Wire Wire Line
	2350 1450 2250 1450
Wire Wire Line
	2550 1450 2600 1450
Wire Wire Line
	2600 1450 2600 1500
Wire Wire Line
	2600 1500 2650 1500
Wire Wire Line
	2600 1500 2600 1550
Wire Wire Line
	2600 1550 2550 1550
Connection ~ 2600 1500
Wire Wire Line
	4700 1950 4700 1850
Wire Wire Line
	4700 1850 4700 1750
Wire Wire Line
	4700 1750 4800 1750
Connection ~ 4700 1850
$Comp
L Device:R_Small R5
U 1 1 60A441E0
P 6300 3150
F 0 "R5" V 6496 3150 50  0000 C CNN
F 1 "10K" V 6405 3150 50  0000 C CNN
F 2 "Resistor_SMD:R_0603_1608Metric_Pad0.98x0.95mm_HandSolder" H 6300 3150 50  0001 C CNN
F 3 "~" H 6300 3150 50  0001 C CNN
	1    6300 3150
	0    -1   -1   0   
$EndComp
$Comp
L power:VCC #PWR0110
U 1 1 60A4FB9A
P 6500 3150
F 0 "#PWR0110" H 6500 3000 50  0001 C CNN
F 1 "VCC" V 6515 3278 50  0000 L CNN
F 2 "" H 6500 3150 50  0001 C CNN
F 3 "" H 6500 3150 50  0001 C CNN
	1    6500 3150
	0    1    1    0   
$EndComp
Wire Wire Line
	6000 3250 6100 3250
Wire Wire Line
	6100 3250 6100 3150
Wire Wire Line
	6400 3150 6500 3150
Wire Wire Line
	6100 3150 6200 3150
$Comp
L Device:C_Small C3
U 1 1 60A5709C
P 3650 1800
F 0 "C3" V 3879 1800 50  0000 C CNN
F 1 "22pF" V 3788 1800 50  0000 C CNN
F 2 "Capacitor_SMD:C_0603_1608Metric_Pad1.08x0.95mm_HandSolder" H 3650 1800 50  0001 C CNN
F 3 "~" H 3650 1800 50  0001 C CNN
	1    3650 1800
	0    -1   -1   0   
$EndComp
$Comp
L Device:C_Small C6
U 1 1 60A5E0C9
P 4050 1400
F 0 "C6" V 3821 1400 50  0000 C CNN
F 1 "22pF" V 3912 1400 50  0000 C CNN
F 2 "Capacitor_SMD:C_0603_1608Metric_Pad1.08x0.95mm_HandSolder" H 4050 1400 50  0001 C CNN
F 3 "~" H 4050 1400 50  0001 C CNN
	1    4050 1400
	0    1    1    0   
$EndComp
$Comp
L power:GND #PWR0111
U 1 1 60A5E74D
P 3750 1400
F 0 "#PWR0111" H 3750 1150 50  0001 C CNN
F 1 "GND" V 3755 1272 50  0000 R CNN
F 2 "" H 3750 1400 50  0001 C CNN
F 3 "" H 3750 1400 50  0001 C CNN
	1    3750 1400
	0    1    1    0   
$EndComp
$Comp
L power:GND #PWR0112
U 1 1 60A5EBEB
P 3950 1800
F 0 "#PWR0112" H 3950 1550 50  0001 C CNN
F 1 "GND" V 3955 1672 50  0000 R CNN
F 2 "" H 3950 1800 50  0001 C CNN
F 3 "" H 3950 1800 50  0001 C CNN
	1    3950 1800
	0    -1   -1   0   
$EndComp
Wire Wire Line
	3950 1600 4250 1600
Wire Wire Line
	4250 1600 4250 1400
Wire Wire Line
	4250 1400 4150 1400
Wire Wire Line
	3950 1400 3850 1400
Wire Wire Line
	3850 1500 3850 1400
Connection ~ 3850 1400
Wire Wire Line
	3850 1400 3750 1400
Wire Wire Line
	3750 1600 3450 1600
Wire Wire Line
	3450 1600 3450 1800
Wire Wire Line
	3450 1800 3550 1800
Wire Wire Line
	3750 1800 3850 1800
Wire Wire Line
	3850 1700 3850 1800
Connection ~ 3850 1800
Wire Wire Line
	3850 1800 3950 1800
Text Label 3350 1600 2    50   ~ 0
x+
Text Label 4350 1600 0    50   ~ 0
x-
Wire Wire Line
	3450 1600 3350 1600
Connection ~ 3450 1600
Wire Wire Line
	4350 1600 4250 1600
Connection ~ 4250 1600
Text Label 4700 1350 2    50   ~ 0
x+
Text Label 4700 1550 2    50   ~ 0
x-
Wire Wire Line
	4700 1350 4800 1350
Wire Wire Line
	4800 1550 4700 1550
$Comp
L Switch:SW_Push SW1
U 1 1 60A790D6
P 1250 5150
F 0 "SW1" H 1250 5435 50  0000 C CNN
F 1 "SW_Push" H 1250 5344 50  0000 C CNN
F 2 "project_specific_footprints:MX-hotswap" H 1250 5350 50  0001 C CNN
F 3 "~" H 1250 5350 50  0001 C CNN
	1    1250 5150
	1    0    0    -1  
$EndComp
$Comp
L power:GND #PWR0113
U 1 1 60A7A84E
P 950 5050
F 0 "#PWR0113" H 950 4800 50  0001 C CNN
F 1 "GND" H 955 4877 50  0000 C CNN
F 2 "" H 950 5050 50  0001 C CNN
F 3 "" H 950 5050 50  0001 C CNN
	1    950  5050
	-1   0    0    1   
$EndComp
Wire Wire Line
	1050 5150 950  5150
Wire Wire Line
	950  5150 950  5050
$Comp
L Switch:SW_Push SW2
U 1 1 60A7D9F9
P 1250 5650
F 0 "SW2" H 1250 5935 50  0000 C CNN
F 1 "SW_Push" H 1250 5844 50  0000 C CNN
F 2 "project_specific_footprints:MX-hotswap" H 1250 5850 50  0001 C CNN
F 3 "~" H 1250 5850 50  0001 C CNN
	1    1250 5650
	1    0    0    -1  
$EndComp
$Comp
L power:GND #PWR0114
U 1 1 60A7D9FF
P 950 5550
F 0 "#PWR0114" H 950 5300 50  0001 C CNN
F 1 "GND" H 955 5377 50  0000 C CNN
F 2 "" H 950 5550 50  0001 C CNN
F 3 "" H 950 5550 50  0001 C CNN
	1    950  5550
	-1   0    0    1   
$EndComp
Wire Wire Line
	1050 5650 950  5650
Wire Wire Line
	950  5650 950  5550
$Comp
L Switch:SW_Push SW3
U 1 1 60A8484B
P 2250 5150
F 0 "SW3" H 2250 5435 50  0000 C CNN
F 1 "SW_Push" H 2250 5344 50  0000 C CNN
F 2 "project_specific_footprints:MX-hotswap" H 2250 5350 50  0001 C CNN
F 3 "~" H 2250 5350 50  0001 C CNN
	1    2250 5150
	1    0    0    -1  
$EndComp
$Comp
L power:GND #PWR0115
U 1 1 60A84851
P 1950 5050
F 0 "#PWR0115" H 1950 4800 50  0001 C CNN
F 1 "GND" H 1955 4877 50  0000 C CNN
F 2 "" H 1950 5050 50  0001 C CNN
F 3 "" H 1950 5050 50  0001 C CNN
	1    1950 5050
	-1   0    0    1   
$EndComp
Wire Wire Line
	2050 5150 1950 5150
Wire Wire Line
	1950 5150 1950 5050
$Comp
L Switch:SW_Push SW4
U 1 1 60A84859
P 2250 5650
F 0 "SW4" H 2250 5935 50  0000 C CNN
F 1 "SW_Push" H 2250 5844 50  0000 C CNN
F 2 "project_specific_footprints:MX-hotswap" H 2250 5850 50  0001 C CNN
F 3 "~" H 2250 5850 50  0001 C CNN
	1    2250 5650
	1    0    0    -1  
$EndComp
$Comp
L power:GND #PWR0116
U 1 1 60A8485F
P 1950 5550
F 0 "#PWR0116" H 1950 5300 50  0001 C CNN
F 1 "GND" H 1955 5377 50  0000 C CNN
F 2 "" H 1950 5550 50  0001 C CNN
F 3 "" H 1950 5550 50  0001 C CNN
	1    1950 5550
	-1   0    0    1   
$EndComp
Wire Wire Line
	2050 5650 1950 5650
Wire Wire Line
	1950 5650 1950 5550
$Comp
L Switch:SW_Push SW5
U 1 1 60A8B96C
P 3250 5150
F 0 "SW5" H 3250 5435 50  0000 C CNN
F 1 "SW_Push" H 3250 5344 50  0000 C CNN
F 2 "project_specific_footprints:MX-hotswap" H 3250 5350 50  0001 C CNN
F 3 "~" H 3250 5350 50  0001 C CNN
	1    3250 5150
	1    0    0    -1  
$EndComp
$Comp
L power:GND #PWR0117
U 1 1 60A8B972
P 2950 5050
F 0 "#PWR0117" H 2950 4800 50  0001 C CNN
F 1 "GND" H 2955 4877 50  0000 C CNN
F 2 "" H 2950 5050 50  0001 C CNN
F 3 "" H 2950 5050 50  0001 C CNN
	1    2950 5050
	-1   0    0    1   
$EndComp
Wire Wire Line
	3050 5150 2950 5150
Wire Wire Line
	2950 5150 2950 5050
$Comp
L Switch:SW_Push SW6
U 1 1 60A8B97A
P 3250 5650
F 0 "SW6" H 3250 5935 50  0000 C CNN
F 1 "SW_Push" H 3250 5844 50  0000 C CNN
F 2 "project_specific_footprints:MX-hotswap" H 3250 5850 50  0001 C CNN
F 3 "~" H 3250 5850 50  0001 C CNN
	1    3250 5650
	1    0    0    -1  
$EndComp
$Comp
L power:GND #PWR0118
U 1 1 60A8B980
P 2950 5550
F 0 "#PWR0118" H 2950 5300 50  0001 C CNN
F 1 "GND" H 2955 5377 50  0000 C CNN
F 2 "" H 2950 5550 50  0001 C CNN
F 3 "" H 2950 5550 50  0001 C CNN
	1    2950 5550
	-1   0    0    1   
$EndComp
Wire Wire Line
	3050 5650 2950 5650
Wire Wire Line
	2950 5650 2950 5550
$Comp
L Switch:SW_Push SW8
U 1 1 60A8B988
P 4250 5150
F 0 "SW8" H 4250 5435 50  0000 C CNN
F 1 "SW_Push" H 4250 5344 50  0000 C CNN
F 2 "project_specific_footprints:MX-hotswap" H 4250 5350 50  0001 C CNN
F 3 "~" H 4250 5350 50  0001 C CNN
	1    4250 5150
	-1   0    0    1   
$EndComp
$Comp
L power:GND #PWR0119
U 1 1 60A8B98E
P 3950 5050
F 0 "#PWR0119" H 3950 4800 50  0001 C CNN
F 1 "GND" H 3955 4877 50  0000 C CNN
F 2 "" H 3950 5050 50  0001 C CNN
F 3 "" H 3950 5050 50  0001 C CNN
	1    3950 5050
	-1   0    0    1   
$EndComp
Wire Wire Line
	4050 5150 3950 5150
Wire Wire Line
	3950 5150 3950 5050
$Comp
L Switch:SW_Push SW9
U 1 1 60A8B996
P 4250 5650
F 0 "SW9" H 4250 5935 50  0000 C CNN
F 1 "SW_Push" H 4250 5844 50  0000 C CNN
F 2 "project_specific_footprints:MX-hotswap" H 4250 5850 50  0001 C CNN
F 3 "~" H 4250 5850 50  0001 C CNN
	1    4250 5650
	1    0    0    -1  
$EndComp
$Comp
L power:GND #PWR0120
U 1 1 60A8B99C
P 3950 5550
F 0 "#PWR0120" H 3950 5300 50  0001 C CNN
F 1 "GND" H 3955 5377 50  0000 C CNN
F 2 "" H 3950 5550 50  0001 C CNN
F 3 "" H 3950 5550 50  0001 C CNN
	1    3950 5550
	-1   0    0    1   
$EndComp
Wire Wire Line
	4050 5650 3950 5650
Wire Wire Line
	3950 5650 3950 5550
$Comp
L Switch:SW_Push SW11
U 1 1 60A988CD
P 5250 5400
F 0 "SW11" H 5250 5685 50  0000 C CNN
F 1 "SW_Push" H 5250 5594 50  0000 C CNN
F 2 "project_specific_footprints:MX-hotswap-2U" H 5250 5600 50  0001 C CNN
F 3 "~" H 5250 5600 50  0001 C CNN
	1    5250 5400
	1    0    0    -1  
$EndComp
$Comp
L power:GND #PWR0122
U 1 1 60A988D3
P 4950 5300
F 0 "#PWR0122" H 4950 5050 50  0001 C CNN
F 1 "GND" H 4955 5127 50  0000 C CNN
F 2 "" H 4950 5300 50  0001 C CNN
F 3 "" H 4950 5300 50  0001 C CNN
	1    4950 5300
	-1   0    0    1   
$EndComp
Wire Wire Line
	5050 5400 4950 5400
Wire Wire Line
	4950 5400 4950 5300
$Comp
L Switch:SW_Push SW13
U 1 1 60A988DB
P 6250 5150
F 0 "SW13" H 6250 5435 50  0000 C CNN
F 1 "SW_Push" H 6250 5344 50  0000 C CNN
F 2 "project_specific_footprints:MX-hotswap" H 6250 5350 50  0001 C CNN
F 3 "~" H 6250 5350 50  0001 C CNN
	1    6250 5150
	1    0    0    -1  
$EndComp
$Comp
L power:GND #PWR0123
U 1 1 60A988E1
P 5950 5050
F 0 "#PWR0123" H 5950 4800 50  0001 C CNN
F 1 "GND" H 5955 4877 50  0000 C CNN
F 2 "" H 5950 5050 50  0001 C CNN
F 3 "" H 5950 5050 50  0001 C CNN
	1    5950 5050
	-1   0    0    1   
$EndComp
Wire Wire Line
	6050 5150 5950 5150
Wire Wire Line
	5950 5150 5950 5050
$Comp
L Switch:SW_Push SW14
U 1 1 60A988E9
P 6250 5650
F 0 "SW14" H 6250 5935 50  0000 C CNN
F 1 "SW_Push" H 6250 5844 50  0000 C CNN
F 2 "project_specific_footprints:MX-hotswap" H 6250 5850 50  0001 C CNN
F 3 "~" H 6250 5850 50  0001 C CNN
	1    6250 5650
	-1   0    0    1   
$EndComp
$Comp
L power:GND #PWR0124
U 1 1 60A988EF
P 5950 5550
F 0 "#PWR0124" H 5950 5300 50  0001 C CNN
F 1 "GND" H 5955 5377 50  0000 C CNN
F 2 "" H 5950 5550 50  0001 C CNN
F 3 "" H 5950 5550 50  0001 C CNN
	1    5950 5550
	-1   0    0    1   
$EndComp
Wire Wire Line
	6050 5650 5950 5650
Wire Wire Line
	5950 5650 5950 5550
$Comp
L Switch:SW_Push SW16
U 1 1 60A988F7
P 7250 5150
F 0 "SW16" H 7250 5435 50  0000 C CNN
F 1 "SW_Push" H 7250 5344 50  0000 C CNN
F 2 "project_specific_footprints:MX-hotswap" H 7250 5350 50  0001 C CNN
F 3 "~" H 7250 5350 50  0001 C CNN
	1    7250 5150
	1    0    0    -1  
$EndComp
$Comp
L power:GND #PWR0125
U 1 1 60A988FD
P 6950 5050
F 0 "#PWR0125" H 6950 4800 50  0001 C CNN
F 1 "GND" H 6955 4877 50  0000 C CNN
F 2 "" H 6950 5050 50  0001 C CNN
F 3 "" H 6950 5050 50  0001 C CNN
	1    6950 5050
	-1   0    0    1   
$EndComp
Wire Wire Line
	7050 5150 6950 5150
Wire Wire Line
	6950 5150 6950 5050
$Comp
L Switch:SW_Push SW17
U 1 1 60A98905
P 7250 5650
F 0 "SW17" H 7250 5935 50  0000 C CNN
F 1 "SW_Push" H 7250 5844 50  0000 C CNN
F 2 "project_specific_footprints:MX-hotswap" H 7250 5850 50  0001 C CNN
F 3 "~" H 7250 5850 50  0001 C CNN
	1    7250 5650
	-1   0    0    1   
$EndComp
$Comp
L power:GND #PWR0126
U 1 1 60A9890B
P 6950 5550
F 0 "#PWR0126" H 6950 5300 50  0001 C CNN
F 1 "GND" H 6955 5377 50  0000 C CNN
F 2 "" H 6950 5550 50  0001 C CNN
F 3 "" H 6950 5550 50  0001 C CNN
	1    6950 5550
	-1   0    0    1   
$EndComp
Wire Wire Line
	7050 5650 6950 5650
Wire Wire Line
	6950 5650 6950 5550
$Comp
L Switch:SW_Push SW18
U 1 1 60A98913
P 8250 5150
F 0 "SW18" H 8250 5435 50  0000 C CNN
F 1 "SW_Push" H 8250 5344 50  0000 C CNN
F 2 "project_specific_footprints:MX-hotswap" H 8250 5350 50  0001 C CNN
F 3 "~" H 8250 5350 50  0001 C CNN
	1    8250 5150
	1    0    0    -1  
$EndComp
$Comp
L power:GND #PWR0127
U 1 1 60A98919
P 7950 5050
F 0 "#PWR0127" H 7950 4800 50  0001 C CNN
F 1 "GND" H 7955 4877 50  0000 C CNN
F 2 "" H 7950 5050 50  0001 C CNN
F 3 "" H 7950 5050 50  0001 C CNN
	1    7950 5050
	-1   0    0    1   
$EndComp
Wire Wire Line
	8050 5150 7950 5150
Wire Wire Line
	7950 5150 7950 5050
$Comp
L Switch:SW_Push SW19
U 1 1 60A98921
P 8250 5650
F 0 "SW19" H 8250 5935 50  0000 C CNN
F 1 "SW_Push" H 8250 5844 50  0000 C CNN
F 2 "project_specific_footprints:MX-hotswap" H 8250 5850 50  0001 C CNN
F 3 "~" H 8250 5850 50  0001 C CNN
	1    8250 5650
	-1   0    0    1   
$EndComp
$Comp
L power:GND #PWR0128
U 1 1 60A98927
P 7950 5550
F 0 "#PWR0128" H 7950 5300 50  0001 C CNN
F 1 "GND" H 7955 5377 50  0000 C CNN
F 2 "" H 7950 5550 50  0001 C CNN
F 3 "" H 7950 5550 50  0001 C CNN
	1    7950 5550
	-1   0    0    1   
$EndComp
Wire Wire Line
	8050 5650 7950 5650
Wire Wire Line
	7950 5650 7950 5550
$Comp
L Switch:SW_Push SW20
U 1 1 60AA31B6
P 9250 5150
F 0 "SW20" H 9250 5435 50  0000 C CNN
F 1 "SW_Push" H 9250 5344 50  0000 C CNN
F 2 "project_specific_footprints:MX-hotswap" H 9250 5350 50  0001 C CNN
F 3 "~" H 9250 5350 50  0001 C CNN
	1    9250 5150
	1    0    0    -1  
$EndComp
$Comp
L power:GND #PWR0129
U 1 1 60AA31BC
P 8950 5050
F 0 "#PWR0129" H 8950 4800 50  0001 C CNN
F 1 "GND" H 8955 4877 50  0000 C CNN
F 2 "" H 8950 5050 50  0001 C CNN
F 3 "" H 8950 5050 50  0001 C CNN
	1    8950 5050
	-1   0    0    1   
$EndComp
Wire Wire Line
	9050 5150 8950 5150
Wire Wire Line
	8950 5150 8950 5050
$Comp
L Switch:SW_Push SW21
U 1 1 60AA31C4
P 9250 5650
F 0 "SW21" H 9250 5935 50  0000 C CNN
F 1 "SW_Push" H 9250 5844 50  0000 C CNN
F 2 "project_specific_footprints:MX-hotswap" H 9250 5850 50  0001 C CNN
F 3 "~" H 9250 5850 50  0001 C CNN
	1    9250 5650
	-1   0    0    1   
$EndComp
$Comp
L power:GND #PWR0130
U 1 1 60AA31CA
P 8950 5550
F 0 "#PWR0130" H 8950 5300 50  0001 C CNN
F 1 "GND" H 8955 5377 50  0000 C CNN
F 2 "" H 8950 5550 50  0001 C CNN
F 3 "" H 8950 5550 50  0001 C CNN
	1    8950 5550
	-1   0    0    1   
$EndComp
Wire Wire Line
	9050 5650 8950 5650
Wire Wire Line
	8950 5650 8950 5550
$Comp
L Switch:SW_Push SW22
U 1 1 60AA31D2
P 10250 5150
F 0 "SW22" H 10250 5435 50  0000 C CNN
F 1 "SW_Push" H 10250 5344 50  0000 C CNN
F 2 "project_specific_footprints:MX-hotswap" H 10250 5350 50  0001 C CNN
F 3 "~" H 10250 5350 50  0001 C CNN
	1    10250 5150
	1    0    0    -1  
$EndComp
$Comp
L power:GND #PWR0131
U 1 1 60AA31D8
P 9950 5050
F 0 "#PWR0131" H 9950 4800 50  0001 C CNN
F 1 "GND" H 9955 4877 50  0000 C CNN
F 2 "" H 9950 5050 50  0001 C CNN
F 3 "" H 9950 5050 50  0001 C CNN
	1    9950 5050
	-1   0    0    1   
$EndComp
Wire Wire Line
	10050 5150 9950 5150
Wire Wire Line
	9950 5150 9950 5050
$Comp
L Switch:SW_Push SW23
U 1 1 60AA31E0
P 10250 5650
F 0 "SW23" H 10250 5935 50  0000 C CNN
F 1 "SW_Push" H 10250 5844 50  0000 C CNN
F 2 "project_specific_footprints:MX-hotswap" H 10250 5850 50  0001 C CNN
F 3 "~" H 10250 5850 50  0001 C CNN
	1    10250 5650
	-1   0    0    1   
$EndComp
$Comp
L power:GND #PWR0132
U 1 1 60AA31E6
P 9950 5550
F 0 "#PWR0132" H 9950 5300 50  0001 C CNN
F 1 "GND" H 9955 5377 50  0000 C CNN
F 2 "" H 9950 5550 50  0001 C CNN
F 3 "" H 9950 5550 50  0001 C CNN
	1    9950 5550
	-1   0    0    1   
$EndComp
Wire Wire Line
	10050 5650 9950 5650
Wire Wire Line
	9950 5650 9950 5550
$Comp
L Switch:SW_Push SW7
U 1 1 60AC1252
P 3750 6150
F 0 "SW7" H 3750 6435 50  0000 C CNN
F 1 "SW_Push" H 3750 6344 50  0000 C CNN
F 2 "project_specific_footprints:MX-hotswap" H 3750 6350 50  0001 C CNN
F 3 "~" H 3750 6350 50  0001 C CNN
	1    3750 6150
	1    0    0    -1  
$EndComp
$Comp
L power:GND #PWR0133
U 1 1 60AC1258
P 3450 6050
F 0 "#PWR0133" H 3450 5800 50  0001 C CNN
F 1 "GND" H 3455 5877 50  0000 C CNN
F 2 "" H 3450 6050 50  0001 C CNN
F 3 "" H 3450 6050 50  0001 C CNN
	1    3450 6050
	-1   0    0    1   
$EndComp
Wire Wire Line
	3550 6150 3450 6150
Wire Wire Line
	3450 6150 3450 6050
$Comp
L Switch:SW_Push SW10
U 1 1 60AC126E
P 4750 6150
F 0 "SW10" H 4750 6435 50  0000 C CNN
F 1 "SW_Push" H 4750 6344 50  0000 C CNN
F 2 "project_specific_footprints:MX-hotswap" H 4750 6350 50  0001 C CNN
F 3 "~" H 4750 6350 50  0001 C CNN
	1    4750 6150
	1    0    0    -1  
$EndComp
$Comp
L power:GND #PWR0134
U 1 1 60AC1274
P 4450 6050
F 0 "#PWR0134" H 4450 5800 50  0001 C CNN
F 1 "GND" H 4455 5877 50  0000 C CNN
F 2 "" H 4450 6050 50  0001 C CNN
F 3 "" H 4450 6050 50  0001 C CNN
	1    4450 6050
	-1   0    0    1   
$EndComp
Wire Wire Line
	4550 6150 4450 6150
Wire Wire Line
	4450 6150 4450 6050
$Comp
L Switch:SW_Push SW12
U 1 1 60AC128A
P 5750 6150
F 0 "SW12" H 5750 6435 50  0000 C CNN
F 1 "SW_Push" H 5750 6344 50  0000 C CNN
F 2 "project_specific_footprints:MX-hotswap" H 5750 6350 50  0001 C CNN
F 3 "~" H 5750 6350 50  0001 C CNN
	1    5750 6150
	-1   0    0    1   
$EndComp
$Comp
L power:GND #PWR0135
U 1 1 60AC1290
P 5450 6050
F 0 "#PWR0135" H 5450 5800 50  0001 C CNN
F 1 "GND" H 5455 5877 50  0000 C CNN
F 2 "" H 5450 6050 50  0001 C CNN
F 3 "" H 5450 6050 50  0001 C CNN
	1    5450 6050
	-1   0    0    1   
$EndComp
Wire Wire Line
	5550 6150 5450 6150
Wire Wire Line
	5450 6150 5450 6050
$Comp
L Switch:SW_Push SW15
U 1 1 60AC12A6
P 6750 6150
F 0 "SW15" H 6750 6435 50  0000 C CNN
F 1 "SW_Push" H 6750 6344 50  0000 C CNN
F 2 "project_specific_footprints:MX-hotswap" H 6750 6350 50  0001 C CNN
F 3 "~" H 6750 6350 50  0001 C CNN
	1    6750 6150
	1    0    0    -1  
$EndComp
$Comp
L power:GND #PWR0136
U 1 1 60AC12AC
P 6450 6050
F 0 "#PWR0136" H 6450 5800 50  0001 C CNN
F 1 "GND" H 6455 5877 50  0000 C CNN
F 2 "" H 6450 6050 50  0001 C CNN
F 3 "" H 6450 6050 50  0001 C CNN
	1    6450 6050
	-1   0    0    1   
$EndComp
Wire Wire Line
	6550 6150 6450 6150
Wire Wire Line
	6450 6150 6450 6050
Text Label 1550 5050 0    50   ~ 0
#
Text Label 1550 5550 0    50   ~ 0
s
Wire Wire Line
	1550 5550 1550 5650
Wire Wire Line
	1550 5650 1450 5650
Wire Wire Line
	1450 5150 1550 5150
Wire Wire Line
	1550 5150 1550 5050
$Comp
L Device:C_Small C8
U 1 1 60AF129B
P 3750 850
F 0 "C8" H 3842 896 50  0000 L CNN
F 1 "220nF" H 3842 805 50  0000 L CNN
F 2 "Capacitor_SMD:C_0603_1608Metric_Pad1.08x0.95mm_HandSolder" H 3750 850 50  0001 C CNN
F 3 "~" H 3750 850 50  0001 C CNN
	1    3750 850 
	1    0    0    -1  
$EndComp
$Comp
L Device:C_Small C9
U 1 1 60AF12A1
P 3950 850
F 0 "C9" H 4042 896 50  0000 L CNN
F 1 "220nF" H 4042 805 50  0000 L CNN
F 2 "Capacitor_SMD:C_0603_1608Metric_Pad1.08x0.95mm_HandSolder" H 3950 850 50  0001 C CNN
F 3 "~" H 3950 850 50  0001 C CNN
	1    3950 850 
	1    0    0    -1  
$EndComp
Wire Wire Line
	3950 650  3950 750 
Wire Wire Line
	3950 950  3950 1050
Wire Wire Line
	3950 1050 3750 1050
Wire Wire Line
	3550 650  3750 650 
Wire Wire Line
	3750 950  3750 1050
Connection ~ 3750 1050
Wire Wire Line
	3750 1050 3550 1050
Wire Wire Line
	3750 750  3750 650 
Connection ~ 3750 650 
Wire Wire Line
	3750 650  3950 650 
$Comp
L Device:C_Small C10
U 1 1 60AF6E58
P 4150 850
F 0 "C10" H 4242 896 50  0000 L CNN
F 1 "220nF" H 4242 805 50  0000 L CNN
F 2 "Capacitor_SMD:C_0603_1608Metric_Pad1.08x0.95mm_HandSolder" H 4150 850 50  0001 C CNN
F 3 "~" H 4150 850 50  0001 C CNN
	1    4150 850 
	1    0    0    -1  
$EndComp
Wire Wire Line
	3950 650  4150 650 
Wire Wire Line
	4150 950  4150 1050
Wire Wire Line
	4150 1050 3950 1050
Wire Wire Line
	4150 750  4150 650 
Text Label 6100 1250 0    50   ~ 0
#
Text Label 6100 3350 0    50   ~ 0
s
Wire Wire Line
	6100 1250 6000 1250
Wire Wire Line
	6000 3350 6100 3350
Text Label 2550 5050 0    50   ~ 0
t
Text Label 2550 5550 0    50   ~ 0
k
Text Label 3550 5050 0    50   ~ 0
p
Text Label 3550 5550 0    50   ~ 0
w
Text Label 4550 5050 0    50   ~ 0
h
Text Label 4550 5550 0    50   ~ 0
r
Text Label 4050 6050 0    50   ~ 0
a
Text Label 6050 6050 0    50   ~ 0
e
Text Label 5050 6050 0    50   ~ 0
o
Text Label 7050 6050 0    50   ~ 0
u
Text Label 5550 5300 0    50   ~ 0
*
Text Label 6550 5550 0    50   ~ 0
-r
Text Label 6550 5050 0    50   ~ 0
-f
Text Label 7550 5050 0    50   ~ 0
-p
Text Label 7550 5550 0    50   ~ 0
-b
Text Label 8550 5050 0    50   ~ 0
-l
Text Label 8550 5550 0    50   ~ 0
-g
Text Label 9550 5050 0    50   ~ 0
-t
Text Label 9550 5550 0    50   ~ 0
-s
Text Label 10550 5050 0    50   ~ 0
-d
Text Label 10550 5550 0    50   ~ 0
-z
Wire Wire Line
	2550 5050 2550 5150
Wire Wire Line
	2550 5150 2450 5150
Wire Wire Line
	2550 5550 2550 5650
Wire Wire Line
	2550 5650 2450 5650
Wire Wire Line
	3550 5050 3550 5150
Wire Wire Line
	3550 5150 3450 5150
Wire Wire Line
	3550 5550 3550 5650
Wire Wire Line
	3550 5650 3450 5650
Wire Wire Line
	4550 5150 4450 5150
Wire Wire Line
	4550 5550 4550 5650
Wire Wire Line
	4550 5650 4450 5650
Wire Wire Line
	3950 6150 4050 6150
Wire Wire Line
	4050 6050 4050 6150
Wire Wire Line
	5050 6050 5050 6150
Wire Wire Line
	5050 6150 4950 6150
Wire Wire Line
	5450 5400 5550 5400
Wire Wire Line
	5550 5400 5550 5300
Wire Wire Line
	6050 6050 6050 6150
Wire Wire Line
	6050 6150 5950 6150
Wire Wire Line
	6550 5050 6550 5150
Wire Wire Line
	6550 5150 6450 5150
Wire Wire Line
	6550 5550 6550 5650
Wire Wire Line
	6550 5650 6450 5650
Wire Wire Line
	7050 6050 7050 6150
Wire Wire Line
	7050 6150 6950 6150
Wire Wire Line
	7550 5050 7550 5150
Wire Wire Line
	7550 5150 7450 5150
Wire Wire Line
	7550 5550 7550 5650
Wire Wire Line
	7550 5650 7450 5650
Wire Wire Line
	8550 5050 8550 5150
Wire Wire Line
	8550 5150 8450 5150
Wire Wire Line
	8550 5550 8550 5650
Wire Wire Line
	8550 5650 8450 5650
Wire Wire Line
	9550 5050 9550 5150
Wire Wire Line
	9550 5150 9450 5150
Wire Wire Line
	9550 5550 9550 5650
Wire Wire Line
	9550 5650 9450 5650
Wire Wire Line
	10550 5050 10550 5150
Wire Wire Line
	10550 5150 10450 5150
Wire Wire Line
	10550 5550 10550 5650
Wire Wire Line
	10550 5650 10450 5650
Text Label 6100 1350 0    50   ~ 0
t
Wire Wire Line
	6100 1350 6000 1350
Text Label 6100 1450 0    50   ~ 0
p
Wire Wire Line
	6100 1450 6000 1450
Wire Wire Line
	4550 5050 4550 5150
Text Label 6100 1850 0    50   ~ 0
h
Wire Wire Line
	6000 1850 6100 1850
Text Label 6100 3550 0    50   ~ 0
k
Text Label 6100 3650 0    50   ~ 0
w
Wire Wire Line
	6100 3550 6000 3550
Wire Wire Line
	6000 3650 6100 3650
Text Label 6100 3750 0    50   ~ 0
a
Text Label 6100 3850 0    50   ~ 0
o
Text Label 6100 3950 0    50   ~ 0
e
Text Label 6100 4050 0    50   ~ 0
u
Wire Wire Line
	6000 3750 6100 3750
Wire Wire Line
	6000 3950 6100 3950
Wire Wire Line
	6100 4050 6000 4050
Wire Wire Line
	6000 3850 6100 3850
Text Label 6200 3250 0    50   ~ 0
r
Wire Wire Line
	6200 3250 6100 3250
Connection ~ 6100 3250
Text Label 6100 2750 0    50   ~ 0
*
Wire Wire Line
	6100 2750 6000 2750
Text Label 6100 2950 0    50   ~ 0
-r
Wire Wire Line
	6100 2950 6000 2950
Text Label 6100 3050 0    50   ~ 0
-b
Text Label 6100 1550 0    50   ~ 0
-g
Text Label 6100 1650 0    50   ~ 0
-s
Text Label 6100 1750 0    50   ~ 0
-z
Wire Wire Line
	6000 1550 6100 1550
Wire Wire Line
	6100 1650 6000 1650
Wire Wire Line
	6000 1750 6100 1750
Wire Wire Line
	6000 3050 6100 3050
Text Label 6100 2850 0    50   ~ 0
-d
Text Label 6100 2650 0    50   ~ 0
-t
Wire Wire Line
	6100 2650 6000 2650
Wire Wire Line
	6000 2850 6100 2850
Text Label 6100 2550 0    50   ~ 0
-f
Text Label 6100 2450 0    50   ~ 0
-p
Text Label 6100 2350 0    50   ~ 0
-l
Wire Wire Line
	6100 2350 6000 2350
Wire Wire Line
	6000 2450 6100 2450
Wire Wire Line
	6100 2550 6000 2550
Wire Wire Line
	1350 2750 1350 2850
Wire Wire Line
	1350 2850 1650 2850
Connection ~ 1650 2850
$Comp
L Device:C_Small C11
U 1 1 60E333F7
P 4350 850
F 0 "C11" H 4442 896 50  0000 L CNN
F 1 "1uF" H 4442 805 50  0000 L CNN
F 2 "Capacitor_SMD:C_0603_1608Metric_Pad1.08x0.95mm_HandSolder" H 4350 850 50  0001 C CNN
F 3 "~" H 4350 850 50  0001 C CNN
	1    4350 850 
	1    0    0    -1  
$EndComp
Wire Wire Line
	4150 650  4350 650 
Wire Wire Line
	4350 950  4350 1050
Wire Wire Line
	4350 1050 4150 1050
Wire Wire Line
	4350 750  4350 650 
NoConn ~ 6000 1150
NoConn ~ 6000 2050
NoConn ~ 6000 2150
Connection ~ 3550 650 
Connection ~ 3550 1050
Connection ~ 3950 650 
Connection ~ 3950 1050
Connection ~ 4150 650 
Connection ~ 4150 1050
Wire Wire Line
	4800 1150 4700 1150
$Comp
L Mechanical:MountingHole_Pad H1
U 1 1 60BC7C29
P 4600 1150
F 0 "H1" V 4837 1153 50  0000 C CNN
F 1 "MountingHole_Pad" V 4746 1153 50  0000 C CNN
F 2 "Connector_Pin:Pin_D1.0mm_L10.0mm_LooseFit" H 4600 1150 50  0001 C CNN
F 3 "~" H 4600 1150 50  0001 C CNN
	1    4600 1150
	0    -1   -1   0   
$EndComp
Connection ~ 5400 4550
Wire Wire Line
	5500 4550 5400 4550
$Comp
L Mechanical:MountingHole_Pad H2
U 1 1 60BD58AA
P 5600 4550
F 0 "H2" V 5554 4700 50  0000 L CNN
F 1 "MountingHole_Pad" V 5645 4700 50  0000 L CNN
F 2 "Connector_Pin:Pin_D1.0mm_L10.0mm_LooseFit" H 5600 4550 50  0001 C CNN
F 3 "~" H 5600 4550 50  0001 C CNN
	1    5600 4550
	0    1    1    0   
$EndComp
$Comp
L Device:R_Small R4
U 1 1 60A1C17B
P 2850 2000
F 0 "R4" V 2654 2000 50  0000 C CNN
F 1 "22R" V 2745 2000 50  0000 C CNN
F 2 "Resistor_SMD:R_0603_1608Metric_Pad0.98x0.95mm_HandSolder" H 2850 2000 50  0001 C CNN
F 3 "~" H 2850 2000 50  0001 C CNN
	1    2850 2000
	0    1    1    0   
$EndComp
$EndSCHEMATC
