(module MX-hotswap-2U (layer F.Cu) (tedit 60A973B4)
  (fp_text reference REF** (at 0 3.175) (layer F.Fab)
    (effects (font (size 1 1) (thickness 0.15)))
  )
  (fp_text value 2U (at 0 -7.9375) (layer Dwgs.User)
    (effects (font (size 1 1) (thickness 0.15)))
  )
  (fp_line (start 2.54 5.08) (end 2.54 0) (layer B.Fab) (width 0.12))
  (fp_line (start 6.985 -3.81) (end 6.985 5.08) (layer B.SilkS) (width 0.15))
  (fp_line (start 6.35 5.08) (end 6.35 7.62) (layer B.Fab) (width 0.12))
  (fp_line (start 2.5 5.1) (end 7 5.1) (layer B.CrtYd) (width 0.12))
  (fp_line (start 0.583432 -2.430968) (end 0.583432 -6.4) (layer B.CrtYd) (width 0.12))
  (fp_line (start 1.27 -6.35) (end 1.27 -8.89) (layer B.Fab) (width 0.12))
  (fp_line (start 2.54 5.08) (end 2.54 0) (layer B.SilkS) (width 0.15))
  (fp_line (start 6.985 5.08) (end 2.54 5.08) (layer B.Fab) (width 0.12))
  (fp_line (start -5 7) (end -7 7) (layer F.SilkS) (width 0.15))
  (fp_line (start 5 7) (end 7 7) (layer F.SilkS) (width 0.15))
  (fp_line (start 0.635 -6.35) (end 0.635 -2.54) (layer B.Fab) (width 0.12))
  (fp_line (start -7 -7) (end -7 -5) (layer F.SilkS) (width 0.15))
  (fp_line (start 0.635 -2.464162) (end 0.635 -4.191) (layer B.SilkS) (width 0.15))
  (fp_line (start 7 -5) (end 7 -7) (layer F.SilkS) (width 0.15))
  (fp_line (start 0.583432 -6.4) (end 7 -6.4) (layer B.CrtYd) (width 0.12))
  (fp_line (start 6.35 7.62) (end 3.81 7.62) (layer B.Fab) (width 0.12))
  (fp_line (start 6.985 5.08) (end 6.604 5.08) (layer B.SilkS) (width 0.15))
  (fp_line (start 4.445 -6.35) (end 4.064 -6.35) (layer B.SilkS) (width 0.15))
  (fp_line (start 1.016 -6.35) (end 0.635 -6.35) (layer B.SilkS) (width 0.15))
  (fp_line (start 3.556 5.08) (end 2.54 5.08) (layer B.SilkS) (width 0.15))
  (fp_line (start 3.81 -8.89) (end 3.81 -6.35) (layer B.Fab) (width 0.12))
  (fp_line (start -5 -7) (end -7 -7) (layer F.SilkS) (width 0.15))
  (fp_line (start 0.635 -5.969) (end 0.635 -6.35) (layer B.SilkS) (width 0.15))
  (fp_line (start 0.635 -6.35) (end 4.445 -6.35) (layer B.Fab) (width 0.12))
  (fp_line (start 7 -6.4) (end 7 5.1) (layer B.CrtYd) (width 0.12))
  (fp_line (start 3.81 7.62) (end 3.81 5.08) (layer B.Fab) (width 0.12))
  (fp_line (start 7 7) (end 7 5) (layer F.SilkS) (width 0.15))
  (fp_line (start -7 7) (end -7 5) (layer F.SilkS) (width 0.15))
  (fp_line (start 7 -7) (end 5 -7) (layer F.SilkS) (width 0.15))
  (fp_line (start 6.985 -3.81) (end 6.985 5.08) (layer B.Fab) (width 0.12))
  (fp_line (start 1.27 -8.89) (end 3.81 -8.89) (layer B.Fab) (width 0.12))
  (fp_line (start 2.5 0) (end 2.5 5.1) (layer B.CrtYd) (width 0.12))
  (fp_line (start 9.525 -19.05) (end 9.525 19.05) (layer Dwgs.User) (width 0.15))
  (fp_line (start 9.525 19.05) (end -9.525 19.05) (layer Dwgs.User) (width 0.15))
  (fp_line (start -9.525 19.05) (end -9.525 -19.05) (layer Dwgs.User) (width 0.15))
  (fp_line (start -9.525 -19.05) (end 9.525 -19.05) (layer Dwgs.User) (width 0.15))
  (fp_text user REF** (at 3.175 0 90) (layer F.Fab)
    (effects (font (size 1 1) (thickness 0.15)))
  )
  (fp_arc (start 0 0) (end 2.54 0) (angle -75.96375653) (layer B.SilkS) (width 0.15))
  (fp_text user REF** (at 0 3.175) (layer F.Fab)
    (effects (font (size 1 1) (thickness 0.15)))
  )
  (fp_text user REF** (at 0 -3.175 180) (layer F.Fab)
    (effects (font (size 1 1) (thickness 0.15)))
  )
  (fp_text user REF** (at -3.175 0 270) (layer F.Fab)
    (effects (font (size 1 1) (thickness 0.15)))
  )
  (fp_arc (start 4.445 -3.81) (end 6.985 -3.81) (angle -90) (layer B.SilkS) (width 0.15))
  (fp_arc (start 0 0) (end 2.5 0) (angle -76.50426672) (layer B.CrtYd) (width 0.12))
  (fp_arc (start 0 0) (end 2.54 0) (angle -75.96375653) (layer B.Fab) (width 0.12))
  (fp_arc (start 4.445 -3.81) (end 6.985 -3.81) (angle -90) (layer B.Fab) (width 0.12))
  (fp_text user REF** (at -3.175 0 270) (layer F.Fab)
    (effects (font (size 1 1) (thickness 0.15)))
  )
  (fp_text user 2U (at 0 -7.9375) (layer Dwgs.User)
    (effects (font (size 1 1) (thickness 0.15)))
  )
  (fp_text user 2U (at 0 -7.9375) (layer Dwgs.User)
    (effects (font (size 1 1) (thickness 0.15)))
  )
  (pad "" np_thru_hole circle (at -6.985 11.938 90) (size 3.048 3.048) (drill 3.048) (layers *.Cu *.Mask))
  (pad "" np_thru_hole circle (at 8.255 -11.938 90) (size 3.9878 3.9878) (drill 3.9878) (layers *.Cu *.Mask))
  (pad "" np_thru_hole circle (at 8.255 11.938 90) (size 3.9878 3.9878) (drill 3.9878) (layers *.Cu *.Mask))
  (pad "" np_thru_hole circle (at -6.985 -11.938 90) (size 3.048 3.048) (drill 3.048) (layers *.Cu *.Mask))
  (pad 2 smd rect (at 5.08 6.29 270) (size 2.55 2.5) (layers B.Cu B.Paste B.Mask))
  (pad "" np_thru_hole circle (at 0 0 90) (size 3.9878 3.9878) (drill 3.9878) (layers *.Cu *.Mask))
  (pad "" np_thru_hole circle (at 2.54 -3.81 270) (size 3 3) (drill 3) (layers *.Cu *.Mask))
  (pad "" np_thru_hole circle (at 0 -5.08 138.0996) (size 1.75 1.75) (drill 1.75) (layers *.Cu *.Mask))
  (pad "" np_thru_hole circle (at 5.08 2.54 270) (size 3 3) (drill 3) (layers *.Cu *.Mask))
  (pad "" np_thru_hole circle (at 0 0 90) (size 3.9878 3.9878) (drill 3.9878) (layers *.Cu *.Mask))
  (pad "" np_thru_hole circle (at 0 0 270) (size 3.9878 3.9878) (drill 3.9878) (layers *.Cu *.Mask))
  (pad 1 smd rect (at 2.54 -7.56 270) (size 2.55 2.5) (layers B.Cu B.Paste B.Mask))
  (pad "" np_thru_hole circle (at 0 5.08 138.0996) (size 1.75 1.75) (drill 1.75) (layers *.Cu *.Mask))
  (pad "" np_thru_hole circle (at 0 0 90) (size 3.9878 3.9878) (drill 3.9878) (layers *.Cu *.Mask))
)
