{
  "protokoll" : {
    "pr_id" : "p01",
    "patient": {
      "name": "Max Mustermann",
      "geburtsdatum": "01.01.1970",
      "svnr": "4569"
    },
    "vitalparameter": {
      "rr": "120/80",
      "sp02": "94%"
    },
    "massnahmen": ["Herdruckmassge", "lagerung", "betreuung"],
    "anmerkungen": {}
  }
}
